lucene-dev mailing list archives

Site index · List index
Message view « Date » · « Thread »
Top « Date » · « Thread »
From Apache Hudson Server <hud...@hudson.apache.org>
Subject Build failed in Hudson: Lucene-Solr-tests-only-3.x #178
Date Sun, 17 Oct 2010 09:16:04 GMT
See <https://hudson.apache.org/hudson/job/Lucene-Solr-tests-only-3.x/178/>

------------------------------------------
[...truncated 9979 lines...]
    [junit] 	at org.apache.solr.handler.dataimport.XPathEntityProcessor$2.run(XPathEntityProcessor.java:403)
    [junit] Caused by: com.ctc.wstx.exc.WstxParsingException: Unexpected close tag </id>;
expected </node>.
    [junit]  at [row,col {unknown-source}]: [11,18]
    [junit] 	at com.ctc.wstx.sr.StreamScanner.constructWfcException(StreamScanner.java:630)
    [junit] 	at com.ctc.wstx.sr.StreamScanner.throwParseError(StreamScanner.java:461)
    [junit] 	at com.ctc.wstx.sr.BasicStreamReader.reportWrongEndElem(BasicStreamReader.java:3258)
    [junit] 	at com.ctc.wstx.sr.BasicStreamReader.readEndElem(BasicStreamReader.java:3200)
    [junit] 	at com.ctc.wstx.sr.BasicStreamReader.nextFromTree(BasicStreamReader.java:2832)
    [junit] 	at com.ctc.wstx.sr.BasicStreamReader.next(BasicStreamReader.java:1019)
    [junit] 	at org.apache.solr.handler.dataimport.XPathRecordReader$Node.parse(XPathRecordReader.java:275)
    [junit] 	at org.apache.solr.handler.dataimport.XPathRecordReader$Node.handleStartElement(XPathRecordReader.java:340)
    [junit] 	at org.apache.solr.handler.dataimport.XPathRecordReader$Node.parse(XPathRecordReader.java:304)
    [junit] 	at org.apache.solr.handler.dataimport.XPathRecordReader$Node.handleStartElement(XPathRecordReader.java:340)
    [junit] 	at org.apache.solr.handler.dataimport.XPathRecordReader$Node.parse(XPathRecordReader.java:304)
    [junit] 	at org.apache.solr.handler.dataimport.XPathRecordReader$Node.access$200(XPathRecordReader.java:196)
    [junit] 	at org.apache.solr.handler.dataimport.XPathRecordReader.streamRecords(XPathRecordReader.java:178)
    [junit] 	... 1 more
    [junit] 10 17, 10 10:15:38 AM org.apache.solr.handler.dataimport.DocBuilder buildDocument
    [junit] SEVERE: Exception while processing: node document : SolrInputDocument[{}]
    [junit] org.apache.solr.handler.dataimport.DataImportHandlerException: Parsing failed
for xml, url:test rows processed:2 last row: {id=2, desc=[test2], $forEach=/root/node} Processing
Document # 1
    [junit] 	at org.apache.solr.handler.dataimport.DataImportHandlerException.wrapAndThrow(DataImportHandlerException.java:72)
    [junit] 	at org.apache.solr.handler.dataimport.XPathEntityProcessor.initQuery(XPathEntityProcessor.java:305)
    [junit] 	at org.apache.solr.handler.dataimport.XPathEntityProcessor.fetchNextRow(XPathEntityProcessor.java:201)
    [junit] 	at org.apache.solr.handler.dataimport.XPathEntityProcessor.nextRow(XPathEntityProcessor.java:181)
    [junit] 	at org.apache.solr.handler.dataimport.EntityProcessorWrapper.nextRow(EntityProcessorWrapper.java:233)
    [junit] 	at org.apache.solr.handler.dataimport.DocBuilder.buildDocument(DocBuilder.java:579)
    [junit] 	at org.apache.solr.handler.dataimport.DocBuilder.doFullDump(DocBuilder.java:260)
    [junit] 	at org.apache.solr.handler.dataimport.DocBuilder.execute(DocBuilder.java:184)
    [junit] 	at org.apache.solr.handler.dataimport.DataImporter.doFullImport(DataImporter.java:334)
    [junit] 	at org.apache.solr.handler.dataimport.DataImporter.runCmd(DataImporter.java:392)
    [junit] 	at org.apache.solr.handler.dataimport.DataImportHandler.handleRequestBody(DataImportHandler.java:203)
    [junit] 	at org.apache.solr.handler.RequestHandlerBase.handleRequest(RequestHandlerBase.java:131)
    [junit] 	at org.apache.solr.core.SolrCore.execute(SolrCore.java:1322)
    [junit] 	at org.apache.solr.util.TestHarness.queryAndResponse(TestHarness.java:339)
    [junit] 	at org.apache.solr.util.TestHarness.query(TestHarness.java:322)
    [junit] 	at org.apache.solr.handler.dataimport.AbstractDataImportHandlerTestCase.runFullImport(AbstractDataImportHandlerTestCase.java:81)
    [junit] 	at org.apache.solr.handler.dataimport.TestErrorHandling.testAbortOnError(TestErrorHandling.java:65)
    [junit] 	at sun.reflect.NativeMethodAccessorImpl.invoke0(Native Method)
    [junit] 	at sun.reflect.NativeMethodAccessorImpl.invoke(NativeMethodAccessorImpl.java:57)
    [junit] 	at sun.reflect.DelegatingMethodAccessorImpl.invoke(DelegatingMethodAccessorImpl.java:43)
    [junit] 	at java.lang.reflect.Method.invoke(Method.java:616)
    [junit] 	at org.junit.runners.model.FrameworkMethod$1.runReflectiveCall(FrameworkMethod.java:44)
    [junit] 	at org.junit.internal.runners.model.ReflectiveCallable.run(ReflectiveCallable.java:15)
    [junit] 	at org.junit.runners.model.FrameworkMethod.invokeExplosively(FrameworkMethod.java:41)
    [junit] 	at org.junit.internal.runners.statements.InvokeMethod.evaluate(InvokeMethod.java:20)
    [junit] 	at org.junit.rules.TestWatchman$1.evaluate(TestWatchman.java:48)
    [junit] 	at org.junit.internal.runners.statements.RunBefores.evaluate(RunBefores.java:28)
    [junit] 	at org.junit.internal.runners.statements.RunAfters.evaluate(RunAfters.java:31)
    [junit] 	at org.junit.runners.BlockJUnit4ClassRunner.runChild(BlockJUnit4ClassRunner.java:76)
    [junit] 	at org.apache.lucene.util.LuceneTestCase$LuceneTestCaseRunner.runChild(LuceneTestCase.java:770)
    [junit] 	at org.apache.lucene.util.LuceneTestCase$LuceneTestCaseRunner.runChild(LuceneTestCase.java:737)
    [junit] 	at org.junit.runners.ParentRunner$3.run(ParentRunner.java:193)
    [junit] 	at org.junit.runners.ParentRunner$1.schedule(ParentRunner.java:52)
    [junit] 	at org.junit.runners.ParentRunner.runChildren(ParentRunner.java:191)
    [junit] 	at org.junit.runners.ParentRunner.access$000(ParentRunner.java:42)
    [junit] 	at org.junit.runners.ParentRunner$2.evaluate(ParentRunner.java:184)
    [junit] 	at org.junit.internal.runners.statements.RunBefores.evaluate(RunBefores.java:28)
    [junit] 	at org.junit.internal.runners.statements.RunAfters.evaluate(RunAfters.java:31)
    [junit] 	at org.junit.runners.ParentRunner.run(ParentRunner.java:236)
    [junit] 	at junit.framework.JUnit4TestAdapter.run(JUnit4TestAdapter.java:39)
    [junit] 	at org.apache.tools.ant.taskdefs.optional.junit.JUnitTestRunner.run(JUnitTestRunner.java:421)
    [junit] 	at org.apache.tools.ant.taskdefs.optional.junit.JUnitTestRunner.launch(JUnitTestRunner.java:912)
    [junit] 	at org.apache.tools.ant.taskdefs.optional.junit.JUnitTestRunner.main(JUnitTestRunner.java:743)
    [junit] Caused by: java.lang.RuntimeException: com.ctc.wstx.exc.WstxParsingException:
Unexpected close tag </id>; expected </node>.
    [junit]  at [row,col {unknown-source}]: [11,18]
    [junit] 	at org.apache.solr.handler.dataimport.XPathRecordReader.streamRecords(XPathRecordReader.java:181)
    [junit] 	at org.apache.solr.handler.dataimport.XPathEntityProcessor.initQuery(XPathEntityProcessor.java:295)
    [junit] 	... 41 more
    [junit] Caused by: com.ctc.wstx.exc.WstxParsingException: Unexpected close tag </id>;
expected </node>.
    [junit]  at [row,col {unknown-source}]: [11,18]
    [junit] 	at com.ctc.wstx.sr.StreamScanner.constructWfcException(StreamScanner.java:630)
    [junit] 	at com.ctc.wstx.sr.StreamScanner.throwParseError(StreamScanner.java:461)
    [junit] 	at com.ctc.wstx.sr.BasicStreamReader.reportWrongEndElem(BasicStreamReader.java:3258)
    [junit] 	at com.ctc.wstx.sr.BasicStreamReader.readEndElem(BasicStreamReader.java:3200)
    [junit] 	at com.ctc.wstx.sr.BasicStreamReader.nextFromTree(BasicStreamReader.java:2832)
    [junit] 	at com.ctc.wstx.sr.BasicStreamReader.next(BasicStreamReader.java:1019)
    [junit] 	at org.apache.solr.handler.dataimport.XPathRecordReader$Node.parse(XPathRecordReader.java:275)
    [junit] 	at org.apache.solr.handler.dataimport.XPathRecordReader$Node.handleStartElement(XPathRecordReader.java:340)
    [junit] 	at org.apache.solr.handler.dataimport.XPathRecordReader$Node.parse(XPathRecordReader.java:304)
    [junit] 	at org.apache.solr.handler.dataimport.XPathRecordReader$Node.handleStartElement(XPathRecordReader.java:340)
    [junit] 	at org.apache.solr.handler.dataimport.XPathRecordReader$Node.parse(XPathRecordReader.java:304)
    [junit] 	at org.apache.solr.handler.dataimport.XPathRecordReader$Node.access$200(XPathRecordReader.java:196)
    [junit] 	at org.apache.solr.handler.dataimport.XPathRecordReader.streamRecords(XPathRecordReader.java:178)
    [junit] 	... 42 more
    [junit] 10 17, 10 10:15:38 AM org.apache.solr.handler.dataimport.DataImporter doFullImport
    [junit] SEVERE: Full Import failed
    [junit] org.apache.solr.handler.dataimport.DataImportHandlerException: Parsing failed
for xml, url:test rows processed:2 last row: {id=2, desc=[test2], $forEach=/root/node} Processing
Document # 1
    [junit] 	at org.apache.solr.handler.dataimport.DataImportHandlerException.wrapAndThrow(DataImportHandlerException.java:72)
    [junit] 	at org.apache.solr.handler.dataimport.XPathEntityProcessor.initQuery(XPathEntityProcessor.java:305)
    [junit] 	at org.apache.solr.handler.dataimport.XPathEntityProcessor.fetchNextRow(XPathEntityProcessor.java:201)
    [junit] 	at org.apache.solr.handler.dataimport.XPathEntityProcessor.nextRow(XPathEntityProcessor.java:181)
    [junit] 	at org.apache.solr.handler.dataimport.EntityProcessorWrapper.nextRow(EntityProcessorWrapper.java:233)
    [junit] 	at org.apache.solr.handler.dataimport.DocBuilder.buildDocument(DocBuilder.java:579)
    [junit] 	at org.apache.solr.handler.dataimport.DocBuilder.doFullDump(DocBuilder.java:260)
    [junit] 	at org.apache.solr.handler.dataimport.DocBuilder.execute(DocBuilder.java:184)
    [junit] 	at org.apache.solr.handler.dataimport.DataImporter.doFullImport(DataImporter.java:334)
    [junit] 	at org.apache.solr.handler.dataimport.DataImporter.runCmd(DataImporter.java:392)
    [junit] 	at org.apache.solr.handler.dataimport.DataImportHandler.handleRequestBody(DataImportHandler.java:203)
    [junit] 	at org.apache.solr.handler.RequestHandlerBase.handleRequest(RequestHandlerBase.java:131)
    [junit] 	at org.apache.solr.core.SolrCore.execute(SolrCore.java:1322)
    [junit] 	at org.apache.solr.util.TestHarness.queryAndResponse(TestHarness.java:339)
    [junit] 	at org.apache.solr.util.TestHarness.query(TestHarness.java:322)
    [junit] 	at org.apache.solr.handler.dataimport.AbstractDataImportHandlerTestCase.runFullImport(AbstractDataImportHandlerTestCase.java:81)
    [junit] 	at org.apache.solr.handler.dataimport.TestErrorHandling.testAbortOnError(TestErrorHandling.java:65)
    [junit] 	at sun.reflect.NativeMethodAccessorImpl.invoke0(Native Method)
    [junit] 	at sun.reflect.NativeMethodAccessorImpl.invoke(NativeMethodAccessorImpl.java:57)
    [junit] 	at sun.reflect.DelegatingMethodAccessorImpl.invoke(DelegatingMethodAccessorImpl.java:43)
    [junit] 	at java.lang.reflect.Method.invoke(Method.java:616)
    [junit] 	at org.junit.runners.model.FrameworkMethod$1.runReflectiveCall(FrameworkMethod.java:44)
    [junit] 	at org.junit.internal.runners.model.ReflectiveCallable.run(ReflectiveCallable.java:15)
    [junit] 	at org.junit.runners.model.FrameworkMethod.invokeExplosively(FrameworkMethod.java:41)
    [junit] 	at org.junit.internal.runners.statements.InvokeMethod.evaluate(InvokeMethod.java:20)
    [junit] 	at org.junit.rules.TestWatchman$1.evaluate(TestWatchman.java:48)
    [junit] 	at org.junit.internal.runners.statements.RunBefores.evaluate(RunBefores.java:28)
    [junit] 	at org.junit.internal.runners.statements.RunAfters.evaluate(RunAfters.java:31)
    [junit] 	at org.junit.runners.BlockJUnit4ClassRunner.runChild(BlockJUnit4ClassRunner.java:76)
    [junit] 	at org.apache.lucene.util.LuceneTestCase$LuceneTestCaseRunner.runChild(LuceneTestCase.java:770)
    [junit] 	at org.apache.lucene.util.LuceneTestCase$LuceneTestCaseRunner.runChild(LuceneTestCase.java:737)
    [junit] 	at org.junit.runners.ParentRunner$3.run(ParentRunner.java:193)
    [junit] 	at org.junit.runners.ParentRunner$1.schedule(ParentRunner.java:52)
    [junit] 	at org.junit.runners.ParentRunner.runChildren(ParentRunner.java:191)
    [junit] 	at org.junit.runners.ParentRunner.access$000(ParentRunner.java:42)
    [junit] 	at org.junit.runners.ParentRunner$2.evaluate(ParentRunner.java:184)
    [junit] 	at org.junit.internal.runners.statements.RunBefores.evaluate(RunBefores.java:28)
    [junit] 	at org.junit.internal.runners.statements.RunAfters.evaluate(RunAfters.java:31)
    [junit] 	at org.junit.runners.ParentRunner.run(ParentRunner.java:236)
    [junit] 	at junit.framework.JUnit4TestAdapter.run(JUnit4TestAdapter.java:39)
    [junit] 	at org.apache.tools.ant.taskdefs.optional.junit.JUnitTestRunner.run(JUnitTestRunner.java:421)
    [junit] 	at org.apache.tools.ant.taskdefs.optional.junit.JUnitTestRunner.launch(JUnitTestRunner.java:912)
    [junit] 	at org.apache.tools.ant.taskdefs.optional.junit.JUnitTestRunner.main(JUnitTestRunner.java:743)
    [junit] Caused by: java.lang.RuntimeException: com.ctc.wstx.exc.WstxParsingException:
Unexpected close tag </id>; expected </node>.
    [junit]  at [row,col {unknown-source}]: [11,18]
    [junit] 	at org.apache.solr.handler.dataimport.XPathRecordReader.streamRecords(XPathRecordReader.java:181)
    [junit] 	at org.apache.solr.handler.dataimport.XPathEntityProcessor.initQuery(XPathEntityProcessor.java:295)
    [junit] 	... 41 more
    [junit] Caused by: com.ctc.wstx.exc.WstxParsingException: Unexpected close tag </id>;
expected </node>.
    [junit]  at [row,col {unknown-source}]: [11,18]
    [junit] 	at com.ctc.wstx.sr.StreamScanner.constructWfcException(StreamScanner.java:630)
    [junit] 	at com.ctc.wstx.sr.StreamScanner.throwParseError(StreamScanner.java:461)
    [junit] 	at com.ctc.wstx.sr.BasicStreamReader.reportWrongEndElem(BasicStreamReader.java:3258)
    [junit] 	at com.ctc.wstx.sr.BasicStreamReader.readEndElem(BasicStreamReader.java:3200)
    [junit] 	at com.ctc.wstx.sr.BasicStreamReader.nextFromTree(BasicStreamReader.java:2832)
    [junit] 	at com.ctc.wstx.sr.BasicStreamReader.next(BasicStreamReader.java:1019)
    [junit] 	at org.apache.solr.handler.dataimport.XPathRecordReader$Node.parse(XPathRecordReader.java:275)
    [junit] 	at org.apache.solr.handler.dataimport.XPathRecordReader$Node.handleStartElement(XPathRecordReader.java:340)
    [junit] 	at org.apache.solr.handler.dataimport.XPathRecordReader$Node.parse(XPathRecordReader.java:304)
    [junit] 	at org.apache.solr.handler.dataimport.XPathRecordReader$Node.handleStartElement(XPathRecordReader.java:340)
    [junit] 	at org.apache.solr.handler.dataimport.XPathRecordReader$Node.parse(XPathRecordReader.java:304)
    [junit] 	at org.apache.solr.handler.dataimport.XPathRecordReader$Node.access$200(XPathRecordReader.java:196)
    [junit] 	at org.apache.solr.handler.dataimport.XPathRecordReader.streamRecords(XPathRecordReader.java:178)
    [junit] 	... 42 more
    [junit] ------------- ---------------- ---------------
    [junit] Testsuite: org.apache.solr.handler.dataimport.TestEvaluatorBag
    [junit] Testcase: testGetDateFormatEvaluator(org.apache.solr.handler.dataimport.TestEvaluatorBag):
Caused an ERROR
    [junit] expected:<2010-10-15 1[1]:15> but was:<2010-10-15 1[2]:15>
    [junit] 	at org.apache.solr.handler.dataimport.TestEvaluatorBag.testGetDateFormatEvaluator(TestEvaluatorBag.java:126)
    [junit] 	at org.apache.lucene.util.LuceneTestCase$LuceneTestCaseRunner.runChild(LuceneTestCase.java:770)
    [junit] 	at org.apache.lucene.util.LuceneTestCase$LuceneTestCaseRunner.runChild(LuceneTestCase.java:737)
    [junit] 
    [junit] 
    [junit] Tests run: 5, Failures: 0, Errors: 1, Time elapsed: 1.819 sec
    [junit] 
    [junit] ------------- Standard Output ---------------
    [junit] NOTE: reproduce with: ant test -Dtestcase=TestEvaluatorBag -Dtestmethod=testGetDateFormatEvaluator
-Dtests.seed=2994550274593592787:-3556918359708157927 -Dtests.multiplier=3
    [junit] NOTE: test params are: locale=vi_VN, timezone=Africa/Tunis
    [junit] ------------- ---------------- ---------------
    [junit] TEST org.apache.solr.handler.dataimport.TestEvaluatorBag FAILED
    [junit] Testsuite: org.apache.solr.handler.dataimport.TestFieldReader
    [junit] Tests run: 1, Failures: 0, Errors: 0, Time elapsed: 0.021 sec
    [junit] 
    [junit] Testsuite: org.apache.solr.handler.dataimport.TestFileListEntityProcessor
    [junit] Tests run: 3, Failures: 0, Errors: 0, Time elapsed: 0.024 sec
    [junit] 
    [junit] ------------- Standard Error -----------------
    [junit] NOTE: Ignoring test method 'testNTOT': Known Locale/TZ problems: see https://issues.apache.org/jira/browse/SOLR-1916
    [junit] ------------- ---------------- ---------------
    [junit] Testsuite: org.apache.solr.handler.dataimport.TestJdbcDataSource
    [junit] Tests run: 3, Failures: 0, Errors: 0, Time elapsed: 0.166 sec
    [junit] 
    [junit] ------------- Standard Error -----------------
    [junit] NOTE: Ignoring test method 'testBasic': Needs a Mock database server to work
    [junit] ------------- ---------------- ---------------
    [junit] Testsuite: org.apache.solr.handler.dataimport.TestLineEntityProcessor
    [junit] Tests run: 4, Failures: 0, Errors: 0, Time elapsed: 0.014 sec
    [junit] 
    [junit] Testsuite: org.apache.solr.handler.dataimport.TestNumberFormatTransformer
    [junit] Tests run: 9, Failures: 0, Errors: 0, Time elapsed: 0.027 sec
    [junit] 
    [junit] Testsuite: org.apache.solr.handler.dataimport.TestPlainTextEntityProcessor
    [junit] Tests run: 1, Failures: 0, Errors: 0, Time elapsed: 0.018 sec
    [junit] 
    [junit] Testsuite: org.apache.solr.handler.dataimport.TestRegexTransformer
    [junit] Tests run: 5, Failures: 0, Errors: 0, Time elapsed: 0.015 sec
    [junit] 
    [junit] Testsuite: org.apache.solr.handler.dataimport.TestScriptTransformer
    [junit] Tests run: 4, Failures: 0, Errors: 0, Time elapsed: 0.29 sec
    [junit] 
    [junit] Testsuite: org.apache.solr.handler.dataimport.TestSqlEntityProcessor
    [junit] Tests run: 4, Failures: 0, Errors: 0, Time elapsed: 0.015 sec
    [junit] 
    [junit] Testsuite: org.apache.solr.handler.dataimport.TestSqlEntityProcessor2
    [junit] Tests run: 6, Failures: 0, Errors: 0, Time elapsed: 0.603 sec
    [junit] 
    [junit] ------------- Standard Error -----------------
    [junit] NOTE: Ignoring test method 'testLastIndexTime': Known Locale/TZ problems: see
https://issues.apache.org/jira/browse/SOLR-1916
    [junit] 17 oct. 2010 22:15:41 org.apache.solr.handler.dataimport.JdbcDataSource finalize
    [junit] GRAVE: JdbcDataSource was not closed prior to finalize(), indicates a bug -- POSSIBLE
RESOURCE LEAK!!!
    [junit] 17 oct. 2010 22:15:41 org.apache.solr.handler.dataimport.JdbcDataSource finalize
    [junit] GRAVE: JdbcDataSource was not closed prior to finalize(), indicates a bug -- POSSIBLE
RESOURCE LEAK!!!
    [junit] 17 oct. 2010 22:15:41 org.apache.solr.handler.dataimport.JdbcDataSource finalize
    [junit] GRAVE: JdbcDataSource was not closed prior to finalize(), indicates a bug -- POSSIBLE
RESOURCE LEAK!!!
    [junit] ------------- ---------------- ---------------
    [junit] Testsuite: org.apache.solr.handler.dataimport.TestSqlEntityProcessorDelta
    [junit] Tests run: 8, Failures: 0, Errors: 0, Time elapsed: 1.051 sec
    [junit] 
    [junit] Testsuite: org.apache.solr.handler.dataimport.TestSqlEntityProcessorDelta2
    [junit] Tests run: 8, Failures: 0, Errors: 0, Time elapsed: 1.167 sec
    [junit] 
    [junit] Testsuite: org.apache.solr.handler.dataimport.TestTemplateString
    [junit] Tests run: 1, Failures: 0, Errors: 0, Time elapsed: 0.007 sec
    [junit] 
    [junit] Testsuite: org.apache.solr.handler.dataimport.TestTemplateTransformer
    [junit] Tests run: 1, Failures: 0, Errors: 0, Time elapsed: 0.007 sec
    [junit] 
    [junit] Testsuite: org.apache.solr.handler.dataimport.TestThreaded
    [junit] Tests run: 1, Failures: 0, Errors: 0, Time elapsed: 0.321 sec
    [junit] 
    [junit] Testsuite: org.apache.solr.handler.dataimport.TestURLDataSource
    [junit] Tests run: 1, Failures: 0, Errors: 0, Time elapsed: 0.007 sec
    [junit] 
    [junit] Testsuite: org.apache.solr.handler.dataimport.TestVariableResolver
    [junit] Tests run: 9, Failures: 0, Errors: 0, Time elapsed: 0.02 sec
    [junit] 
    [junit] Testsuite: org.apache.solr.handler.dataimport.TestXPathEntityProcessor
    [junit] Tests run: 8, Failures: 0, Errors: 0, Time elapsed: 0.498 sec
    [junit] 
    [junit] Testsuite: org.apache.solr.handler.dataimport.TestXPathRecordReader
    [junit] Tests run: 21, Failures: 0, Errors: 0, Time elapsed: 0.042 sec
    [junit] 
    [junit] Tests FAILED

BUILD FAILED
/usr<https://hudson.apache.org/hudson/job/Lucene-Solr-tests-only-3.x/ws/checkout/build.xml>:27:
The following error occurred while executing this line:
/usr<https://hudson.apache.org/hudson/job/Lucene-Solr-tests-only-3.x/ws/checkout/solr/common-build.xml>:460:
The following error occurred while executing this line:
/usr<https://hudson.apache.org/hudson/job/Lucene-Solr-tests-only-3.x/ws/checkout/solr/common-build.xml>:317:
The following error occurred while executing this line:
/usr<https://hudson.apache.org/hudson/job/Lucene-Solr-tests-only-3.x/ws/checkout/solr/contrib/dataimporthandler/build.xml>:171:
Tests failed!

Total time: 5 minutes 41 seconds
Recording test results


---------------------------------------------------------------------
To unsubscribe, e-mail: dev-unsubscribe@lucene.apache.org
For additional commands, e-mail: dev-help@lucene.apache.org


Mime
View raw message