lucene-dev mailing list archives

Site index · List index
Message view « Date » · « Thread »
Top « Date » · « Thread »
From Apache Hudson Server <hud...@hudson.apache.org>
Subject Build failed in Hudson: Lucene-Solr-tests-only-3.x #70
Date Thu, 14 Oct 2010 20:15:45 GMT
See <https://hudson.apache.org/hudson/job/Lucene-Solr-tests-only-3.x/70/>

------------------------------------------
[...truncated 8918 lines...]
    [junit] 
    [junit] Testsuite: org.apache.solr.core.TestLegacyMergeSchedulerPolicyConfig
    [junit] Tests run: 1, Failures: 0, Errors: 0, Time elapsed: 1.108 sec
    [junit] 
    [junit] Testsuite: org.apache.solr.search.function.SortByFunctionTest
    [junit] Tests run: 1, Failures: 0, Errors: 0, Time elapsed: 1.595 sec
    [junit] 
    [junit] Testsuite: org.apache.solr.core.TestQuerySenderListener
    [junit] Tests run: 2, Failures: 0, Errors: 0, Time elapsed: 1.208 sec
    [junit] 
    [junit] ------------- Standard Error -----------------
    [junit] 14/10/2010 05:14:17 PM org.apache.solr.update.SolrIndexWriter finalize
    [junit] GRAVE: SolrIndexWriter was not closed prior to finalize(), indicates a bug --
POSSIBLE RESOURCE LEAK!!!
    [junit] ------------- ---------------- ---------------
    [junit] Testsuite: org.apache.solr.handler.component.SpellCheckComponentTest
    [junit] Tests run: 10, Failures: 0, Errors: 0, Time elapsed: 2.643 sec
    [junit] 
    [junit] Testsuite: org.apache.solr.servlet.SolrRequestParserTest
    [junit] Tests run: 4, Failures: 0, Errors: 0, Time elapsed: 1.414 sec
    [junit] 
    [junit] Testsuite: org.apache.solr.highlight.HighlighterTest
    [junit] Tests run: 23, Failures: 0, Errors: 0, Time elapsed: 4.945 sec
    [junit] 
    [junit] Testsuite: org.apache.solr.handler.SpellCheckerRequestHandlerTest
    [junit] Tests run: 5, Failures: 0, Errors: 0, Time elapsed: 2.333 sec
    [junit] 
    [junit] Testsuite: org.apache.solr.update.DirectUpdateHandlerOptimizeTest
    [junit] Tests run: 1, Failures: 0, Errors: 0, Time elapsed: 1.489 sec
    [junit] 
    [junit] Testsuite: org.apache.solr.util.TestUtils
    [junit] Tests run: 3, Failures: 0, Errors: 0, Time elapsed: 0.011 sec
    [junit] 
    [junit] Testsuite: org.apache.solr.handler.XmlUpdateRequestHandlerTest
    [junit] Tests run: 1, Failures: 0, Errors: 0, Time elapsed: 1.002 sec
    [junit] 
    [junit] Testsuite: org.apache.solr.request.SimpleFacetsTest
    [junit] Tests run: 7, Failures: 0, Errors: 0, Time elapsed: 5.197 sec
    [junit] 
    [junit] Testsuite: org.apache.solr.schema.BadIndexSchemaTest
    [junit] Tests run: 1, Failures: 0, Errors: 0, Time elapsed: 0.429 sec
    [junit] 
    [junit] Testsuite: org.apache.solr.request.TestFaceting
    [junit] Tests run: 3, Failures: 0, Errors: 0, Time elapsed: 8.256 sec
    [junit] 
    [junit] Testsuite: org.apache.solr.schema.IndexSchemaTest
    [junit] Tests run: 5, Failures: 0, Errors: 0, Time elapsed: 1.19 sec
    [junit] 
    [junit] Testsuite: org.apache.solr.schema.UUIDFieldTest
    [junit] Tests run: 1, Failures: 0, Errors: 0, Time elapsed: 0.013 sec
    [junit] 
    [junit] Testsuite: org.apache.solr.search.SpatialFilterTest
    [junit] Tests run: 3, Failures: 0, Errors: 0, Time elapsed: 2.529 sec
    [junit] 
    [junit] Testsuite: org.apache.solr.search.TestQueryUtils
    [junit] Tests run: 1, Failures: 0, Errors: 0, Time elapsed: 1.821 sec
    [junit] 
    [junit] Testsuite: org.apache.solr.spelling.suggest.SuggesterTest
    [junit] Tests run: 2, Failures: 0, Errors: 0, Time elapsed: 0.42 sec
    [junit] 
    [junit] Testsuite: org.apache.solr.search.TestSort
    [junit] Tests run: 1, Failures: 0, Errors: 0, Time elapsed: 3.381 sec
    [junit] 
    [junit] Testsuite: org.apache.solr.update.processor.UpdateRequestProcessorFactoryTest
    [junit] Tests run: 1, Failures: 0, Errors: 0, Time elapsed: 1.274 sec
    [junit] 
    [junit] Testsuite: org.apache.solr.handler.component.DistributedSpellCheckComponentTest
    [junit] Tests run: 1, Failures: 0, Errors: 0, Time elapsed: 15.663 sec
    [junit] 
    [junit] Testsuite: org.apache.solr.util.TestNumberUtils
    [junit] Tests run: 1, Failures: 0, Errors: 0, Time elapsed: 0.649 sec
    [junit] 
    [junit] Testsuite: org.apache.solr.schema.NotRequiredUniqueKeyTest
    [junit] Tests run: 1, Failures: 0, Errors: 0, Time elapsed: 0.244 sec
    [junit] 
    [junit] ------------- Standard Error -----------------
    [junit] 14/Out/2010 17:14:32 org.apache.solr.schema.IndexSchema readSchema
    [junit] SEVERE: uniqueKey should not be multivalued
    [junit] ------------- ---------------- ---------------
    [junit] Testsuite: org.apache.solr.search.function.distance.DistanceFunctionTest
    [junit] Tests run: 2, Failures: 0, Errors: 0, Time elapsed: 1.114 sec
    [junit] 
    [junit] Testsuite: org.apache.solr.TestDistributedSearch
    [junit] Tests run: 1, Failures: 0, Errors: 0, Time elapsed: 40.435 sec
    [junit] 
    [junit] Testsuite: org.apache.solr.servlet.DirectSolrConnectionTest
    [junit] Tests run: 2, Failures: 0, Errors: 0, Time elapsed: 0.451 sec
    [junit] 
    [junit] ------------- Standard Error -----------------
    [junit] 14.10.2010 13:14: org.apache.solr.schema.IndexSchema readSchema
    [junit] SEVERE: uniqueKey should not be multivalued
    [junit] 14.10.2010 13:14: org.apache.solr.schema.IndexSchema readSchema
    [junit] SEVERE: uniqueKey should not be multivalued
    [junit] ------------- ---------------- ---------------
    [junit] Testsuite: org.apache.solr.analysis.TestFinnishLightStemFilterFactory
    [junit] Tests run: 1, Failures: 0, Errors: 0, Time elapsed: 0.039 sec
    [junit] 
    [junit] Testsuite: org.apache.solr.search.TestQueryTypes
    [junit] Tests run: 1, Failures: 0, Errors: 0, Time elapsed: 0.805 sec
    [junit] 
    [junit] Testsuite: org.apache.solr.analysis.TestHyphenationCompoundWordTokenFilterFactory
    [junit] Tests run: 2, Failures: 0, Errors: 0, Time elapsed: 0.249 sec
    [junit] 
    [junit] Testsuite: org.apache.solr.analysis.TestMappingCharFilterFactory
    [junit] Tests run: 1, Failures: 0, Errors: 0, Time elapsed: 0.034 sec
    [junit] 
    [junit] Testsuite: org.apache.solr.analysis.TestPatternReplaceFilter
    [junit] Tests run: 5, Failures: 0, Errors: 0, Time elapsed: 0.018 sec
    [junit] 
    [junit] Testsuite: org.apache.solr.analysis.TestPhoneticFilter
    [junit] Tests run: 2, Failures: 0, Errors: 0, Time elapsed: 0.031 sec
    [junit] 
    [junit] Testsuite: org.apache.solr.analysis.TestReverseStringFilterFactory
    [junit] Tests run: 1, Failures: 0, Errors: 0, Time elapsed: 0.01 sec
    [junit] 
    [junit] Testsuite: org.apache.solr.analysis.TestRussianFilters
    [junit] Tests run: 3, Failures: 0, Errors: 0, Time elapsed: 0.038 sec
    [junit] 
    [junit] Testsuite: org.apache.solr.analysis.TestStemmerOverrideFilterFactory
    [junit] Tests run: 2, Failures: 0, Errors: 0, Time elapsed: 0.015 sec
    [junit] 
    [junit] Testsuite: org.apache.solr.handler.component.DistributedTermsComponentTest
    [junit] Tests run: 1, Failures: 0, Errors: 0, Time elapsed: 12.808 sec
    [junit] 
    [junit] Testsuite: org.apache.solr.highlight.HighlighterConfigTest
    [junit] Tests run: 1, Failures: 0, Errors: 0, Time elapsed: 0.469 sec
    [junit] 
    [junit] Testsuite: org.apache.solr.analysis.TestWordDelimiterFilter
    [junit] Tests run: 15, Failures: 0, Errors: 0, Time elapsed: 1.369 sec
    [junit] 
    [junit] Testsuite: org.apache.solr.response.TestCSVResponseWriter
    [junit] Tests run: 1, Failures: 0, Errors: 0, Time elapsed: 0.538 sec
    [junit] 
    [junit] Testsuite: org.apache.solr.search.function.TestFunctionQuery
    [junit] Tests run: 7, Failures: 0, Errors: 0, Time elapsed: 2.161 sec
    [junit] 
    [junit] Testsuite: org.apache.solr.schema.CopyFieldTest
    [junit] Tests run: 6, Failures: 0, Errors: 0, Time elapsed: 0.45 sec
    [junit] 
    [junit] Testsuite: org.apache.solr.client.solrj.TestBatchUpdate
    [junit] Tests run: 3, Failures: 0, Errors: 0, Time elapsed: 1.169 sec
    [junit] 
    [junit] Testsuite: org.apache.solr.client.solrj.beans.TestDocumentObjectBinder
    [junit] Tests run: 4, Failures: 0, Errors: 0, Time elapsed: 0.032 sec
    [junit] 
    [junit] Testsuite: org.apache.solr.search.QueryParsingTest
    [junit] Tests run: 2, Failures: 0, Errors: 0, Time elapsed: 0.49 sec
    [junit] 
    [junit] Testsuite: org.apache.solr.servlet.CacheHeaderTest
    [junit] Tests run: 5, Failures: 0, Errors: 0, Time elapsed: 0.864 sec
    [junit] 
    [junit] Testsuite: org.apache.solr.client.solrj.embedded.MergeIndexesEmbeddedTest
    [junit] Tests run: 1, Failures: 0, Errors: 0, Time elapsed: 0.393 sec
    [junit] 
    [junit] Testsuite: org.apache.solr.common.util.IteratorChainTest
    [junit] Tests run: 7, Failures: 0, Errors: 0, Time elapsed: 0.012 sec
    [junit] 
    [junit] Testsuite: org.apache.solr.common.util.TestFastInputStream
    [junit] Tests run: 1, Failures: 0, Errors: 0, Time elapsed: 0.006 sec
    [junit] 
    [junit] Testsuite: org.apache.solr.core.RAMDirectoryFactoryTest
    [junit] Tests run: 2, Failures: 0, Errors: 0, Time elapsed: 0.006 sec
    [junit] 
    [junit] Testsuite: org.apache.solr.core.SOLR749Test
    [junit] Tests run: 1, Failures: 0, Errors: 0, Time elapsed: 0.519 sec
    [junit] 
    [junit] Testsuite: org.apache.solr.update.AutoCommitTest
    [junit] Tests run: 1, Failures: 0, Errors: 0, Time elapsed: 4.472 sec
    [junit] 
    [junit] Testsuite: org.apache.solr.update.TestIndexingPerformance
    [junit] Tests run: 1, Failures: 0, Errors: 0, Time elapsed: 1.125 sec
    [junit] 
    [junit] ------------- Standard Output ---------------
    [junit] includeDoc=true doc=[text, simple, text, test, text, how now brown cow, text,
what's that?, text, radical!, text, what's all this about, anyway?, text, just how fast is
this text indexing?]
    [junit] iter=1000 time=336 throughput=2976
    [junit] ------------- ---------------- ---------------
    [junit] Testsuite: org.apache.solr.util.PrimUtilsTest
    [junit] Tests run: 1, Failures: 0, Errors: 0, Time elapsed: 0.009 sec
    [junit] 
    [junit] Testsuite: org.apache.solr.util.ArraysUtilsTest
    [junit] Tests run: 1, Failures: 0, Errors: 0, Time elapsed: 0.008 sec
    [junit] 
    [junit] Testsuite: org.apache.solr.velocity.VelocityResponseWriterTest
    [junit] Tests run: 1, Failures: 0, Errors: 0, Time elapsed: 0.861 sec
    [junit] 
    [junit] Testsuite: org.apache.solr.core.TestJmxIntegration
    [junit] Tests run: 2, Failures: 0, Errors: 0, Time elapsed: 1.524 sec
    [junit] 
    [junit] Testsuite: org.apache.solr.search.TestRangeQuery
    [junit] Tests run: 2, Failures: 0, Errors: 0, Time elapsed: 17.584 sec
    [junit] 
    [junit] Testsuite: org.apache.solr.spelling.IndexBasedSpellCheckerTest
    [junit] Tests run: 5, Failures: 0, Errors: 0, Time elapsed: 0.53 sec
    [junit] 
    [junit] Testsuite: org.apache.solr.update.DocumentBuilderTest
    [junit] Tests run: 3, Failures: 0, Errors: 0, Time elapsed: 0.386 sec
    [junit] 
    [junit] Tests FAILED
    [junit] Testsuite: org.apache.solr.handler.TestReplicationHandler
    [junit] Tests run: 7, Failures: 0, Errors: 0, Time elapsed: 23.275 sec
    [junit] 
    [junit] ------------- Standard Error -----------------
    [junit] 14.10.2010 11:15:02 org.apache.solr.handler.SnapPuller fetchLatestIndex
    [junit] SEVERE: Master at: http://localhost:31480/solr/replication is not available. Index
fetch failed. Exception: The host did not accept the connection within timeout of 5000 ms
    [junit] ------------- ---------------- ---------------
    [junit] Testsuite: org.apache.solr.handler.component.StatsComponentTest
    [junit] Tests run: 1, Failures: 0, Errors: 0, Time elapsed: 2.335 sec
    [junit] 
    [junit] Testsuite: org.apache.solr.request.JSONWriterTest
    [junit] Tests run: 3, Failures: 0, Errors: 0, Time elapsed: 0.57 sec
    [junit] 
    [junit] Testsuite: org.apache.solr.schema.DateFieldTest
    [junit] Tests run: 6, Failures: 0, Errors: 0, Time elapsed: 0.016 sec
    [junit] 
    [junit] Testsuite: org.apache.solr.search.FunctionQParserTest
    [junit] Tests run: 1, Failures: 0, Errors: 0, Time elapsed: 0.187 sec
    [junit] 
    [junit] Testsuite: org.apache.solr.search.TestSolrQueryParser
    [junit] Tests run: 1, Failures: 0, Errors: 0, Time elapsed: 0.451 sec
    [junit] 
    [junit] Testsuite: org.apache.solr.spelling.FileBasedSpellCheckerTest
    [junit] Tests run: 3, Failures: 0, Errors: 0, Time elapsed: 0.486 sec
    [junit] 
    [junit] ------------- Standard Error -----------------
    [junit] 2010-10-14 15.15.06 org.apache.solr.handler.SnapPuller fetchLatestIndex
    [junit] SEVERE: Master at: http://localhost:31497/solr/replication is not available. Index
fetch failed. Exception: The host did not accept the connection within timeout of 5000 ms
    [junit] ------------- ---------------- ---------------
    [junit] Testsuite: org.apache.solr.update.DirectUpdateHandlerTest
    [junit] Tests run: 7, Failures: 0, Errors: 0, Time elapsed: 1.507 sec
    [junit] 
    [junit] ------------- Standard Error -----------------
    [junit] 15/10/2010 07:15:07 ? org.apache.solr.handler.SnapPuller fetchLatestIndex
    [junit] SEVERE: Master at: http://localhost:31480/solr/replication is not available. Index
fetch failed. Exception: The host did not accept the connection within timeout of 5000 ms
    [junit] ------------- ---------------- ---------------
    [junit] Testsuite: org.apache.solr.util.TestOpenBitSet
    [junit] Tests run: 3, Failures: 0, Errors: 0, Time elapsed: 0.386 sec
    [junit] 

BUILD FAILED
/usr<https://hudson.apache.org/hudson/job/Lucene-Solr-tests-only-3.x/ws/checkout/build.xml>:27:
The following error occurred while executing this line:
/usr<https://hudson.apache.org/hudson/job/Lucene-Solr-tests-only-3.x/ws/checkout/solr/build.xml>:386:

The following error occurred while executing this line:
/usr<https://hudson.apache.org/hudson/job/Lucene-Solr-tests-only-3.x/ws/checkout/solr/build.xml>:481:
Tests failed!
The following error occurred while executing this line:
/usr<https://hudson.apache.org/hudson/job/Lucene-Solr-tests-only-3.x/ws/checkout/solr/build.xml>:481:
Tests failed!
The following error occurred while executing this line:
/usr<https://hudson.apache.org/hudson/job/Lucene-Solr-tests-only-3.x/ws/checkout/solr/build.xml>:481:
Tests failed!

Total time: 5 minutes 41 seconds
Recording test results


---------------------------------------------------------------------
To unsubscribe, e-mail: dev-unsubscribe@lucene.apache.org
For additional commands, e-mail: dev-help@lucene.apache.org


Mime
View raw message