lucene-dev mailing list archives

Site index · List index
Message view « Date » · « Thread »
Top « Date » · « Thread »
From "Robert Muir (JIRA)" <j...@apache.org>
Subject [jira] Commented: (SOLR-2160) TestTrie test failure
Date Fri, 15 Oct 2010 12:58:32 GMT

    [ https://issues.apache.org/jira/browse/SOLR-2160?page=com.atlassian.jira.plugin.system.issuetabpanels:comment-tabpanel&focusedCommentId=12921334#action_12921334
] 

Robert Muir commented on SOLR-2160:
-----------------------------------

{quote}
Must be meddling from another test
Is there a way to find out what test(s) run before any given test in the same JVM?
{quote}

At the moment, its very hackish. The way i hack around it is by looking in build/test-results/temp
There you see unique temp folders for each jvm (0, 1, 2, 3, etc).
And if you disable Solr's deletion of its temp folders in AbstractSolrTestCase/SolrTestCaseJ4
(the recursiveDelete),
then you have a log of all tests that ran in that jvm, sorta.

I think we really need to improve the build system to somehow provide this information easier
when a test fails.
Otherwise its extremely difficult to debug an issue like this.

> TestTrie test failure
> ---------------------
>
>                 Key: SOLR-2160
>                 URL: https://issues.apache.org/jira/browse/SOLR-2160
>             Project: Solr
>          Issue Type: Bug
>          Components: Build
>    Affects Versions: 3.1, 4.0
>         Environment: Hudson
>            Reporter: Robert Muir
>             Fix For: 3.1, 4.0
>
>
> Several test methods in TestTrie failed in hudson, with errors such as this:
> Caused by: org.apache.solr.common.SolrException: Unknown query type 'func'
> Here is the stacktrace:
> {noformat}
>    [junit] Testsuite: org.apache.solr.TestTrie
>     [junit] Testcase: testTrieIntRangeSearch(org.apache.solr.TestTrie):	Caused an ERROR
>     [junit] Exception during query
>     [junit] java.lang.RuntimeException: Exception during query
>     [junit] 	at org.apache.solr.SolrTestCaseJ4.assertQ(SolrTestCaseJ4.java:339)
>     [junit] 	at org.apache.solr.TestTrie.testTrieIntRangeSearch(TestTrie.java:76)
>     [junit] 	at org.apache.lucene.util.LuceneTestCase$LuceneTestCaseRunner.runChild(LuceneTestCase.java:795)
>     [junit] 	at org.apache.lucene.util.LuceneTestCase$LuceneTestCaseRunner.runChild(LuceneTestCase.java:768)
>     [junit] Caused by: org.apache.solr.common.SolrException: Unknown query type 'func'
>     [junit] 	at org.apache.solr.core.SolrCore.getQueryPlugin(SolrCore.java:1474)
>     [junit] 	at org.apache.solr.search.QParser.getParser(QParser.java:286)
>     [junit] 	at org.apache.solr.search.QParser.subQuery(QParser.java:176)
>     [junit] 	at org.apache.solr.search.SolrQueryParser.getFieldQuery(SolrQueryParser.java:142)
>     [junit] 	at org.apache.lucene.queryParser.QueryParser.getFieldQuery(QueryParser.java:754)
>     [junit] 	at org.apache.lucene.queryParser.QueryParser.Term(QueryParser.java:1594)
>     [junit] 	at org.apache.lucene.queryParser.QueryParser.Clause(QueryParser.java:1337)
>     [junit] 	at org.apache.lucene.queryParser.QueryParser.Query(QueryParser.java:1263)
>     [junit] 	at org.apache.lucene.queryParser.QueryParser.TopLevelQuery(QueryParser.java:1252)
>     [junit] 	at org.apache.lucene.queryParser.QueryParser.parse(QueryParser.java:208)
>     [junit] 	at org.apache.solr.search.LuceneQParser.parse(LuceneQParserPlugin.java:73)
>     [junit] 	at org.apache.solr.search.QParser.getQuery(QParser.java:142)
>     [junit] 	at org.apache.solr.handler.component.QueryComponent.prepare(QueryComponent.java:93)
>     [junit] 	at org.apache.solr.handler.component.SearchHandler.handleRequestBody(SearchHandler.java:210)
>     [junit] 	at org.apache.solr.handler.RequestHandlerBase.handleRequest(RequestHandlerBase.java:131)
>     [junit] 	at org.apache.solr.core.SolrCore.execute(SolrCore.java:1325)
>     [junit] 	at org.apache.solr.util.TestHarness.queryAndResponse(TestHarness.java:334)
>     [junit] 	at org.apache.solr.util.TestHarness.query(TestHarness.java:321)
>     [junit] 	at org.apache.solr.util.TestHarness.query(TestHarness.java:307)
>     [junit] 	at org.apache.solr.SolrTestCaseJ4.assertQ(SolrTestCaseJ4.java:317)
>     [junit] 
>     [junit] 
>     [junit] Testcase: testTrieFloatRangeSearch(org.apache.solr.TestTrie):	Caused an ERROR
>     [junit] Exception during query
>     [junit] java.lang.RuntimeException: Exception during query
>     [junit] 	at org.apache.solr.SolrTestCaseJ4.assertQ(SolrTestCaseJ4.java:339)
>     [junit] 	at org.apache.solr.TestTrie.testTrieFloatRangeSearch(TestTrie.java:119)
>     [junit] 	at org.apache.lucene.util.LuceneTestCase$LuceneTestCaseRunner.runChild(LuceneTestCase.java:795)
>     [junit] 	at org.apache.lucene.util.LuceneTestCase$LuceneTestCaseRunner.runChild(LuceneTestCase.java:768)
>     [junit] Caused by: org.apache.solr.common.SolrException: Unknown query type 'func'
>     [junit] 	at org.apache.solr.core.SolrCore.getQueryPlugin(SolrCore.java:1474)
>     [junit] 	at org.apache.solr.search.QParser.getParser(QParser.java:286)
>     [junit] 	at org.apache.solr.search.QParser.subQuery(QParser.java:176)
>     [junit] 	at org.apache.solr.search.SolrQueryParser.getFieldQuery(SolrQueryParser.java:142)
>     [junit] 	at org.apache.lucene.queryParser.QueryParser.getFieldQuery(QueryParser.java:754)
>     [junit] 	at org.apache.lucene.queryParser.QueryParser.Term(QueryParser.java:1594)
>     [junit] 	at org.apache.lucene.queryParser.QueryParser.Clause(QueryParser.java:1337)
>     [junit] 	at org.apache.lucene.queryParser.QueryParser.Query(QueryParser.java:1263)
>     [junit] 	at org.apache.lucene.queryParser.QueryParser.TopLevelQuery(QueryParser.java:1252)
>     [junit] 	at org.apache.lucene.queryParser.QueryParser.parse(QueryParser.java:208)
>     [junit] 	at org.apache.solr.search.LuceneQParser.parse(LuceneQParserPlugin.java:73)
>     [junit] 	at org.apache.solr.search.QParser.getQuery(QParser.java:142)
>     [junit] 	at org.apache.solr.handler.component.QueryComponent.prepare(QueryComponent.java:93)
>     [junit] 	at org.apache.solr.handler.component.SearchHandler.handleRequestBody(SearchHandler.java:210)
>     [junit] 	at org.apache.solr.handler.RequestHandlerBase.handleRequest(RequestHandlerBase.java:131)
>     [junit] 	at org.apache.solr.core.SolrCore.execute(SolrCore.java:1325)
>     [junit] 	at org.apache.solr.util.TestHarness.queryAndResponse(TestHarness.java:334)
>     [junit] 	at org.apache.solr.util.TestHarness.query(TestHarness.java:321)
>     [junit] 	at org.apache.solr.util.TestHarness.query(TestHarness.java:307)
>     [junit] 	at org.apache.solr.SolrTestCaseJ4.assertQ(SolrTestCaseJ4.java:317)
>     [junit] 
>     [junit] 
>     [junit] Testcase: testTrieLongRangeSearch(org.apache.solr.TestTrie):	Caused an ERROR
>     [junit] Exception during query
>     [junit] java.lang.RuntimeException: Exception during query
>     [junit] 	at org.apache.solr.SolrTestCaseJ4.assertQ(SolrTestCaseJ4.java:339)
>     [junit] 	at org.apache.solr.TestTrie.testTrieLongRangeSearch(TestTrie.java:138)
>     [junit] 	at org.apache.lucene.util.LuceneTestCase$LuceneTestCaseRunner.runChild(LuceneTestCase.java:795)
>     [junit] 	at org.apache.lucene.util.LuceneTestCase$LuceneTestCaseRunner.runChild(LuceneTestCase.java:768)
>     [junit] Caused by: org.apache.solr.common.SolrException: Unknown query type 'func'
>     [junit] 	at org.apache.solr.core.SolrCore.getQueryPlugin(SolrCore.java:1474)
>     [junit] 	at org.apache.solr.search.QParser.getParser(QParser.java:286)
>     [junit] 	at org.apache.solr.search.QParser.subQuery(QParser.java:176)
>     [junit] 	at org.apache.solr.search.SolrQueryParser.getFieldQuery(SolrQueryParser.java:142)
>     [junit] 	at org.apache.lucene.queryParser.QueryParser.getFieldQuery(QueryParser.java:754)
>     [junit] 	at org.apache.lucene.queryParser.QueryParser.Term(QueryParser.java:1594)
>     [junit] 	at org.apache.lucene.queryParser.QueryParser.Clause(QueryParser.java:1337)
>     [junit] 	at org.apache.lucene.queryParser.QueryParser.Query(QueryParser.java:1263)
>     [junit] 	at org.apache.lucene.queryParser.QueryParser.TopLevelQuery(QueryParser.java:1252)
>     [junit] 	at org.apache.lucene.queryParser.QueryParser.parse(QueryParser.java:208)
>     [junit] 	at org.apache.solr.search.LuceneQParser.parse(LuceneQParserPlugin.java:73)
>     [junit] 	at org.apache.solr.search.QParser.getQuery(QParser.java:142)
>     [junit] 	at org.apache.solr.handler.component.QueryComponent.prepare(QueryComponent.java:93)
>     [junit] 	at org.apache.solr.handler.component.SearchHandler.handleRequestBody(SearchHandler.java:210)
>     [junit] 	at org.apache.solr.handler.RequestHandlerBase.handleRequest(RequestHandlerBase.java:131)
>     [junit] 	at org.apache.solr.core.SolrCore.execute(SolrCore.java:1325)
>     [junit] 	at org.apache.solr.util.TestHarness.queryAndResponse(TestHarness.java:334)
>     [junit] 	at org.apache.solr.util.TestHarness.query(TestHarness.java:321)
>     [junit] 	at org.apache.solr.util.TestHarness.query(TestHarness.java:307)
>     [junit] 	at org.apache.solr.SolrTestCaseJ4.assertQ(SolrTestCaseJ4.java:317)
>     [junit] 
>     [junit] 
>     [junit] Testcase: testTrieDoubleRangeSearch(org.apache.solr.TestTrie):	Caused an
ERROR
>     [junit] Exception during query
>     [junit] java.lang.RuntimeException: Exception during query
>     [junit] 	at org.apache.solr.SolrTestCaseJ4.assertQ(SolrTestCaseJ4.java:339)
>     [junit] 	at org.apache.solr.TestTrie.testTrieDoubleRangeSearch(TestTrie.java:156)
>     [junit] 	at org.apache.lucene.util.LuceneTestCase$LuceneTestCaseRunner.runChild(LuceneTestCase.java:795)
>     [junit] 	at org.apache.lucene.util.LuceneTestCase$LuceneTestCaseRunner.runChild(LuceneTestCase.java:768)
>     [junit] Caused by: org.apache.solr.common.SolrException: Unknown query type 'func'
>     [junit] 	at org.apache.solr.core.SolrCore.getQueryPlugin(SolrCore.java:1474)
>     [junit] 	at org.apache.solr.search.QParser.getParser(QParser.java:286)
>     [junit] 	at org.apache.solr.search.QParser.subQuery(QParser.java:176)
>     [junit] 	at org.apache.solr.search.SolrQueryParser.getFieldQuery(SolrQueryParser.java:142)
>     [junit] 	at org.apache.lucene.queryParser.QueryParser.getFieldQuery(QueryParser.java:754)
>     [junit] 	at org.apache.lucene.queryParser.QueryParser.Term(QueryParser.java:1594)
>     [junit] 	at org.apache.lucene.queryParser.QueryParser.Clause(QueryParser.java:1337)
>     [junit] 	at org.apache.lucene.queryParser.QueryParser.Query(QueryParser.java:1263)
>     [junit] 	at org.apache.lucene.queryParser.QueryParser.TopLevelQuery(QueryParser.java:1252)
>     [junit] 	at org.apache.lucene.queryParser.QueryParser.parse(QueryParser.java:208)
>     [junit] 	at org.apache.solr.search.LuceneQParser.parse(LuceneQParserPlugin.java:73)
>     [junit] 	at org.apache.solr.search.QParser.getQuery(QParser.java:142)
>     [junit] 	at org.apache.solr.handler.component.QueryComponent.prepare(QueryComponent.java:93)
>     [junit] 	at org.apache.solr.handler.component.SearchHandler.handleRequestBody(SearchHandler.java:210)
>     [junit] 	at org.apache.solr.handler.RequestHandlerBase.handleRequest(RequestHandlerBase.java:131)
>     [junit] 	at org.apache.solr.core.SolrCore.execute(SolrCore.java:1325)
>     [junit] 	at org.apache.solr.util.TestHarness.queryAndResponse(TestHarness.java:334)
>     [junit] 	at org.apache.solr.util.TestHarness.query(TestHarness.java:321)
>     [junit] 	at org.apache.solr.util.TestHarness.query(TestHarness.java:307)
>     [junit] 	at org.apache.solr.SolrTestCaseJ4.assertQ(SolrTestCaseJ4.java:317)
>     [junit] 
>     [junit] 
>     [junit] Testcase: testTrieDateRangeSearch(org.apache.solr.TestTrie):	Caused an ERROR
>     [junit] Exception during query
>     [junit] java.lang.RuntimeException: Exception during query
>     [junit] 	at org.apache.solr.SolrTestCaseJ4.assertQ(SolrTestCaseJ4.java:339)
>     [junit] 	at org.apache.solr.TestTrie.testTrieDateRangeSearch(TestTrie.java:202)
>     [junit] 	at org.apache.lucene.util.LuceneTestCase$LuceneTestCaseRunner.runChild(LuceneTestCase.java:795)
>     [junit] 	at org.apache.lucene.util.LuceneTestCase$LuceneTestCaseRunner.runChild(LuceneTestCase.java:768)
>     [junit] Caused by: org.apache.solr.common.SolrException: Unknown query type 'func'
>     [junit] 	at org.apache.solr.core.SolrCore.getQueryPlugin(SolrCore.java:1474)
>     [junit] 	at org.apache.solr.search.QParser.getParser(QParser.java:286)
>     [junit] 	at org.apache.solr.search.QParser.subQuery(QParser.java:176)
>     [junit] 	at org.apache.solr.search.SolrQueryParser.getFieldQuery(SolrQueryParser.java:142)
>     [junit] 	at org.apache.lucene.queryParser.QueryParser.getFieldQuery(QueryParser.java:754)
>     [junit] 	at org.apache.lucene.queryParser.QueryParser.Term(QueryParser.java:1594)
>     [junit] 	at org.apache.lucene.queryParser.QueryParser.Clause(QueryParser.java:1337)
>     [junit] 	at org.apache.lucene.queryParser.QueryParser.Query(QueryParser.java:1263)
>     [junit] 	at org.apache.lucene.queryParser.QueryParser.TopLevelQuery(QueryParser.java:1252)
>     [junit] 	at org.apache.lucene.queryParser.QueryParser.parse(QueryParser.java:208)
>     [junit] 	at org.apache.solr.search.LuceneQParser.parse(LuceneQParserPlugin.java:73)
>     [junit] 	at org.apache.solr.search.QParser.getQuery(QParser.java:142)
>     [junit] 	at org.apache.solr.handler.component.QueryComponent.prepare(QueryComponent.java:93)
>     [junit] 	at org.apache.solr.handler.component.SearchHandler.handleRequestBody(SearchHandler.java:210)
>     [junit] 	at org.apache.solr.handler.RequestHandlerBase.handleRequest(RequestHandlerBase.java:131)
>     [junit] 	at org.apache.solr.core.SolrCore.execute(SolrCore.java:1325)
>     [junit] 	at org.apache.solr.util.TestHarness.queryAndResponse(TestHarness.java:334)
>     [junit] 	at org.apache.solr.util.TestHarness.query(TestHarness.java:321)
>     [junit] 	at org.apache.solr.util.TestHarness.query(TestHarness.java:307)
>     [junit] 	at org.apache.solr.SolrTestCaseJ4.assertQ(SolrTestCaseJ4.java:317)
>     [junit] 
>     [junit] 
>     [junit] Tests run: 8, Failures: 0, Errors: 5, Time elapsed: 3.814 sec
>     [junit] 
>     [junit] ------------- Standard Output ---------------
>     [junit] NOTE: reproduce with: ant test -Dtestcase=TestTrie -Dtestmethod=testTrieIntRangeSearch
-Dtests.seed=-2722426925580758488:-212535574334114449
>     [junit] NOTE: reproduce with: ant test -Dtestcase=TestTrie -Dtestmethod=testTrieFloatRangeSearch
-Dtests.seed=-2722426925580758488:-8980412733871305155
>     [junit] NOTE: reproduce with: ant test -Dtestcase=TestTrie -Dtestmethod=testTrieLongRangeSearch
-Dtests.seed=-2722426925580758488:-8688081968302257420
>     [junit] NOTE: reproduce with: ant test -Dtestcase=TestTrie -Dtestmethod=testTrieDoubleRangeSearch
-Dtests.seed=-2722426925580758488:1705446365560533918
>     [junit] NOTE: reproduce with: ant test -Dtestcase=TestTrie -Dtestmethod=testTrieDateRangeSearch
-Dtests.seed=-2722426925580758488:2549506927018087212
>     [junit] NOTE: test params are: codec=Standard, locale=sl, timezone=Japan
>     [junit] ------------- ---------------- ---------------
>     [junit] ------------- Standard Error -----------------
>     [junit] 15.10.2010 7:29:20 org.apache.solr.common.SolrException log
>     [junit] SEVERE: org.apache.solr.common.SolrException: Unknown query type 'func'
>     [junit] 	at org.apache.solr.core.SolrCore.getQueryPlugin(SolrCore.java:1474)
>     [junit] 	at org.apache.solr.search.QParser.getParser(QParser.java:286)
>     [junit] 	at org.apache.solr.search.QParser.subQuery(QParser.java:176)
>     [junit] 	at org.apache.solr.search.SolrQueryParser.getFieldQuery(SolrQueryParser.java:142)
>     [junit] 	at org.apache.lucene.queryParser.QueryParser.getFieldQuery(QueryParser.java:754)
>     [junit] 	at org.apache.lucene.queryParser.QueryParser.Term(QueryParser.java:1594)
>     [junit] 	at org.apache.lucene.queryParser.QueryParser.Clause(QueryParser.java:1337)
>     [junit] 	at org.apache.lucene.queryParser.QueryParser.Query(QueryParser.java:1263)
>     [junit] 	at org.apache.lucene.queryParser.QueryParser.TopLevelQuery(QueryParser.java:1252)
>     [junit] 	at org.apache.lucene.queryParser.QueryParser.parse(QueryParser.java:208)
>     [junit] 	at org.apache.solr.search.LuceneQParser.parse(LuceneQParserPlugin.java:73)
>     [junit] 	at org.apache.solr.search.QParser.getQuery(QParser.java:142)
>     [junit] 	at org.apache.solr.handler.component.QueryComponent.prepare(QueryComponent.java:93)
>     [junit] 	at org.apache.solr.handler.component.SearchHandler.handleRequestBody(SearchHandler.java:210)
>     [junit] 	at org.apache.solr.handler.RequestHandlerBase.handleRequest(RequestHandlerBase.java:131)
>     [junit] 	at org.apache.solr.core.SolrCore.execute(SolrCore.java:1325)
>     [junit] 	at org.apache.solr.util.TestHarness.queryAndResponse(TestHarness.java:334)
>     [junit] 	at org.apache.solr.util.TestHarness.query(TestHarness.java:321)
>     [junit] 	at org.apache.solr.util.TestHarness.query(TestHarness.java:307)
>     [junit] 	at org.apache.solr.SolrTestCaseJ4.assertQ(SolrTestCaseJ4.java:317)
>     [junit] 	at org.apache.solr.TestTrie.testTrieIntRangeSearch(TestTrie.java:76)
>     [junit] 	at sun.reflect.NativeMethodAccessorImpl.invoke0(Native Method)
>     [junit] 	at sun.reflect.NativeMethodAccessorImpl.invoke(NativeMethodAccessorImpl.java:57)
>     [junit] 	at sun.reflect.DelegatingMethodAccessorImpl.invoke(DelegatingMethodAccessorImpl.java:43)
>     [junit] 	at java.lang.reflect.Method.invoke(Method.java:616)
>     [junit] 	at org.junit.runners.model.FrameworkMethod$1.runReflectiveCall(FrameworkMethod.java:44)
>     [junit] 	at org.junit.internal.runners.model.ReflectiveCallable.run(ReflectiveCallable.java:15)
>     [junit] 	at org.junit.runners.model.FrameworkMethod.invokeExplosively(FrameworkMethod.java:41)
>     [junit] 	at org.junit.internal.runners.statements.InvokeMethod.evaluate(InvokeMethod.java:20)
>     [junit] 	at org.junit.rules.TestWatchman$1.evaluate(TestWatchman.java:48)
>     [junit] 	at org.junit.internal.runners.statements.RunBefores.evaluate(RunBefores.java:28)
>     [junit] 	at org.junit.internal.runners.statements.RunAfters.evaluate(RunAfters.java:31)
>     [junit] 	at org.junit.runners.BlockJUnit4ClassRunner.runChild(BlockJUnit4ClassRunner.java:76)
>     [junit] 	at org.apache.lucene.util.LuceneTestCase$LuceneTestCaseRunner.runChild(LuceneTestCase.java:795)
>     [junit] 	at org.apache.lucene.util.LuceneTestCase$LuceneTestCaseRunner.runChild(LuceneTestCase.java:768)
>     [junit] 	at org.junit.runners.ParentRunner$3.run(ParentRunner.java:193)
>     [junit] 	at org.junit.runners.ParentRunner$1.schedule(ParentRunner.java:52)
>     [junit] 	at org.junit.runners.ParentRunner.runChildren(ParentRunner.java:191)
>     [junit] 	at org.junit.runners.ParentRunner.access$000(ParentRunner.java:42)
>     [junit] 	at org.junit.runners.ParentRunner$2.evaluate(ParentRunner.java:184)
>     [junit] 	at org.junit.internal.runners.statements.RunBefores.evaluate(RunBefores.java:28)
>     [junit] 	at org.junit.internal.runners.statements.RunAfters.evaluate(RunAfters.java:31)
>     [junit] 	at org.junit.runners.ParentRunner.run(ParentRunner.java:236)
>     [junit] 	at junit.framework.JUnit4TestAdapter.run(JUnit4TestAdapter.java:39)
>     [junit] 	at org.apache.tools.ant.taskdefs.optional.junit.JUnitTestRunner.run(JUnitTestRunner.java:421)
>     [junit] 	at org.apache.tools.ant.taskdefs.optional.junit.JUnitTestRunner.launch(JUnitTestRunner.java:912)
>     [junit] 	at org.apache.tools.ant.taskdefs.optional.junit.JUnitTestRunner.main(JUnitTestRunner.java:743)
>     [junit] 
>     [junit] 15.10.2010 7:29:20 org.apache.solr.common.SolrException log
>     [junit] SEVERE: org.apache.solr.common.SolrException: Unknown query type 'func'
>     [junit] 	at org.apache.solr.core.SolrCore.getQueryPlugin(SolrCore.java:1474)
>     [junit] 	at org.apache.solr.search.QParser.getParser(QParser.java:286)
>     [junit] 	at org.apache.solr.search.QParser.subQuery(QParser.java:176)
>     [junit] 	at org.apache.solr.search.SolrQueryParser.getFieldQuery(SolrQueryParser.java:142)
>     [junit] 	at org.apache.lucene.queryParser.QueryParser.getFieldQuery(QueryParser.java:754)
>     [junit] 	at org.apache.lucene.queryParser.QueryParser.Term(QueryParser.java:1594)
>     [junit] 	at org.apache.lucene.queryParser.QueryParser.Clause(QueryParser.java:1337)
>     [junit] 	at org.apache.lucene.queryParser.QueryParser.Query(QueryParser.java:1263)
>     [junit] 	at org.apache.lucene.queryParser.QueryParser.TopLevelQuery(QueryParser.java:1252)
>     [junit] 	at org.apache.lucene.queryParser.QueryParser.parse(QueryParser.java:208)
>     [junit] 	at org.apache.solr.search.LuceneQParser.parse(LuceneQParserPlugin.java:73)
>     [junit] 	at org.apache.solr.search.QParser.getQuery(QParser.java:142)
>     [junit] 	at org.apache.solr.handler.component.QueryComponent.prepare(QueryComponent.java:93)
>     [junit] 	at org.apache.solr.handler.component.SearchHandler.handleRequestBody(SearchHandler.java:210)
>     [junit] 	at org.apache.solr.handler.RequestHandlerBase.handleRequest(RequestHandlerBase.java:131)
>     [junit] 	at org.apache.solr.core.SolrCore.execute(SolrCore.java:1325)
>     [junit] 	at org.apache.solr.util.TestHarness.queryAndResponse(TestHarness.java:334)
>     [junit] 	at org.apache.solr.util.TestHarness.query(TestHarness.java:321)
>     [junit] 	at org.apache.solr.util.TestHarness.query(TestHarness.java:307)
>     [junit] 	at org.apache.solr.SolrTestCaseJ4.assertQ(SolrTestCaseJ4.java:317)
>     [junit] 	at org.apache.solr.TestTrie.testTrieFloatRangeSearch(TestTrie.java:119)
>     [junit] 	at sun.reflect.NativeMethodAccessorImpl.invoke0(Native Method)
>     [junit] 	at sun.reflect.NativeMethodAccessorImpl.invoke(NativeMethodAccessorImpl.java:57)
>     [junit] 	at sun.reflect.DelegatingMethodAccessorImpl.invoke(DelegatingMethodAccessorImpl.java:43)
>     [junit] 	at java.lang.reflect.Method.invoke(Method.java:616)
>     [junit] 	at org.junit.runners.model.FrameworkMethod$1.runReflectiveCall(FrameworkMethod.java:44)
>     [junit] 	at org.junit.internal.runners.model.ReflectiveCallable.run(ReflectiveCallable.java:15)
>     [junit] 	at org.junit.runners.model.FrameworkMethod.invokeExplosively(FrameworkMethod.java:41)
>     [junit] 	at org.junit.internal.runners.statements.InvokeMethod.evaluate(InvokeMethod.java:20)
>     [junit] 	at org.junit.rules.TestWatchman$1.evaluate(TestWatchman.java:48)
>     [junit] 	at org.junit.internal.runners.statements.RunBefores.evaluate(RunBefores.java:28)
>     [junit] 	at org.junit.internal.runners.statements.RunAfters.evaluate(RunAfters.java:31)
>     [junit] 	at org.junit.runners.BlockJUnit4ClassRunner.runChild(BlockJUnit4ClassRunner.java:76)
>     [junit] 	at org.apache.lucene.util.LuceneTestCase$LuceneTestCaseRunner.runChild(LuceneTestCase.java:795)
>     [junit] 	at org.apache.lucene.util.LuceneTestCase$LuceneTestCaseRunner.runChild(LuceneTestCase.java:768)
>     [junit] 	at org.junit.runners.ParentRunner$3.run(ParentRunner.java:193)
>     [junit] 	at org.junit.runners.ParentRunner$1.schedule(ParentRunner.java:52)
>     [junit] 	at org.junit.runners.ParentRunner.runChildren(ParentRunner.java:191)
>     [junit] 	at org.junit.runners.ParentRunner.access$000(ParentRunner.java:42)
>     [junit] 	at org.junit.runners.ParentRunner$2.evaluate(ParentRunner.java:184)
>     [junit] 	at org.junit.internal.runners.statements.RunBefores.evaluate(RunBefores.java:28)
>     [junit] 	at org.junit.internal.runners.statements.RunAfters.evaluate(RunAfters.java:31)
>     [junit] 	at org.junit.runners.ParentRunner.run(ParentRunner.java:236)
>     [junit] 	at junit.framework.JUnit4TestAdapter.run(JUnit4TestAdapter.java:39)
>     [junit] 	at org.apache.tools.ant.taskdefs.optional.junit.JUnitTestRunner.run(JUnitTestRunner.java:421)
>     [junit] 	at org.apache.tools.ant.taskdefs.optional.junit.JUnitTestRunner.launch(JUnitTestRunner.java:912)
>     [junit] 	at org.apache.tools.ant.taskdefs.optional.junit.JUnitTestRunner.main(JUnitTestRunner.java:743)
>     [junit] 
>     [junit] 15.10.2010 7:29:20 org.apache.solr.common.SolrException log
>     [junit] SEVERE: org.apache.solr.common.SolrException: Unknown query type 'func'
>     [junit] 	at org.apache.solr.core.SolrCore.getQueryPlugin(SolrCore.java:1474)
>     [junit] 	at org.apache.solr.search.QParser.getParser(QParser.java:286)
>     [junit] 	at org.apache.solr.search.QParser.subQuery(QParser.java:176)
>     [junit] 	at org.apache.solr.search.SolrQueryParser.getFieldQuery(SolrQueryParser.java:142)
>     [junit] 	at org.apache.lucene.queryParser.QueryParser.getFieldQuery(QueryParser.java:754)
>     [junit] 	at org.apache.lucene.queryParser.QueryParser.Term(QueryParser.java:1594)
>     [junit] 	at org.apache.lucene.queryParser.QueryParser.Clause(QueryParser.java:1337)
>     [junit] 	at org.apache.lucene.queryParser.QueryParser.Query(QueryParser.java:1263)
>     [junit] 	at org.apache.lucene.queryParser.QueryParser.TopLevelQuery(QueryParser.java:1252)
>     [junit] 	at org.apache.lucene.queryParser.QueryParser.parse(QueryParser.java:208)
>     [junit] 	at org.apache.solr.search.LuceneQParser.parse(LuceneQParserPlugin.java:73)
>     [junit] 	at org.apache.solr.search.QParser.getQuery(QParser.java:142)
>     [junit] 	at org.apache.solr.handler.component.QueryComponent.prepare(QueryComponent.java:93)
>     [junit] 	at org.apache.solr.handler.component.SearchHandler.handleRequestBody(SearchHandler.java:210)
>     [junit] 	at org.apache.solr.handler.RequestHandlerBase.handleRequest(RequestHandlerBase.java:131)
>     [junit] 	at org.apache.solr.core.SolrCore.execute(SolrCore.java:1325)
>     [junit] 	at org.apache.solr.util.TestHarness.queryAndResponse(TestHarness.java:334)
>     [junit] 	at org.apache.solr.util.TestHarness.query(TestHarness.java:321)
>     [junit] 	at org.apache.solr.util.TestHarness.query(TestHarness.java:307)
>     [junit] 	at org.apache.solr.SolrTestCaseJ4.assertQ(SolrTestCaseJ4.java:317)
>     [junit] 	at org.apache.solr.TestTrie.testTrieLongRangeSearch(TestTrie.java:138)
>     [junit] 	at sun.reflect.NativeMethodAccessorImpl.invoke0(Native Method)
>     [junit] 	at sun.reflect.NativeMethodAccessorImpl.invoke(NativeMethodAccessorImpl.java:57)
>     [junit] 	at sun.reflect.DelegatingMethodAccessorImpl.invoke(DelegatingMethodAccessorImpl.java:43)
>     [junit] 	at java.lang.reflect.Method.invoke(Method.java:616)
>     [junit] 	at org.junit.runners.model.FrameworkMethod$1.runReflectiveCall(FrameworkMethod.java:44)
>     [junit] 	at org.junit.internal.runners.model.ReflectiveCallable.run(ReflectiveCallable.java:15)
>     [junit] 	at org.junit.runners.model.FrameworkMethod.invokeExplosively(FrameworkMethod.java:41)
>     [junit] 	at org.junit.internal.runners.statements.InvokeMethod.evaluate(InvokeMethod.java:20)
>     [junit] 	at org.junit.rules.TestWatchman$1.evaluate(TestWatchman.java:48)
>     [junit] 	at org.junit.internal.runners.statements.RunBefores.evaluate(RunBefores.java:28)
>     [junit] 	at org.junit.internal.runners.statements.RunAfters.evaluate(RunAfters.java:31)
>     [junit] 	at org.junit.runners.BlockJUnit4ClassRunner.runChild(BlockJUnit4ClassRunner.java:76)
>     [junit] 	at org.apache.lucene.util.LuceneTestCase$LuceneTestCaseRunner.runChild(LuceneTestCase.java:795)
>     [junit] 	at org.apache.lucene.util.LuceneTestCase$LuceneTestCaseRunner.runChild(LuceneTestCase.java:768)
>     [junit] 	at org.junit.runners.ParentRunner$3.run(ParentRunner.java:193)
>     [junit] 	at org.junit.runners.ParentRunner$1.schedule(ParentRunner.java:52)
>     [junit] 	at org.junit.runners.ParentRunner.runChildren(ParentRunner.java:191)
>     [junit] 	at org.junit.runners.ParentRunner.access$000(ParentRunner.java:42)
>     [junit] 	at org.junit.runners.ParentRunner$2.evaluate(ParentRunner.java:184)
>     [junit] 	at org.junit.internal.runners.statements.RunBefores.evaluate(RunBefores.java:28)
>     [junit] 	at org.junit.internal.runners.statements.RunAfters.evaluate(RunAfters.java:31)
>     [junit] 	at org.junit.runners.ParentRunner.run(ParentRunner.java:236)
>     [junit] 	at junit.framework.JUnit4TestAdapter.run(JUnit4TestAdapter.java:39)
>     [junit] 	at org.apache.tools.ant.taskdefs.optional.junit.JUnitTestRunner.run(JUnitTestRunner.java:421)
>     [junit] 	at org.apache.tools.ant.taskdefs.optional.junit.JUnitTestRunner.launch(JUnitTestRunner.java:912)
>     [junit] 	at org.apache.tools.ant.taskdefs.optional.junit.JUnitTestRunner.main(JUnitTestRunner.java:743)
>     [junit] 
>     [junit] 15.10.2010 7:29:21 org.apache.solr.common.SolrException log
>     [junit] SEVERE: org.apache.solr.common.SolrException: Unknown query type 'func'
>     [junit] 	at org.apache.solr.core.SolrCore.getQueryPlugin(SolrCore.java:1474)
>     [junit] 	at org.apache.solr.search.QParser.getParser(QParser.java:286)
>     [junit] 	at org.apache.solr.search.QParser.subQuery(QParser.java:176)
>     [junit] 	at org.apache.solr.search.SolrQueryParser.getFieldQuery(SolrQueryParser.java:142)
>     [junit] 	at org.apache.lucene.queryParser.QueryParser.getFieldQuery(QueryParser.java:754)
>     [junit] 	at org.apache.lucene.queryParser.QueryParser.Term(QueryParser.java:1594)
>     [junit] 	at org.apache.lucene.queryParser.QueryParser.Clause(QueryParser.java:1337)
>     [junit] 	at org.apache.lucene.queryParser.QueryParser.Query(QueryParser.java:1263)
>     [junit] 	at org.apache.lucene.queryParser.QueryParser.TopLevelQuery(QueryParser.java:1252)
>     [junit] 	at org.apache.lucene.queryParser.QueryParser.parse(QueryParser.java:208)
>     [junit] 	at org.apache.solr.search.LuceneQParser.parse(LuceneQParserPlugin.java:73)
>     [junit] 	at org.apache.solr.search.QParser.getQuery(QParser.java:142)
>     [junit] 	at org.apache.solr.handler.component.QueryComponent.prepare(QueryComponent.java:93)
>     [junit] 	at org.apache.solr.handler.component.SearchHandler.handleRequestBody(SearchHandler.java:210)
>     [junit] 	at org.apache.solr.handler.RequestHandlerBase.handleRequest(RequestHandlerBase.java:131)
>     [junit] 	at org.apache.solr.core.SolrCore.execute(SolrCore.java:1325)
>     [junit] 	at org.apache.solr.util.TestHarness.queryAndResponse(TestHarness.java:334)
>     [junit] 	at org.apache.solr.util.TestHarness.query(TestHarness.java:321)
>     [junit] 	at org.apache.solr.util.TestHarness.query(TestHarness.java:307)
>     [junit] 	at org.apache.solr.SolrTestCaseJ4.assertQ(SolrTestCaseJ4.java:317)
>     [junit] 	at org.apache.solr.TestTrie.testTrieDoubleRangeSearch(TestTrie.java:156)
>     [junit] 	at sun.reflect.NativeMethodAccessorImpl.invoke0(Native Method)
>     [junit] 	at sun.reflect.NativeMethodAccessorImpl.invoke(NativeMethodAccessorImpl.java:57)
>     [junit] 	at sun.reflect.DelegatingMethodAccessorImpl.invoke(DelegatingMethodAccessorImpl.java:43)
>     [junit] 	at java.lang.reflect.Method.invoke(Method.java:616)
>     [junit] 	at org.junit.runners.model.FrameworkMethod$1.runReflectiveCall(FrameworkMethod.java:44)
>     [junit] 	at org.junit.internal.runners.model.ReflectiveCallable.run(ReflectiveCallable.java:15)
>     [junit] 	at org.junit.runners.model.FrameworkMethod.invokeExplosively(FrameworkMethod.java:41)
>     [junit] 	at org.junit.internal.runners.statements.InvokeMethod.evaluate(InvokeMethod.java:20)
>     [junit] 	at org.junit.rules.TestWatchman$1.evaluate(TestWatchman.java:48)
>     [junit] 	at org.junit.internal.runners.statements.RunBefores.evaluate(RunBefores.java:28)
>     [junit] 	at org.junit.internal.runners.statements.RunAfters.evaluate(RunAfters.java:31)
>     [junit] 	at org.junit.runners.BlockJUnit4ClassRunner.runChild(BlockJUnit4ClassRunner.java:76)
>     [junit] 	at org.apache.lucene.util.LuceneTestCase$LuceneTestCaseRunner.runChild(LuceneTestCase.java:795)
>     [junit] 	at org.apache.lucene.util.LuceneTestCase$LuceneTestCaseRunner.runChild(LuceneTestCase.java:768)
>     [junit] 	at org.junit.runners.ParentRunner$3.run(ParentRunner.java:193)
>     [junit] 	at org.junit.runners.ParentRunner$1.schedule(ParentRunner.java:52)
>     [junit] 	at org.junit.runners.ParentRunner.runChildren(ParentRunner.java:191)
>     [junit] 	at org.junit.runners.ParentRunner.access$000(ParentRunner.java:42)
>     [junit] 	at org.junit.runners.ParentRunner$2.evaluate(ParentRunner.java:184)
>     [junit] 	at org.junit.internal.runners.statements.RunBefores.evaluate(RunBefores.java:28)
>     [junit] 	at org.junit.internal.runners.statements.RunAfters.evaluate(RunAfters.java:31)
>     [junit] 	at org.junit.runners.ParentRunner.run(ParentRunner.java:236)
>     [junit] 	at junit.framework.JUnit4TestAdapter.run(JUnit4TestAdapter.java:39)
>     [junit] 	at org.apache.tools.ant.taskdefs.optional.junit.JUnitTestRunner.run(JUnitTestRunner.java:421)
>     [junit] 	at org.apache.tools.ant.taskdefs.optional.junit.JUnitTestRunner.launch(JUnitTestRunner.java:912)
>     [junit] 	at org.apache.tools.ant.taskdefs.optional.junit.JUnitTestRunner.main(JUnitTestRunner.java:743)
>     [junit] 
>     [junit] 15.10.2010 7:29:21 org.apache.solr.common.SolrException log
>     [junit] SEVERE: org.apache.solr.common.SolrException: Unknown query type 'func'
>     [junit] 	at org.apache.solr.core.SolrCore.getQueryPlugin(SolrCore.java:1474)
>     [junit] 	at org.apache.solr.search.QParser.getParser(QParser.java:286)
>     [junit] 	at org.apache.solr.search.QParser.subQuery(QParser.java:176)
>     [junit] 	at org.apache.solr.search.SolrQueryParser.getFieldQuery(SolrQueryParser.java:142)
>     [junit] Testsuite: org.apache.solr.analysis.SnowballPorterFilterFactoryTest
>     [junit] 	at org.apache.lucene.queryParser.QueryParser.getFieldQuery(QueryParser.java:754)
>     [junit] Tests run: 3, Failures: 0, Errors: 0, Time elapsed: 0.02 sec
>     [junit] 	at org.apache.lucene.queryParser.QueryParser.Term(QueryParser.java:1594)
>     [junit] 
>     [junit] 	at org.apache.lucene.queryParser.QueryParser.Clause(QueryParser.java:1337)
>     [junit] 	at org.apache.lucene.queryParser.QueryParser.Query(QueryParser.java:1263)
>     [junit] 	at org.apache.lucene.queryParser.QueryParser.TopLevelQuery(QueryParser.java:1252)
>     [junit] 	at org.apache.lucene.queryParser.QueryParser.parse(QueryParser.java:208)
>     [junit] 	at org.apache.solr.search.LuceneQParser.parse(LuceneQParserPlugin.java:73)
>     [junit] 	at org.apache.solr.search.QParser.getQuery(QParser.java:142)
>     [junit] 	at org.apache.solr.handler.component.QueryComponent.prepare(QueryComponent.java:93)
>     [junit] 	at org.apache.solr.handler.component.SearchHandler.handleRequestBody(SearchHandler.java:210)
>     [junit] 	at org.apache.solr.handler.RequestHandlerBase.handleRequest(RequestHandlerBase.java:131)
>     [junit] 	at org.apache.solr.core.SolrCore.execute(SolrCore.java:1325)
>     [junit] 	at org.apache.solr.util.TestHarness.queryAndResponse(TestHarness.java:334)
>     [junit] 	at org.apache.solr.util.TestHarness.query(TestHarness.java:321)
>     [junit] 	at org.apache.solr.util.TestHarness.query(TestHarness.java:307)
>     [junit] 	at org.apache.solr.SolrTestCaseJ4.assertQ(SolrTestCaseJ4.java:317)
>     [junit] 	at org.apache.solr.TestTrie.testTrieDateRangeSearch(TestTrie.java:202)
>     [junit] 	at sun.reflect.NativeMethodAccessorImpl.invoke0(Native Method)
>     [junit] 	at sun.reflect.NativeMethodAccessorImpl.invoke(NativeMethodAccessorImpl.java:57)
>     [junit] 	at sun.reflect.DelegatingMethodAccessorImpl.invoke(DelegatingMethodAccessorImpl.java:43)
>     [junit] 	at java.lang.reflect.Method.invoke(Method.java:616)
>     [junit] 	at org.junit.runners.model.FrameworkMethod$1.runReflectiveCall(FrameworkMethod.java:44)
>     [junit] 	at org.junit.internal.runners.model.ReflectiveCallable.run(ReflectiveCallable.java:15)
>     [junit] 	at org.junit.runners.model.FrameworkMethod.invokeExplosively(FrameworkMethod.java:41)
>     [junit] 	at org.junit.internal.runners.statements.InvokeMethod.evaluate(InvokeMethod.java:20)
>     [junit] 	at org.junit.rules.TestWatchman$1.evaluate(TestWatchman.java:48)
>     [junit] 	at org.junit.internal.runners.statements.RunBefores.evaluate(RunBefores.java:28)
>     [junit] 	at org.junit.internal.runners.statements.RunAfters.evaluate(RunAfters.java:31)
>     [junit] 	at org.junit.runners.BlockJUnit4ClassRunner.runChild(BlockJUnit4ClassRunner.java:76)
>     [junit] 	at org.apache.lucene.util.LuceneTestCase$LuceneTestCaseRunner.runChild(LuceneTestCase.java:795)
>     [junit] 	at org.apache.lucene.util.LuceneTestCase$LuceneTestCaseRunner.runChild(LuceneTestCase.java:768)
>     [junit] 	at org.junit.runners.ParentRunner$3.run(ParentRunner.java:193)
>     [junit] 	at org.junit.runners.ParentRunner$1.schedule(ParentRunner.java:52)
>     [junit] 	at org.junit.runners.ParentRunner.runChildren(ParentRunner.java:191)
>     [junit] 	at org.junit.runners.ParentRunner.access$000(ParentRunner.java:42)
>     [junit] 	at org.junit.runners.ParentRunner$2.evaluate(ParentRunner.java:184)
>     [junit] 	at org.junit.internal.runners.statements.RunBefores.evaluate(RunBefores.java:28)
>     [junit] 	at org.junit.internal.runners.statements.RunAfters.evaluate(RunAfters.java:31)
>     [junit] 	at org.junit.runners.ParentRunner.run(ParentRunner.java:236)
>     [junit] 	at junit.framework.JUnit4TestAdapter.run(JUnit4TestAdapter.java:39)
>     [junit] 	at org.apache.tools.ant.taskdefs.optional.junit.JUnitTestRunner.run(JUnitTestRunner.java:421)
>     [junit] 	at org.apache.tools.ant.taskdefs.optional.junit.JUnitTestRunner.launch(JUnitTestRunner.java:912)
>     [junit] 	at org.apache.tools.ant.taskdefs.optional.junit.JUnitTestRunner.main(JUnitTestRunner.java:743)
>     [junit] 
>     [junit] ------------- ---------------- ---------------
>     [junit] TEST org.apache.solr.TestTrie FAILED
> {noformat}

-- 
This message is automatically generated by JIRA.
-
You can reply to this email to add a comment to the issue online.


---------------------------------------------------------------------
To unsubscribe, e-mail: dev-unsubscribe@lucene.apache.org
For additional commands, e-mail: dev-help@lucene.apache.org


Mime
View raw message