lucene-dev mailing list archives

Site index · List index
Message view « Date » · « Thread »
Top « Date » · « Thread »
From Apache Hudson Server <hud...@hudson.apache.org>
Subject Build failed in Hudson: Lucene-Solr-tests-only-3.x #111
Date Fri, 15 Oct 2010 18:45:05 GMT
See <https://hudson.apache.org/hudson/job/Lucene-Solr-tests-only-3.x/111/>

------------------------------------------
[...truncated 8958 lines...]
    [junit] Testsuite: org.apache.solr.search.SpatialFilterTest
    [junit] Tests run: 3, Failures: 0, Errors: 0, Time elapsed: 1.926 sec
    [junit] 
    [junit] Testsuite: org.apache.solr.search.TestQueryUtils
    [junit] Tests run: 1, Failures: 0, Errors: 0, Time elapsed: 1.58 sec
    [junit] 
    [junit] Testsuite: org.apache.solr.spelling.suggest.SuggesterTest
    [junit] Tests run: 2, Failures: 0, Errors: 0, Time elapsed: 0.302 sec
    [junit] 
    [junit] Testsuite: org.apache.solr.update.AutoCommitTest
    [junit] Tests run: 1, Failures: 0, Errors: 0, Time elapsed: 5.291 sec
    [junit] 
    [junit] Testsuite: org.apache.solr.util.TestUtils
    [junit] Tests run: 3, Failures: 0, Errors: 0, Time elapsed: 0.027 sec
    [junit] 
    [junit] Testsuite: org.apache.solr.update.processor.UpdateRequestProcessorFactoryTest
    [junit] Tests run: 1, Failures: 0, Errors: 0, Time elapsed: 0.927 sec
    [junit] 
    [junit] Testsuite: org.apache.solr.search.function.TestFunctionQuery
    [junit] Tests run: 7, Failures: 0, Errors: 0, Time elapsed: 3.692 sec
    [junit] 
    [junit] ------------- Standard Error -----------------
    [junit] 15/10/2010 06:44:19 ? org.apache.solr.SolrTestCaseJ4 assertQ
    [junit] SEVERE: REQUEST FAILED: fl=*,score&q={!func}10+wow+dude+ignore_exception
    [junit] ------------- ---------------- ---------------
    [junit] Testsuite: org.apache.solr.util.SolrPluginUtilsTest
    [junit] Tests run: 7, Failures: 0, Errors: 0, Time elapsed: 0.948 sec
    [junit] 
    [junit] Testsuite: org.apache.solr.servlet.CacheHeaderTest
    [junit] Tests run: 5, Failures: 0, Errors: 0, Time elapsed: 1.136 sec
    [junit] 
    [junit] Testsuite: org.apache.solr.request.SimpleFacetsTest
    [junit] Tests run: 7, Failures: 0, Errors: 0, Time elapsed: 5.728 sec
    [junit] 
    [junit] Testsuite: org.apache.solr.update.TestIndexingPerformance
    [junit] Tests run: 1, Failures: 0, Errors: 0, Time elapsed: 1.431 sec
    [junit] 
    [junit] ------------- Standard Output ---------------
    [junit] includeDoc=true doc=[text, simple, text, test, text, how now brown cow, text,
what's that?, text, radical!, text, what's all this about, anyway?, text, just how fast is
this text indexing?]
    [junit] iter=1000 time=519 throughput=1926
    [junit] ------------- ---------------- ---------------
    [junit] Testsuite: org.apache.solr.schema.CopyFieldTest
    [junit] Tests run: 6, Failures: 0, Errors: 0, Time elapsed: 0.49 sec
    [junit] 
    [junit] Testsuite: org.apache.solr.util.DateMathParserTest
    [junit] Tests run: 7, Failures: 0, Errors: 0, Time elapsed: 0.083 sec
    [junit] 
    [junit] Testsuite: org.apache.solr.velocity.VelocityResponseWriterTest
    [junit] Tests run: 1, Failures: 0, Errors: 0, Time elapsed: 0.785 sec
    [junit] 
    [junit] Testsuite: org.apache.solr.search.QueryParsingTest
    [junit] Tests run: 2, Failures: 0, Errors: 0, Time elapsed: 0.812 sec
    [junit] 
    [junit] Testsuite: org.apache.solr.handler.component.DistributedTermsComponentTest
    [junit] Tests run: 1, Failures: 0, Errors: 0, Time elapsed: 11.886 sec
    [junit] 
    [junit] Testsuite: org.apache.solr.response.TestCSVResponseWriter
    [junit] Tests run: 1, Failures: 0, Errors: 0, Time elapsed: 1.009 sec
    [junit] 
    [junit] Testsuite: org.apache.solr.schema.TestBinaryField
    [junit] Tests run: 1, Failures: 0, Errors: 0, Time elapsed: 0.621 sec
    [junit] 
    [junit] Testsuite: org.apache.solr.handler.component.DistributedSpellCheckComponentTest
    [junit] Tests run: 1, Failures: 0, Errors: 0, Time elapsed: 15.373 sec
    [junit] 
    [junit] Testsuite: org.apache.solr.schema.LegacyDateFieldTest
    [junit] Tests run: 4, Failures: 0, Errors: 0, Time elapsed: 0.021 sec
    [junit] 
    [junit] Testsuite: org.apache.solr.search.TestExtendedDismaxParser
    [junit] Tests run: 1, Failures: 0, Errors: 0, Time elapsed: 1.322 sec
    [junit] 
    [junit] Testsuite: org.apache.solr.search.TestSearchPerf
    [junit] Tests run: 1, Failures: 0, Errors: 0, Time elapsed: 0.575 sec
    [junit] 
    [junit] Testsuite: org.apache.solr.schema.PolyFieldTest
    [junit] Tests run: 4, Failures: 0, Errors: 0, Time elapsed: 2.115 sec
    [junit] 
    [junit] Testsuite: org.apache.solr.search.function.SortByFunctionTest
    [junit] Tests run: 1, Failures: 0, Errors: 0, Time elapsed: 1.405 sec
    [junit] 
    [junit] Testsuite: org.apache.solr.servlet.NoCacheHeaderTest
    [junit] Tests run: 3, Failures: 0, Errors: 0, Time elapsed: 1.838 sec
    [junit] 
    [junit] Testsuite: org.apache.solr.servlet.SolrRequestParserTest
    [junit] Tests run: 4, Failures: 0, Errors: 0, Time elapsed: 1.096 sec
    [junit] 
    [junit] Testsuite: org.apache.solr.TestDistributedSearch
    [junit] Tests run: 1, Failures: 0, Errors: 0, Time elapsed: 38.488 sec
    [junit] 
    [junit] Testsuite: org.apache.solr.analysis.TestCollationKeyFilterFactory
    [junit] Tests run: 5, Failures: 0, Errors: 0, Time elapsed: 0.168 sec
    [junit] 
    [junit] Testsuite: org.apache.solr.analysis.TestDutchStemFilterFactory
    [junit] Tests run: 1, Failures: 0, Errors: 0, Time elapsed: 0.032 sec
    [junit] 
    [junit] Testsuite: org.apache.solr.analysis.TestHindiFilters
    [junit] Tests run: 4, Failures: 0, Errors: 0, Time elapsed: 0.036 sec
    [junit] 
    [junit] Testsuite: org.apache.solr.analysis.TestItalianLightStemFilterFactory
    [junit] Tests run: 1, Failures: 0, Errors: 0, Time elapsed: 0.013 sec
    [junit] 
    [junit] Testsuite: org.apache.solr.analysis.TestKeepWordFilter
    [junit] Tests run: 1, Failures: 0, Errors: 0, Time elapsed: 0.012 sec
    [junit] 
    [junit] Testsuite: org.apache.solr.analysis.TestShingleFilterFactory
    [junit] Tests run: 13, Failures: 0, Errors: 0, Time elapsed: 0.033 sec
    [junit] 
    [junit] Testsuite: org.apache.solr.analysis.TestStandardFactories
    [junit] Tests run: 9, Failures: 0, Errors: 0, Time elapsed: 0.032 sec
    [junit] 
    [junit] Testsuite: org.apache.solr.analysis.TestSynonymFilter
    [junit] Tests run: 7, Failures: 0, Errors: 0, Time elapsed: 0.032 sec
    [junit] 
    [junit] Testsuite: org.apache.solr.analysis.TestTrimFilter
    [junit] Tests run: 1, Failures: 0, Errors: 0, Time elapsed: 0.011 sec
    [junit] 
    [junit] Testsuite: org.apache.solr.update.DirectUpdateHandlerOptimizeTest
    [junit] Tests run: 1, Failures: 0, Errors: 0, Time elapsed: 0.852 sec
    [junit] 
    [junit] Testsuite: org.apache.solr.util.ArraysUtilsTest
    [junit] Tests run: 1, Failures: 0, Errors: 0, Time elapsed: 0.009 sec
    [junit] 
    [junit] Testsuite: org.apache.solr.client.solrj.TestBatchUpdate
    [junit] Tests run: 3, Failures: 0, Errors: 0, Time elapsed: 1.439 sec
    [junit] 
    [junit] Testsuite: org.apache.solr.client.solrj.beans.TestDocumentObjectBinder
    [junit] Tests run: 4, Failures: 0, Errors: 0, Time elapsed: 0.056 sec
    [junit] 
    [junit] Tests FAILED
    [junit] Testsuite: org.apache.solr.client.solrj.embedded.MergeIndexesEmbeddedTest
    [junit] Tests run: 1, Failures: 0, Errors: 0, Time elapsed: 0.471 sec
    [junit] 
    [junit] Testsuite: org.apache.solr.handler.TestReplicationHandler
    [junit] Tests run: 7, Failures: 0, Errors: 0, Time elapsed: 32.259 sec
    [junit] 
    [junit] ------------- Standard Error -----------------
    [junit] 15.Eki.2010 21:44:32 org.apache.solr.handler.SnapPuller fetchLatestIndex
    [junit] SEVERE: Master at: http://localhost:15997/solr/replication is not available. Index
fetch failed. Exception: The host did not accept the connection within timeout of 5000 ms
    [junit] ------------- ---------------- ---------------
    [junit] Testsuite: org.apache.solr.common.util.TestHash
    [junit] Tests run: 2, Failures: 0, Errors: 0, Time elapsed: 0.071 sec
    [junit] 
    [junit] Testsuite: org.apache.solr.common.util.TestNamedListCodec
    [junit] Tests run: 4, Failures: 0, Errors: 0, Time elapsed: 0.272 sec
    [junit] 
    [junit] Testsuite: org.apache.solr.core.RAMDirectoryFactoryTest
    [junit] Tests run: 2, Failures: 0, Errors: 0, Time elapsed: 0.007 sec
    [junit] 
    [junit] Testsuite: org.apache.solr.core.SOLR749Test
    [junit] Tests run: 1, Failures: 0, Errors: 0, Time elapsed: 0.497 sec
    [junit] 
    [junit] Testsuite: org.apache.solr.core.TestJmxIntegration
    [junit] Tests run: 2, Failures: 0, Errors: 0, Time elapsed: 1.041 sec
    [junit] 
    [junit] Testsuite: org.apache.solr.handler.AnalysisRequestHandlerTest
    [junit] Tests run: 1, Failures: 0, Errors: 0, Time elapsed: 0.557 sec
    [junit] 
    [junit] Testsuite: org.apache.solr.handler.component.StatsComponentTest
    [junit] Tests run: 1, Failures: 0, Errors: 0, Time elapsed: 2.608 sec
    [junit] 
    [junit] Testsuite: org.apache.solr.highlight.FastVectorHighlighterTest
    [junit] Tests run: 2, Failures: 0, Errors: 0, Time elapsed: 0.563 sec
    [junit] 
    [junit] Testsuite: org.apache.solr.handler.component.SpellCheckComponentTest
    [junit] Tests run: 8, Failures: 0, Errors: 0, Time elapsed: 0.933 sec
    [junit] 
    [junit] Testsuite: org.apache.solr.request.JSONWriterTest
    [junit] Tests run: 3, Failures: 0, Errors: 0, Time elapsed: 0.533 sec
    [junit] 
    [junit] ------------- Standard Error -----------------
    [junit] 15-okt-2010 18:44:37 org.apache.solr.handler.SnapPuller fetchLatestIndex
    [junit] SEVERE: Master at: http://localhost:16023/solr/replication is not available. Index
fetch failed. Exception: The host did not accept the connection within timeout of 5000 ms
    [junit] 15-okt-2010 18:44:37 org.apache.solr.handler.SnapPuller fetchLatestIndex
    [junit] SEVERE: Master at: http://localhost:15997/solr/replication is not available. Index
fetch failed. Exception: The host did not accept the connection within timeout of 5000 ms
    [junit] ------------- ---------------- ---------------
    [junit] Testsuite: org.apache.solr.schema.RequiredFieldsTest
    [junit] Tests run: 3, Failures: 0, Errors: 0, Time elapsed: 0.622 sec
    [junit] 
    [junit] ------------- Standard Error -----------------
    [junit] 15 oct. 2010 21:44:37 org.apache.solr.schema.IndexSchema readSchema
    [junit] GRAVE: uniqueKey should not be multivalued
    [junit] ------------- ---------------- ---------------
    [junit] Testsuite: org.apache.solr.search.TestFastLRUCache
    [junit] Tests run: 2, Failures: 0, Errors: 0, Time elapsed: 0.033 sec
    [junit] 
    [junit] Testsuite: org.apache.solr.search.TestIndexSearcher
    [junit] Tests run: 1, Failures: 0, Errors: 0, Time elapsed: 0.419 sec
    [junit] 
    [junit] Testsuite: org.apache.solr.spelling.SpellingQueryConverterTest
    [junit] Tests run: 4, Failures: 0, Errors: 0, Time elapsed: 0.016 sec
    [junit] 
    [junit] Testsuite: org.apache.solr.update.processor.SignatureUpdateProcessorFactoryTest
    [junit] Tests run: 2, Failures: 0, Errors: 0, Time elapsed: 1.325 sec
    [junit] 
    [junit] Testsuite: org.apache.solr.util.TestOpenBitSet
    [junit] Tests run: 3, Failures: 0, Errors: 0, Time elapsed: 0.451 sec
    [junit] 
    [junit] Testsuite: org.apache.solr.request.TestFaceting
    [junit] Tests run: 3, Failures: 0, Errors: 0, Time elapsed: 4.48 sec
    [junit] 
    [junit] Testsuite: org.apache.solr.schema.DateFieldTest
    [junit] Tests run: 6, Failures: 0, Errors: 0, Time elapsed: 0.012 sec
    [junit] 
    [junit] Testsuite: org.apache.solr.search.TestSolrQueryParser
    [junit] Tests run: 1, Failures: 0, Errors: 0, Time elapsed: 0.478 sec
    [junit] 
    [junit] Testsuite: org.apache.solr.search.TestSort
    [junit] Tests run: 1, Failures: 0, Errors: 0, Time elapsed: 1.312 sec
    [junit] 
    [junit] Testsuite: org.apache.solr.spelling.FileBasedSpellCheckerTest
    [junit] Tests run: 3, Failures: 0, Errors: 0, Time elapsed: 0.535 sec
    [junit] 
    [junit] Testsuite: org.apache.solr.update.DirectUpdateHandlerTest
    [junit] Tests run: 7, Failures: 0, Errors: 0, Time elapsed: 1.747 sec
    [junit] 
    [junit] Testsuite: org.apache.solr.util.PrimUtilsTest
    [junit] Tests run: 1, Failures: 0, Errors: 0, Time elapsed: 0.009 sec
    [junit] 
    [junit] Testsuite: org.apache.solr.search.TestRangeQuery
    [junit] Tests run: 2, Failures: 0, Errors: 0, Time elapsed: 22.636 sec
    [junit] 
    [junit] Testsuite: org.apache.solr.spelling.IndexBasedSpellCheckerTest
    [junit] Tests run: 5, Failures: 0, Errors: 0, Time elapsed: 0.521 sec
    [junit] 
    [junit] Testsuite: org.apache.solr.update.DocumentBuilderTest
    [junit] Tests run: 3, Failures: 0, Errors: 0, Time elapsed: 0.399 sec
    [junit] 
    [junit] Testsuite: org.apache.solr.util.TestNumberUtils
    [junit] Tests run: 1, Failures: 0, Errors: 0, Time elapsed: 0.221 sec
    [junit] 

BUILD FAILED
/usr<https://hudson.apache.org/hudson/job/Lucene-Solr-tests-only-3.x/ws/checkout/build.xml>:27:
The following error occurred while executing this line:
/usr<https://hudson.apache.org/hudson/job/Lucene-Solr-tests-only-3.x/ws/checkout/solr/build.xml>:387:

The following error occurred while executing this line:
/usr<https://hudson.apache.org/hudson/job/Lucene-Solr-tests-only-3.x/ws/checkout/solr/build.xml>:481:
Tests failed!
The following error occurred while executing this line:
/usr<https://hudson.apache.org/hudson/job/Lucene-Solr-tests-only-3.x/ws/checkout/solr/build.xml>:481:
Tests failed!
The following error occurred while executing this line:
/usr<https://hudson.apache.org/hudson/job/Lucene-Solr-tests-only-3.x/ws/checkout/solr/build.xml>:481:
Tests failed!
The following error occurred while executing this line:
/usr<https://hudson.apache.org/hudson/job/Lucene-Solr-tests-only-3.x/ws/checkout/solr/build.xml>:481:
Tests failed!
The following error occurred while executing this line:
/usr<https://hudson.apache.org/hudson/job/Lucene-Solr-tests-only-3.x/ws/checkout/solr/build.xml>:481:
Tests failed!
The following error occurred while executing this line:
/usr<https://hudson.apache.org/hudson/job/Lucene-Solr-tests-only-3.x/ws/checkout/solr/build.xml>:481:
Tests failed!

Total time: 4 minutes 51 seconds
Recording test results


---------------------------------------------------------------------
To unsubscribe, e-mail: dev-unsubscribe@lucene.apache.org
For additional commands, e-mail: dev-help@lucene.apache.org


Mime
View raw message