lucene-dev mailing list archives

Site index · List index
Message view « Date » · « Thread »
Top « Date » · « Thread »
From "Robert Muir (JIRA)" <j...@apache.org>
Subject [jira] Commented: (LUCENE-2118) Intermittent failure in TestIndexWriterMergePolicy.testMaxBufferedDocsChange
Date Sun, 17 Oct 2010 12:43:22 GMT

    [ https://issues.apache.org/jira/browse/LUCENE-2118?page=com.atlassian.jira.plugin.system.issuetabpanels:comment-tabpanel&focusedCommentId=12921839#action_12921839
] 

Robert Muir commented on LUCENE-2118:
-------------------------------------

Hudson hit this last night (brancH_3x)
{noformat}
    [junit] Testsuite: org.apache.lucene.index.TestIndexWriterMergePolicy
    [junit] Testcase: testMaxBufferedDocsChange(org.apache.lucene.index.TestIndexWriterMergePolicy):
FAILED
    [junit] maxMergeDocs=2147483647; numSegments=11; upperBound=10; mergeFactor=10; segs=_65:c5950
_5t:c10->_32 _5u:c10->_32 _5v:c10->_32 _5w:c10->_32 _5x:c10->_32 _5y:c10->_32
_5z:c10->_32 _60:c10->_32 _61:c10->_32 _62:c5->_32 _63:c5->_62
    [junit] junit.framework.AssertionFailedError: maxMergeDocs=2147483647; numSegments=11;
upperBound=10; mergeFactor=10; segs=_65:c5950 _5t:c10->_32 _5u:c10->_32 _5v:c10->_32
_5w:c10->_32 _5x:c10->_32 _5y:c10->_32 _5z:c10->_32 _60:c10->_32 _61:c10->_32
_62:c5->_32 _63:c5->_62
    [junit] 	at org.apache.lucene.util.LuceneTestCase$LuceneTestCaseRunner.runChild(LuceneTestCase.java:770)
    [junit] 	at org.apache.lucene.util.LuceneTestCase$LuceneTestCaseRunner.runChild(LuceneTestCase.java:737)
    [junit] 	at org.apache.lucene.index.TestIndexWriterMergePolicy.checkInvariants(TestIndexWriterMergePolicy.java:243)
    [junit] 	at org.apache.lucene.index.TestIndexWriterMergePolicy.testMaxBufferedDocsChange(TestIndexWriterMergePolicy.java:169)
    [junit] 
    [junit] 
    [junit] Tests run: 6, Failures: 1, Errors: 0, Time elapsed: 2.31 sec
    [junit] 
    [junit] ------------- Standard Output ---------------
    [junit] NOTE: reproduce with: ant test -Dtestcase=TestIndexWriterMergePolicy -Dtestmethod=testMaxBufferedDocsChange
-Dtests.seed=5199282654207860248:-4379090235199517829 -Dtests.multiplier=3
    [junit] NOTE: test params are: locale=is_IS, timezone=Africa/Porto-Novo
    [junit] ------------- ---------------- ---------------
    [junit] TEST org.apache.lucene.index.TestIndexWriterMergePolicy FAILED
{noformat}

> Intermittent failure in TestIndexWriterMergePolicy.testMaxBufferedDocsChange
> ----------------------------------------------------------------------------
>
>                 Key: LUCENE-2118
>                 URL: https://issues.apache.org/jira/browse/LUCENE-2118
>             Project: Lucene - Java
>          Issue Type: Bug
>          Components: Index
>    Affects Versions: 3.1
>            Reporter: Michael McCandless
>            Priority: Minor
>             Fix For: 3.1, 4.0
>
>
> Last night's build failed from it: http://hudson.zones.apache.org/hudson/job/Lucene-trunk/1019/changes
> Here's the exc:
> {code}
>     [junit] Testcase: testMaxBufferedDocsChange(org.apache.lucene.index.TestIndexWriterMergePolicy):
FAILED
>     [junit] maxMergeDocs=2147483647; numSegments=11; upperBound=10; mergeFactor=10
>     [junit] junit.framework.AssertionFailedError: maxMergeDocs=2147483647; numSegments=11;
upperBound=10; mergeFactor=10
>     [junit] 	at org.apache.lucene.index.TestIndexWriterMergePolicy.checkInvariants(TestIndexWriterMergePolicy.java:234)
>     [junit] 	at org.apache.lucene.index.TestIndexWriterMergePolicy.testMaxBufferedDocsChange(TestIndexWriterMergePolicy.java:164)
>     [junit] 	at org.apache.lucene.util.LuceneTestCase.runBare(LuceneTestCase.java:208)
> {code}
> Test doesn't fail if I run on opensolaris nor os X machines...

-- 
This message is automatically generated by JIRA.
-
You can reply to this email to add a comment to the issue online.


---------------------------------------------------------------------
To unsubscribe, e-mail: dev-unsubscribe@lucene.apache.org
For additional commands, e-mail: dev-help@lucene.apache.org


Mime
View raw message