lucene-dev mailing list archives

Site index · List index
Message view « Date » · « Thread »
Top « Date » · « Thread »
From Apache Hudson Server <hud...@hudson.apache.org>
Subject Build failed in Hudson: Solr-3.x #137
Date Sat, 16 Oct 2010 05:44:13 GMT
See <https://hudson.apache.org/hudson/job/Solr-3.x/137/changes>

Changes:

[yonik] reenable lint for javac

[yonik] tests: fix cut'n'paste

[yonik] merge trunk 1023040

[yonik] merge trunk 1022989

[yonik] merge trunk 1023106

[rmuir] backport test fixes (svn merge -r 1022707:1022710 -r 1022729:1022735 -r 1022747:1022755
-r 1022761:1022793 -r 1022797:1022802 -c 1022927 -c 1022956 -c 1022998)

[rmuir] LUCENE-2709: if a test has methods with @ignore, we should print out a notice

[rmuir] LUCENE-2708: when a test Assume fails, display information

[mikemccand] LUCENE-2705: drop number of simultaneous threads from 100 to 10

[rmuir] SOLR-2163: SolrRequestParserTest.testStreamURL test failure

[sarowe] LUCENE-2699: Update StandardTokenizer and UAX29Tokenizer to Unicode 6.0.0

------------------------------------------
[...truncated 8821 lines...]
    [junit] 
    [junit] ------------- Standard Error -----------------
    [junit] 16.10.2010 03:11:16 org.apache.solr.handler.SnapPuller fetchLatestIndex
    [junit] SEVERE: Master at: http://localhost:24101/solr/replication is not available. Index
fetch failed. Exception: The host did not accept the connection within timeout of 5000 ms
    [junit] ------------- ---------------- ---------------
    [junit] Testsuite: org.apache.solr.request.TestWriterPerf
    [junit] Tests run: 1, Failures: 0, Errors: 0, Time elapsed: 0.867 sec
    [junit] 
    [junit] ------------- Standard Output ---------------
    [junit] writer xml, size=7211, encodeRate=1000, decodeRate=250
    [junit] writer json, size=4497, encodeRate=1000, decodeRate=N/A
    [junit] writer javabin, size=2006, encodeRate=N/A, decodeRate=N/A
    [junit] ------------- ---------------- ---------------
    [junit] ------------- Standard Error -----------------
    [junit] 2010-10-16 04:41:19 org.apache.solr.common.util.ConcurrentLRUCache finalize
    [junit] SEVERE: ConcurrentLRUCache was not destroyed prior to finalize(), indicates a
bug -- POSSIBLE RESOURCE LEAK!!!
    [junit] 2010-10-16 04:41:19 org.apache.solr.common.util.ConcurrentLRUCache finalize
    [junit] SEVERE: ConcurrentLRUCache was not destroyed prior to finalize(), indicates a
bug -- POSSIBLE RESOURCE LEAK!!!
    [junit] ------------- ---------------- ---------------
    [junit] Testsuite: org.apache.solr.response.TestCSVResponseWriter
    [junit] Tests run: 1, Failures: 0, Errors: 0, Time elapsed: 0.628 sec
    [junit] 
    [junit] Testsuite: org.apache.solr.schema.BadIndexSchemaTest
    [junit] Tests run: 1, Failures: 0, Errors: 0, Time elapsed: 0.166 sec
    [junit] 
    [junit] Testsuite: org.apache.solr.schema.CopyFieldTest
    [junit] Tests run: 6, Failures: 0, Errors: 0, Time elapsed: 0.373 sec
    [junit] 
    [junit] Testsuite: org.apache.solr.schema.DateFieldTest
    [junit] Tests run: 6, Failures: 0, Errors: 0, Time elapsed: 0.035 sec
    [junit] 
    [junit] Testsuite: org.apache.solr.schema.IndexSchemaTest
    [junit] Tests run: 5, Failures: 0, Errors: 0, Time elapsed: 0.488 sec
    [junit] 
    [junit] ------------- Standard Error -----------------
    [junit] 16 ??? 2010 12:41:21 ?? org.apache.solr.handler.SnapPuller fetchLatestIndex
    [junit] SEVERE: Master at: http://localhost:24101/solr/replication is not available. Index
fetch failed. Exception: The host did not accept the connection within timeout of 5000 ms
    [junit] ------------- ---------------- ---------------
    [junit] Testsuite: org.apache.solr.schema.LegacyDateFieldTest
    [junit] Tests run: 4, Failures: 0, Errors: 0, Time elapsed: 0.011 sec
    [junit] 
    [junit] Testsuite: org.apache.solr.schema.NotRequiredUniqueKeyTest
    [junit] Tests run: 1, Failures: 0, Errors: 0, Time elapsed: 0.163 sec
    [junit] 
    [junit] ------------- Standard Error -----------------
    [junit] 15-oct.-2010 23:41:21 org.apache.solr.schema.IndexSchema readSchema
    [junit] GRAVE: uniqueKey should not be multivalued
    [junit] ------------- ---------------- ---------------
    [junit] Testsuite: org.apache.solr.schema.PolyFieldTest
    [junit] Tests run: 4, Failures: 0, Errors: 0, Time elapsed: 1.068 sec
    [junit] 
    [junit] Testsuite: org.apache.solr.schema.RequiredFieldsTest
    [junit] Tests run: 3, Failures: 0, Errors: 0, Time elapsed: 0.671 sec
    [junit] 
    [junit] ------------- Standard Error -----------------
    [junit] 2010 Okt 16 02:41:23 org.apache.solr.schema.IndexSchema readSchema
    [junit] SEVERE: uniqueKey should not be multivalued
    [junit] ------------- ---------------- ---------------
    [junit] Testsuite: org.apache.solr.schema.TestBinaryField
    [junit] Tests run: 1, Failures: 0, Errors: 0, Time elapsed: 0.369 sec
    [junit] 
    [junit] Testsuite: org.apache.solr.schema.UUIDFieldTest
    [junit] Tests run: 1, Failures: 0, Errors: 0, Time elapsed: 0.003 sec
    [junit] 
    [junit] Testsuite: org.apache.solr.search.QueryParsingTest
    [junit] Tests run: 2, Failures: 0, Errors: 0, Time elapsed: 0.676 sec
    [junit] 
    [junit] Testsuite: org.apache.solr.search.SpatialFilterTest
    [junit] Tests run: 3, Failures: 0, Errors: 0, Time elapsed: 1.006 sec
    [junit] 
    [junit] Testsuite: org.apache.solr.search.TestDocSet
    [junit] Tests run: 2, Failures: 0, Errors: 0, Time elapsed: 0.72 sec
    [junit] 
    [junit] ------------- Standard Error -----------------
    [junit] 16.okt.2010 01:41:26 org.apache.solr.handler.SnapPuller fetchLatestIndex
    [junit] SEVERE: Master at: http://localhost:24101/solr/replication is not available. Index
fetch failed. Exception: The host did not accept the connection within timeout of 5000 ms
    [junit] ------------- ---------------- ---------------
    [junit] Testsuite: org.apache.solr.search.TestExtendedDismaxParser
    [junit] Tests run: 1, Failures: 0, Errors: 0, Time elapsed: 0.501 sec
    [junit] 
    [junit] Testsuite: org.apache.solr.search.TestFastLRUCache
    [junit] Tests run: 2, Failures: 0, Errors: 0, Time elapsed: 0.014 sec
    [junit] 
    [junit] Testsuite: org.apache.solr.search.TestIndexSearcher
    [junit] Tests run: 1, Failures: 0, Errors: 0, Time elapsed: 0.331 sec
    [junit] 
    [junit] Testsuite: org.apache.solr.search.TestQueryTypes
    [junit] Tests run: 1, Failures: 0, Errors: 0, Time elapsed: 8.022 sec
    [junit] 
    [junit] ------------- Standard Error -----------------
    [junit] 2010.10.16. 1:41:27 org.apache.solr.common.util.ConcurrentLRUCache finalize
    [junit] SEVERE: ConcurrentLRUCache was not destroyed prior to finalize(), indicates a
bug -- POSSIBLE RESOURCE LEAK!!!
    [junit] 2010.10.16. 1:41:27 org.apache.solr.common.util.ConcurrentLRUCache finalize
    [junit] SEVERE: ConcurrentLRUCache was not destroyed prior to finalize(), indicates a
bug -- POSSIBLE RESOURCE LEAK!!!
    [junit] 2010.10.16. 1:41:31 org.apache.solr.handler.SnapPuller fetchLatestIndex
    [junit] SEVERE: Master at: http://localhost:24101/solr/replication is not available. Index
fetch failed. Exception: The host did not accept the connection within timeout of 5000 ms
    [junit] ------------- ---------------- ---------------
    [junit] Testsuite: org.apache.solr.search.TestQueryUtils
    [junit] Tests run: 1, Failures: 0, Errors: 0, Time elapsed: 0.816 sec
    [junit] 
    [junit] Testsuite: org.apache.solr.search.TestRangeQuery
    [junit] Tests run: 2, Failures: 0, Errors: 0, Time elapsed: 16.5 sec
    [junit] 
    [junit] ------------- Standard Error -----------------
    [junit] 2010 DFómh 16 16:11:36 org.apache.solr.handler.SnapPuller fetchLatestIndex
    [junit] SEVERE: Master at: http://localhost:24101/solr/replication is not available. Index
fetch failed. Exception: The host did not accept the connection within timeout of 5000 ms
    [junit] 2010 DFómh 16 16:11:41 org.apache.solr.handler.SnapPuller fetchLatestIndex
    [junit] SEVERE: Master at: http://localhost:24101/solr/replication is not available. Index
fetch failed. Exception: The host did not accept the connection within timeout of 5000 ms
    [junit] 2010 DFómh 16 16:11:46 org.apache.solr.handler.SnapPuller fetchLatestIndex
    [junit] SEVERE: Master at: http://localhost:24101/solr/replication is not available. Index
fetch failed. Exception: The host did not accept the connection within timeout of 5000 ms
    [junit] 2010 DFómh 16 16:11:51 org.apache.solr.handler.SnapPuller fetchLatestIndex
    [junit] SEVERE: Master at: http://localhost:24101/solr/replication is not available. Index
fetch failed. Exception: The host did not accept the connection within timeout of 5000 ms
    [junit] ------------- ---------------- ---------------
    [junit] Testsuite: org.apache.solr.search.TestSearchPerf
    [junit] Tests run: 1, Failures: 0, Errors: 0, Time elapsed: 0.353 sec
    [junit] 
    [junit] Testsuite: org.apache.solr.search.TestSolrQueryParser
    [junit] Tests run: 1, Failures: 0, Errors: 0, Time elapsed: 0.508 sec
    [junit] 
    [junit] Testsuite: org.apache.solr.search.TestSort
    [junit] Tests run: 1, Failures: 0, Errors: 0, Time elapsed: 1.249 sec
    [junit] 
    [junit] Testsuite: org.apache.solr.search.function.SortByFunctionTest
    [junit] Tests run: 1, Failures: 0, Errors: 0, Time elapsed: 0.487 sec
    [junit] 
    [junit] Testsuite: org.apache.solr.search.function.TestFunctionQuery
    [junit] Tests run: 7, Failures: 0, Errors: 0, Time elapsed: 1.397 sec
    [junit] 
    [junit] ------------- Standard Error -----------------
    [junit] 16.10.2010 02:41:56 org.apache.solr.handler.SnapPuller fetchLatestIndex
    [junit] SCHWERWIEGEND: Master at: http://localhost:24101/solr/replication is not available.
Index fetch failed. Exception: The host did not accept the connection within timeout of 5000
ms
    [junit] 16.10.2010 02:41:56 org.apache.solr.SolrTestCaseJ4 assertQ
    [junit] SCHWERWIEGEND: REQUEST FAILED: fl=*,score&q={!func}10+wow+dude+ignore_exception
    [junit] ------------- ---------------- ---------------
    [junit] Testsuite: org.apache.solr.search.function.distance.DistanceFunctionTest
    [junit] Tests run: 2, Failures: 0, Errors: 0, Time elapsed: 0.387 sec
    [junit] 
    [junit] ------------- Standard Error -----------------
    [junit] 2010-10-16 12:41:56.MD org.apache.solr.SolrTestCaseJ4 assertQ
    [junit] SEVERE: REQUEST FAILED: fl=*,score&q={!func}sqedist(x_td,+y_td,+z_td,+w_td,+0,+0,+0)&fq=id:1
    [junit] ------------- ---------------- ---------------
    [junit] Testsuite: org.apache.solr.servlet.CacheHeaderTest
    [junit] Tests run: 5, Failures: 0, Errors: 0, Time elapsed: 0.767 sec
    [junit] 
    [junit] Testsuite: org.apache.solr.servlet.DirectSolrConnectionTest
    [junit] Tests run: 2, Failures: 0, Errors: 0, Time elapsed: 0.274 sec
    [junit] 
    [junit] ------------- Standard Error -----------------
    [junit] 15 ???? 2010 20:41:57 org.apache.solr.schema.IndexSchema readSchema
    [junit] SEVERE: uniqueKey should not be multivalued
    [junit] 15 ???? 2010 20:41:57 org.apache.solr.schema.IndexSchema readSchema
    [junit] SEVERE: uniqueKey should not be multivalued
    [junit] ------------- ---------------- ---------------
    [junit] Testsuite: org.apache.solr.servlet.NoCacheHeaderTest
    [junit] Tests run: 3, Failures: 0, Errors: 0, Time elapsed: 0.808 sec
    [junit] 
    [junit] Testsuite: org.apache.solr.servlet.SolrRequestParserTest
    [junit] Tests run: 4, Failures: 0, Errors: 0, Time elapsed: 4.117 sec
    [junit] 
    [junit] ------------- Standard Error -----------------
    [junit] 16/10/2010 05:42:01 ? org.apache.solr.handler.SnapPuller fetchLatestIndex
    [junit] SEVERE: Master at: http://localhost:24101/solr/replication is not available. Index
fetch failed. Exception: The host did not accept the connection within timeout of 5000 ms
    [junit] ------------- ---------------- ---------------
    [junit] Testsuite: org.apache.solr.spelling.FileBasedSpellCheckerTest
    [junit] Tests run: 3, Failures: 0, Errors: 0, Time elapsed: 0.681 sec
    [junit] 
    [junit] Testsuite: org.apache.solr.spelling.IndexBasedSpellCheckerTest
    [junit] Tests run: 5, Failures: 0, Errors: 0, Time elapsed: 0.705 sec
    [junit] 
    [junit] Testsuite: org.apache.solr.spelling.SpellingQueryConverterTest
    [junit] Tests run: 4, Failures: 0, Errors: 0, Time elapsed: 0.04 sec
    [junit] 
    [junit] Testsuite: org.apache.solr.spelling.suggest.SuggesterTest
    [junit] Tests run: 2, Failures: 0, Errors: 0, Time elapsed: 0.215 sec
    [junit] 
    [junit] ------------- Standard Error -----------------
    [junit] Oct 16, 2010 5:42:06 AM org.apache.solr.handler.SnapPuller fetchLatestIndex
    [junit] SEVERE: Master at: http://localhost:24101/solr/replication is not available. Index
fetch failed. Exception: The host did not accept the connection within timeout of 5000 ms
    [junit] ------------- ---------------- ---------------
    [junit] Testsuite: org.apache.solr.update.AutoCommitTest
    [junit] Tests run: 1, Failures: 0, Errors: 0, Time elapsed: 4.404 sec
    [junit] 
    [junit] Testsuite: org.apache.solr.update.DirectUpdateHandlerOptimizeTest
    [junit] Tests run: 1, Failures: 0, Errors: 0, Time elapsed: 0.698 sec
    [junit] 
    [junit] ------------- Standard Error -----------------
    [junit] 2010-10-16 06.42.11 org.apache.solr.handler.SnapPuller fetchLatestIndex
    [junit] SEVERE: Master at: http://localhost:24101/solr/replication is not available. Index
fetch failed. Exception: The host did not accept the connection within timeout of 5000 ms
    [junit] ------------- ---------------- ---------------
    [junit] Testsuite: org.apache.solr.update.DirectUpdateHandlerTest
    [junit] Tests run: 7, Failures: 0, Errors: 0, Time elapsed: 2.149 sec
    [junit] 
    [junit] Testsuite: org.apache.solr.update.DocumentBuilderTest
    [junit] Tests run: 3, Failures: 0, Errors: 0, Time elapsed: 0.559 sec
    [junit] 
    [junit] Testsuite: org.apache.solr.update.TestIndexingPerformance
    [junit] Tests run: 1, Failures: 0, Errors: 0, Time elapsed: 0.779 sec
    [junit] 
    [junit] ------------- Standard Output ---------------
    [junit] includeDoc=true doc=[text, simple, text, test, text, how now brown cow, text,
what's that?, text, radical!, text, what's all this about, anyway?, text, just how fast is
this text indexing?]
    [junit] iter=1000 time=219 throughput=4566
    [junit] ------------- ---------------- ---------------
    [junit] Testsuite: org.apache.solr.update.processor.SignatureUpdateProcessorFactoryTest
    [junit] Tests run: 2, Failures: 0, Errors: 0, Time elapsed: 1.273 sec
    [junit] 
    [junit] ------------- Standard Error -----------------
    [junit] 2010 Okt 16 07:42:16 org.apache.solr.handler.SnapPuller fetchLatestIndex
    [junit] SEVERE: Master at: http://localhost:24101/solr/replication is not available. Index
fetch failed. Exception: The host did not accept the connection within timeout of 5000 ms
    [junit] ------------- ---------------- ---------------
    [junit] Testsuite: org.apache.solr.update.processor.UpdateRequestProcessorFactoryTest
    [junit] Tests run: 1, Failures: 0, Errors: 0, Time elapsed: 0.712 sec
    [junit] 
    [junit] Testsuite: org.apache.solr.util.ArraysUtilsTest
    [junit] Tests run: 1, Failures: 0, Errors: 0, Time elapsed: 0.004 sec
    [junit] 
    [junit] Testsuite: org.apache.solr.util.DateMathParserTest
    [junit] Tests run: 7, Failures: 0, Errors: 0, Time elapsed: 0.061 sec
    [junit] 
    [junit] Testsuite: org.apache.solr.util.PrimUtilsTest
    [junit] Tests run: 1, Failures: 0, Errors: 0, Time elapsed: 0.018 sec
    [junit] 
    [junit] Testsuite: org.apache.solr.util.SolrPluginUtilsTest
    [junit] Tests run: 7, Failures: 0, Errors: 0, Time elapsed: 0.637 sec
    [junit] 
    [junit] Testsuite: org.apache.solr.util.TestNumberUtils
    [junit] Tests run: 1, Failures: 0, Errors: 0, Time elapsed: 0.302 sec
    [junit] 
    [junit] Testsuite: org.apache.solr.util.TestOpenBitSet
    [junit] Tests run: 3, Failures: 0, Errors: 0, Time elapsed: 0.587 sec
    [junit] 
    [junit] Testsuite: org.apache.solr.util.TestUtils
    [junit] Tests run: 3, Failures: 0, Errors: 0, Time elapsed: 0.014 sec
    [junit] 
    [junit] Testsuite: org.apache.solr.velocity.VelocityResponseWriterTest
    [junit] Tests run: 1, Failures: 0, Errors: 0, Time elapsed: 0.883 sec
    [junit] 
    [junit] Tests FAILED

BUILD FAILED
/usr<https://hudson.apache.org/hudson/job/Solr-3.x/ws/checkout/solr/build.xml>:381:
The following error occurred while executing this line:
/usr<https://hudson.apache.org/hudson/job/Solr-3.x/ws/checkout/solr/build.xml>:481:
Tests failed!

Total time: 5 minutes 43 seconds
[TASKS] Skipping publisher since build result is FAILURE
Publishing Javadoc
Archiving artifacts
Recording test results
Publishing Clover coverage report...
No Clover report will be published due to a Build Failure


---------------------------------------------------------------------
To unsubscribe, e-mail: dev-unsubscribe@lucene.apache.org
For additional commands, e-mail: dev-help@lucene.apache.org


Mime
View raw message