lucene-dev mailing list archives

Site index · List index
Message view « Date » · « Thread »
Top « Date » · « Thread »
From Apache Hudson Server <hud...@hudson.apache.org>
Subject Lucene-Solr-tests-only-3.x - Build # 521 - Failure
Date Mon, 25 Oct 2010 00:50:21 GMT
Build: http://hudson.zones.apache.org/hudson/job/Lucene-Solr-tests-only-3.x/521/

3 tests failed.
FAILED:  org.apache.solr.util.TestUtils.testRAMDirectory

Error Message:
Forked Java VM exited abnormally. Please note the time in the report does not reflect the
time until the VM exit.

Stack Trace:
junit.framework.AssertionFailedError: Forked Java VM exited abnormally. Please note the time
in the report does not reflect the time until the VM exit.
	at java.lang.Thread.run(Thread.java:636)


FAILED:  TEST-org.apache.solr.handler.TestCSVLoader.xml.<init>

Error Message:


Stack Trace:
Test report file /home/hudson/hudson-slave/workspace/Lucene-Solr-tests-only-3.x/checkout/solr/build/test-results/TEST-org.apache.solr.handler.TestCSVLoader.xml
was length 0

FAILED:  TEST-org.apache.solr.spelling.FileBasedSpellCheckerTest.xml.<init>

Error Message:


Stack Trace:
Test report file /home/hudson/hudson-slave/workspace/Lucene-Solr-tests-only-3.x/checkout/solr/build/test-results/TEST-org.apache.solr.spelling.FileBasedSpellCheckerTest.xml
was length 0



Build Log (for compile errors):
[...truncated 146197 lines...]



---------------------------------------------------------------------
To unsubscribe, e-mail: dev-unsubscribe@lucene.apache.org
For additional commands, e-mail: dev-help@lucene.apache.org


Mime
View raw message