lucene-dev mailing list archives

Site index · List index
Message view « Date » · « Thread »
Top « Date » · « Thread »
From Apache Hudson Server <hud...@hudson.apache.org>
Subject Build failed in Hudson: Lucene-Solr-tests-only-3.x #105
Date Fri, 15 Oct 2010 15:41:17 GMT
See <https://hudson.apache.org/hudson/job/Lucene-Solr-tests-only-3.x/105/>

------------------------------------------
[...truncated 3763 lines...]
    [junit] Tests run: 33, Failures: 0, Errors: 0, Time elapsed: 29.178 sec
    [junit] 
    [junit] Testsuite: org.apache.lucene.search.TestPositionIncrement
    [junit] Tests run: 2, Failures: 0, Errors: 0, Time elapsed: 0.04 sec
    [junit] 
    [junit] Testsuite: org.apache.lucene.search.spans.TestBasics
    [junit] Tests run: 23, Failures: 0, Errors: 0, Time elapsed: 6.445 sec
    [junit] 
    [junit] Testsuite: org.apache.lucene.search.spans.TestSpanExplanationsOfNonMatches
    [junit] Tests run: 31, Failures: 0, Errors: 0, Time elapsed: 0.09 sec
    [junit] 
    [junit] Testsuite: org.apache.lucene.search.TestMultiValuedNumericRangeQuery
    [junit] Tests run: 1, Failures: 0, Errors: 0, Time elapsed: 12.418 sec
    [junit] 
    [junit] Testsuite: org.apache.lucene.search.TestParallelMultiSearcher
    [junit] Tests run: 6, Failures: 0, Errors: 0, Time elapsed: 0.154 sec
    [junit] 
    [junit] Testsuite: org.apache.lucene.search.TestQueryTermVector
    [junit] Tests run: 1, Failures: 0, Errors: 0, Time elapsed: 0.007 sec
    [junit] 
    [junit] Testsuite: org.apache.lucene.search.TestSloppyPhraseQuery
    [junit] Tests run: 5, Failures: 0, Errors: 0, Time elapsed: 0.349 sec
    [junit] 
    [junit] Testsuite: org.apache.lucene.search.TestTermScorer
    [junit] Tests run: 3, Failures: 0, Errors: 0, Time elapsed: 0.019 sec
    [junit] 
    [junit] Testsuite: org.apache.lucene.search.TestSimpleExplanations
    [junit] Tests run: 53, Failures: 0, Errors: 0, Time elapsed: 3.708 sec
    [junit] 
    [junit] Testsuite: org.apache.lucene.search.function.TestOrdValues
    [junit] Tests run: 6, Failures: 0, Errors: 0, Time elapsed: 0.164 sec
    [junit] 
    [junit] Testsuite: org.apache.lucene.search.spans.TestSpans
    [junit] Tests run: 25, Failures: 0, Errors: 0, Time elapsed: 0.834 sec
    [junit] 
    [junit] Testsuite: org.apache.lucene.store.TestRAMDirectory
    [junit] Tests run: 4, Failures: 0, Errors: 0, Time elapsed: 0.168 sec
    [junit] 
    [junit] Testsuite: org.apache.lucene.store.TestLockFactory
    [junit] Tests run: 11, Failures: 0, Errors: 0, Time elapsed: 4.038 sec
    [junit] 
    [junit] Testsuite: org.apache.lucene.util.TestFieldCacheSanityChecker
    [junit] Tests run: 4, Failures: 0, Errors: 0, Time elapsed: 0.335 sec
    [junit] 
    [junit] Testsuite: org.apache.lucene.util.TestSetOnce
    [junit] Tests run: 4, Failures: 0, Errors: 0, Time elapsed: 0.018 sec
    [junit] 
    [junit] Testsuite: org.apache.lucene.index.TestIndexWriter
    [junit] Testcase: testAddIndexesWithThreads(org.apache.lucene.index.TestIndexWriter):
FAILED
    [junit] expected:<3160> but was:<1120>
    [junit] junit.framework.AssertionFailedError: expected:<3160> but was:<1120>
    [junit] 	at org.apache.lucene.util.LuceneTestCase$LuceneTestCaseRunner.runChild(LuceneTestCase.java:693)
    [junit] 	at org.apache.lucene.util.LuceneTestCase$LuceneTestCaseRunner.runChild(LuceneTestCase.java:666)
    [junit] 	at org.apache.lucene.index.TestIndexWriter.testAddIndexesWithThreads(TestIndexWriter.java:3834)
    [junit] 
    [junit] 
    [junit] Testcase: testAddIndexesWithThreads(org.apache.lucene.index.TestIndexWriter):
FAILED
    [junit] ConcurrentMergeScheduler hit unhandled exceptions
    [junit] junit.framework.AssertionFailedError: ConcurrentMergeScheduler hit unhandled exceptions
    [junit] 	at org.apache.lucene.util.LuceneTestCase$LuceneTestCaseRunner.runChild(LuceneTestCase.java:693)
    [junit] 	at org.apache.lucene.util.LuceneTestCase$LuceneTestCaseRunner.runChild(LuceneTestCase.java:666)
    [junit] 	at org.apache.lucene.util.LuceneTestCase.tearDown(LuceneTestCase.java:331)
    [junit] 
    [junit] 
    [junit] Tests run: 116, Failures: 2, Errors: 0, Time elapsed: 41.067 sec
    [junit] 
    [junit] ------------- Standard Output ---------------
    [junit] java.lang.AssertionError: file _8g.cfs does not exist
    [junit] 	at org.apache.lucene.index.IndexWriter.filesExist(IndexWriter.java:4323)
    [junit] 	at org.apache.lucene.index.IndexWriter.startCommit(IndexWriter.java:4376)
    [junit] 	at org.apache.lucene.index.IndexWriter.prepareCommit(IndexWriter.java:3153)
    [junit] 	at org.apache.lucene.index.IndexWriter.commit(IndexWriter.java:3226)
    [junit] 	at org.apache.lucene.index.IndexWriter.commit(IndexWriter.java:3197)
    [junit] 	at org.apache.lucene.index.TestIndexWriter$CommitAndAddIndexes.doBody(TestIndexWriter.java:3814)
    [junit] 	at org.apache.lucene.index.TestIndexWriter$RunAddIndexesThreads$1.run(TestIndexWriter.java:3750)
    [junit] java.lang.AssertionError: file _8g.cfs does not exist
    [junit] 	at org.apache.lucene.index.IndexWriter.filesExist(IndexWriter.java:4323)
    [junit] 	at org.apache.lucene.index.IndexWriter.startCommit(IndexWriter.java:4376)
    [junit] 	at org.apache.lucene.index.IndexWriter.prepareCommit(IndexWriter.java:3153)
    [junit] 	at org.apache.lucene.index.IndexWriter.commit(IndexWriter.java:3226)
    [junit] 	at org.apache.lucene.index.IndexWriter.commit(IndexWriter.java:3197)
    [junit] 	at org.apache.lucene.index.TestIndexWriter$CommitAndAddIndexes.doBody(TestIndexWriter.java:3814)
    [junit] 	at org.apache.lucene.index.TestIndexWriter$RunAddIndexesThreads$1.run(TestIndexWriter.java:3750)
    [junit] java.lang.AssertionError: file _8g.cfs does not exist
    [junit] 	at org.apache.lucene.index.IndexWriter.filesExist(IndexWriter.java:4323)
    [junit] 	at org.apache.lucene.index.IndexWriter.startCommit(IndexWriter.java:4376)
    [junit] 	at org.apache.lucene.index.IndexWriter.prepareCommit(IndexWriter.java:3153)
    [junit] 	at org.apache.lucene.index.IndexWriter.commit(IndexWriter.java:3226)
    [junit] 	at org.apache.lucene.index.IndexWriter.commit(IndexWriter.java:3197)
    [junit] 	at org.apache.lucene.index.TestIndexWriter$CommitAndAddIndexes.doBody(TestIndexWriter.java:3814)
    [junit] 	at org.apache.lucene.index.TestIndexWriter$RunAddIndexesThreads$1.run(TestIndexWriter.java:3750)
    [junit] java.lang.AssertionError: file _8g.cfs does not exist
    [junit] 	at org.apache.lucene.index.IndexWriter.filesExist(IndexWriter.java:4323)
    [junit] 	at org.apache.lucene.index.IndexWriter.startCommit(IndexWriter.java:4376)
    [junit] 	at org.apache.lucene.index.IndexWriter.prepareCommit(IndexWriter.java:3153)
    [junit] 	at org.apache.lucene.index.IndexWriter.commit(IndexWriter.java:3226)
    [junit] 	at org.apache.lucene.index.IndexWriter.commit(IndexWriter.java:3197)
    [junit] 	at org.apache.lucene.index.TestIndexWriter$CommitAndAddIndexes.doBody(TestIndexWriter.java:3814)
    [junit] 	at org.apache.lucene.index.TestIndexWriter$RunAddIndexesThreads$1.run(TestIndexWriter.java:3750)
    [junit] java.lang.AssertionError: file _8g.cfs does not exist
    [junit] 	at org.apache.lucene.index.IndexWriter.filesExist(IndexWriter.java:4323)
    [junit] 	at org.apache.lucene.index.IndexWriter.startCommit(IndexWriter.java:4376)
    [junit] 	at org.apache.lucene.index.IndexWriter.prepareCommit(IndexWriter.java:3153)
    [junit] 	at org.apache.lucene.index.IndexWriter.commit(IndexWriter.java:3226)
    [junit] 	at org.apache.lucene.index.IndexWriter.commit(IndexWriter.java:3197)
    [junit] 	at org.apache.lucene.index.TestIndexWriter$CommitAndAddIndexes.doBody(TestIndexWriter.java:3814)
    [junit] 	at org.apache.lucene.index.TestIndexWriter$RunAddIndexesThreads$1.run(TestIndexWriter.java:3750)
    [junit] NOTE: reproduce with: ant test -Dtestcase=TestIndexWriter -Dtestmethod=testAddIndexesWithThreads
-Dtests.seed=7480867096386898158:370121405519314487
    [junit] NOTE: test params are: locale=mt, timezone=BST
    [junit] ------------- ---------------- ---------------
    [junit] TEST org.apache.lucene.index.TestIndexWriter FAILED
    [junit] Testsuite: org.apache.lucene.index.TestIndexWriterConfig
    [junit] Tests run: 7, Failures: 0, Errors: 0, Time elapsed: 0.018 sec
    [junit] 
    [junit] Testsuite: org.apache.lucene.index.TestNewestSegment
    [junit] Tests run: 1, Failures: 0, Errors: 0, Time elapsed: 0.008 sec
    [junit] 
    [junit] Testsuite: org.apache.lucene.search.TestSort
    [junit] Tests run: 25, Failures: 0, Errors: 0, Time elapsed: 4.037 sec
    [junit] 
    [junit] Testsuite: org.apache.lucene.search.TestTermRangeFilter
    [junit] Tests run: 7, Failures: 0, Errors: 0, Time elapsed: 2.113 sec
    [junit] 
    [junit] Testsuite: org.apache.lucene.index.TestPersistentSnapshotDeletionPolicy
    [junit] Tests run: 14, Failures: 0, Errors: 0, Time elapsed: 3.397 sec
    [junit] 
    [junit] Testsuite: org.apache.lucene.index.TestRollback
    [junit] Tests run: 1, Failures: 0, Errors: 0, Time elapsed: 0.011 sec
    [junit] 
    [junit] Testsuite: org.apache.lucene.util.TestIndexableBinaryStringTools
    [junit] Tests run: 10, Failures: 0, Errors: 0, Time elapsed: 5.142 sec
    [junit] 
    [junit] Testsuite: org.apache.lucene.util.TestSortedVIntList
    [junit] Tests run: 19, Failures: 0, Errors: 0, Time elapsed: 0.018 sec
    [junit] 
    [junit] Testsuite: org.apache.lucene.index.TestThreadedOptimize
    [junit] Tests run: 1, Failures: 0, Errors: 0, Time elapsed: 3.496 sec
    [junit] 
    [junit] Testsuite: org.apache.lucene.index.TestWordlistLoader
    [junit] Tests run: 3, Failures: 0, Errors: 0, Time elapsed: 0.013 sec
    [junit] 
    [junit] Testsuite: org.apache.lucene.messages.TestNLS
    [junit] Tests run: 6, Failures: 0, Errors: 0, Time elapsed: 0.022 sec
    [junit] 
    [junit] ------------- Standard Error -----------------
    [junit] WARN: Message with key:Q0005E_MESSAGE_NOT_IN_BUNDLE and locale: cs_CZ not found.
    [junit] ------------- ---------------- ---------------
    [junit] Testsuite: org.apache.lucene.queryParser.TestQueryParser
    [junit] Tests run: 35, Failures: 0, Errors: 0, Time elapsed: 0.223 sec
    [junit] 
    [junit] Testsuite: org.apache.lucene.search.TestNumericRangeQuery32
    [junit] Tests run: 27, Failures: 0, Errors: 0, Time elapsed: 20.773 sec
    [junit] 
    [junit] Testsuite: org.apache.lucene.search.TestPositiveScoresOnlyCollector
    [junit] Tests run: 1, Failures: 0, Errors: 0, Time elapsed: 0.014 sec
    [junit] 
    [junit] Testsuite: org.apache.lucene.search.TestPrefixQuery
    [junit] Tests run: 1, Failures: 0, Errors: 0, Time elapsed: 0.007 sec
    [junit] 
    [junit] Testsuite: org.apache.lucene.util.TestStringIntern
    [junit] Tests run: 1, Failures: 0, Errors: 0, Time elapsed: 4.137 sec
    [junit] 
    [junit] Testsuite: org.apache.lucene.search.TestTimeLimitingCollector
    [junit] Tests run: 6, Failures: 0, Errors: 0, Time elapsed: 1.308 sec
    [junit] 
    [junit] Testsuite: org.apache.lucene.search.TestTopScoreDocCollector
    [junit] Tests run: 1, Failures: 0, Errors: 0, Time elapsed: 0.007 sec
    [junit] 
    [junit] Testsuite: org.apache.lucene.search.spans.TestFieldMaskingSpanQuery
    [junit] Tests run: 11, Failures: 0, Errors: 0, Time elapsed: 0.642 sec
    [junit] 
    [junit] Testsuite: org.apache.lucene.store.TestFileSwitchDirectory
    [junit] Tests run: 1, Failures: 0, Errors: 0, Time elapsed: 0.023 sec
    [junit] 
    [junit] Testsuite: org.apache.lucene.search.TestThreadSafe
    [junit] Tests run: 1, Failures: 0, Errors: 0, Time elapsed: 7.038 sec
    [junit] 
    [junit] Testsuite: org.apache.lucene.store.TestWindowsMMap
    [junit] Tests run: 1, Failures: 0, Errors: 0, Time elapsed: 1.491 sec
    [junit] 
    [junit] Testsuite: org.apache.lucene.search.spans.TestPayloadSpans
    [junit] Tests run: 10, Failures: 0, Errors: 0, Time elapsed: 0.716 sec
    [junit] 
    [junit] Testsuite: org.apache.lucene.util.TestBitVector
    [junit] Tests run: 7, Failures: 0, Errors: 0, Time elapsed: 0.626 sec
    [junit] 
    [junit] Testsuite: org.apache.lucene.util.TestCharacterUtils
    [junit] Tests run: 7, Failures: 0, Errors: 0, Time elapsed: 0.009 sec
    [junit] 
    [junit] Testsuite: org.apache.lucene.search.TestBooleanMinShouldMatch
    [junit] Tests run: 15, Failures: 0, Errors: 0, Time elapsed: 5.435 sec
    [junit] 
    [junit] Testsuite: org.apache.lucene.search.TestBooleanPrefixQuery
    [junit] Tests run: 1, Failures: 0, Errors: 0, Time elapsed: 0.021 sec
    [junit] 
    [junit] Testsuite: org.apache.lucene.search.TestDocIdSet
    [junit] Tests run: 2, Failures: 0, Errors: 0, Time elapsed: 0.008 sec
    [junit] 
    [junit] Testsuite: org.apache.lucene.search.TestFuzzyQuery
    [junit] Tests run: 5, Failures: 0, Errors: 0, Time elapsed: 0.024 sec
    [junit] 
    [junit] Testsuite: org.apache.lucene.search.TestSpanQueryFilter
    [junit] Tests run: 1, Failures: 0, Errors: 0, Time elapsed: 0.025 sec
    [junit] 
    [junit] Testsuite: org.apache.lucene.search.TestTopDocsCollector
    [junit] Tests run: 8, Failures: 0, Errors: 0, Time elapsed: 0.018 sec
    [junit] 
    [junit] Testsuite: org.apache.lucene.search.function.TestFieldScoreQuery
    [junit] Tests run: 12, Failures: 0, Errors: 0, Time elapsed: 0.203 sec
    [junit] 
    [junit] Testsuite: org.apache.lucene.search.payloads.TestPayloadTermQuery
    [junit] Tests run: 6, Failures: 0, Errors: 0, Time elapsed: 0.628 sec
    [junit] 
    [junit] Testsuite: org.apache.lucene.search.spans.TestNearSpansOrdered
    [junit] Tests run: 10, Failures: 0, Errors: 0, Time elapsed: 0.049 sec
    [junit] 
    [junit] Testsuite: org.apache.lucene.search.spans.TestSpansAdvanced
    [junit] Tests run: 1, Failures: 0, Errors: 0, Time elapsed: 0.04 sec
    [junit] 
    [junit] Testsuite: org.apache.lucene.store.TestMultiMMap
    [junit] Tests run: 1, Failures: 0, Errors: 0, Time elapsed: 0.49 sec
    [junit] 
    [junit] Testsuite: org.apache.lucene.util.TestCloseableThreadLocal
    [junit] Tests run: 3, Failures: 0, Errors: 0, Time elapsed: 0.006 sec
    [junit] 
    [junit] Testsuite: org.apache.lucene.store.TestHugeRamFile
    [junit] Tests run: 1, Failures: 0, Errors: 0, Time elapsed: 6.744 sec
    [junit] 
    [junit] Testsuite: org.apache.lucene.util.TestOpenBitSet
    [junit] Tests run: 5, Failures: 0, Errors: 0, Time elapsed: 1.839 sec
    [junit] 
    [junit] Testsuite: org.apache.lucene.util.TestPriorityQueue
    [junit] Tests run: 4, Failures: 0, Errors: 0, Time elapsed: 0.028 sec
    [junit] 
    [junit] Testsuite: org.apache.lucene.util.TestStringHelper
    [junit] Tests run: 1, Failures: 0, Errors: 0, Time elapsed: 0.004 sec
    [junit] 
    [junit] Testsuite: org.apache.lucene.util.TestNumericUtils
    [junit] Tests run: 10, Failures: 0, Errors: 0, Time elapsed: 12.616 sec
    [junit] 
    [junit] Tests FAILED

BUILD FAILED
/usr<https://hudson.apache.org/hudson/job/Lucene-Solr-tests-only-3.x/ws/checkout/build.xml>:23:
The following error occurred while executing this line:
/usr<https://hudson.apache.org/hudson/job/Lucene-Solr-tests-only-3.x/ws/checkout/lucene/common-build.xml>:513:
The following error occurred while executing this line:
/usr<https://hudson.apache.org/hudson/job/Lucene-Solr-tests-only-3.x/ws/checkout/lucene/common-build.xml>:497:
Tests failed!

Total time: 1 minute 16 seconds
Recording test results


---------------------------------------------------------------------
To unsubscribe, e-mail: dev-unsubscribe@lucene.apache.org
For additional commands, e-mail: dev-help@lucene.apache.org


Mime
View raw message