lucene-dev mailing list archives

Site index · List index
Message view « Date » · « Thread »
Top « Date » · « Thread »
From Apache Hudson Server <hud...@hudson.apache.org>
Subject Lucene-Solr-tests-only-trunk - Build # 814 - Failure
Date Sun, 31 Oct 2010 12:36:32 GMT
Build: http://hudson.zones.apache.org/hudson/job/Lucene-Solr-tests-only-trunk/814/

6 tests failed.
REGRESSION:  org.apache.solr.handler.TestReplicationHandler.testIndexAndConfigReplication

Error Message:
Severe errors in solr configuration.  Check your log files for more detailed information on
what may be wrong.  ------------------------------------------------------------- org.xml.sax.SAXParseException;
Premature end of file.  at org.apache.xerces.parsers.DOMParser.parse(Unknown Source)  at org.apache.xerces.jaxp.DocumentBuilderImpl.parse(Unknown
Source)  at javax.xml.parsers.DocumentBuilder.parse(DocumentBuilder.java:121)  at org.apache.solr.core.Config.<init>(Config.java:118)
 at org.apache.solr.schema.IndexSchema.readSchema(IndexSchema.java:422)  at org.apache.solr.schema.IndexSchema.<init>(IndexSchema.java:122)
 at org.apache.solr.core.CoreContainer.create(CoreContainer.java:655)  at org.apache.solr.core.CoreContainer.reload(CoreContainer.java:722)
 at org.apache.solr.handler.SnapPuller$2.run(SnapPuller.java:494)  Severe errors in solr configuration.
 Check your log files for more detailed information on what may be wrong.  -------------------------------------------------------------
org.xml.sax.SAXParseException; Premature end of file.  at org.apache.xerces.parsers.DOMParser.parse(Unknown
Source)  at org.apache.xerces.jaxp.DocumentBuilderImpl.parse(Unknown Source)  at javax.xml.parsers.DocumentBuilder.parse(DocumentBuilder.java:121)
 at org.apache.solr.core.Config.<init>(Config.java:118)  at org.apache.solr.schema.IndexSchema.readSchema(IndexSchema.java:422)
 at org.apache.solr.schema.IndexSchema.<init>(IndexSchema.java:122)  at org.apache.solr.core.CoreContainer.create(CoreContainer.java:655)
 at org.apache.solr.core.CoreContainer.reload(CoreContainer.java:722)  at org.apache.solr.handler.SnapPuller$2.run(SnapPuller.java:494)
 request: http://localhost:31664/solr/update?wt=javabin&version=2

Stack Trace:


request: http://localhost:31664/solr/update?wt=javabin&version=2
	at org.apache.solr.client.solrj.impl.CommonsHttpSolrServer.request(CommonsHttpSolrServer.java:435)
	at org.apache.solr.client.solrj.impl.CommonsHttpSolrServer.request(CommonsHttpSolrServer.java:244)
	at org.apache.solr.client.solrj.request.AbstractUpdateRequest.process(AbstractUpdateRequest.java:105)
	at org.apache.solr.client.solrj.SolrServer.add(SolrServer.java:65)
	at org.apache.solr.handler.TestReplicationHandler.index(TestReplicationHandler.java:133)
	at org.apache.solr.handler.TestReplicationHandler.testIndexAndConfigReplication(TestReplicationHandler.java:270)
	at org.apache.lucene.util.LuceneTestCase$LuceneTestCaseRunner.runChild(LuceneTestCase.java:878)
	at org.apache.lucene.util.LuceneTestCase$LuceneTestCaseRunner.runChild(LuceneTestCase.java:844)


REGRESSION:  org.apache.solr.handler.TestReplicationHandler.testStopPoll

Error Message:
Error executing query

Stack Trace:
org.apache.solr.client.solrj.SolrServerException: Error executing query
	at org.apache.solr.client.solrj.request.QueryRequest.process(QueryRequest.java:95)
	at org.apache.solr.client.solrj.SolrServer.query(SolrServer.java:119)
	at org.apache.solr.handler.TestReplicationHandler.query(TestReplicationHandler.java:142)
	at org.apache.solr.handler.TestReplicationHandler.clearIndexWithReplication(TestReplicationHandler.java:85)
	at org.apache.solr.handler.TestReplicationHandler.testStopPoll(TestReplicationHandler.java:285)
	at org.apache.lucene.util.LuceneTestCase$LuceneTestCaseRunner.runChild(LuceneTestCase.java:878)
	at org.apache.lucene.util.LuceneTestCase$LuceneTestCaseRunner.runChild(LuceneTestCase.java:844)


request: http://localhost:31664/solr/select?q=*:*&wt=javabin&version=2
	at org.apache.solr.client.solrj.impl.CommonsHttpSolrServer.request(CommonsHttpSolrServer.java:435)
	at org.apache.solr.client.solrj.impl.CommonsHttpSolrServer.request(CommonsHttpSolrServer.java:244)
	at org.apache.solr.client.solrj.request.QueryRequest.process(QueryRequest.java:89)


REGRESSION:  org.apache.solr.handler.TestReplicationHandler.testSnapPullWithMasterUrl

Error Message:
Severe errors in solr configuration.  Check your log files for more detailed information on
what may be wrong.  ------------------------------------------------------------- org.xml.sax.SAXParseException;
Premature end of file.  at org.apache.xerces.parsers.DOMParser.parse(Unknown Source)  at org.apache.xerces.jaxp.DocumentBuilderImpl.parse(Unknown
Source)  at javax.xml.parsers.DocumentBuilder.parse(DocumentBuilder.java:121)  at org.apache.solr.core.Config.<init>(Config.java:118)
 at org.apache.solr.schema.IndexSchema.readSchema(IndexSchema.java:422)  at org.apache.solr.schema.IndexSchema.<init>(IndexSchema.java:122)
 at org.apache.solr.core.CoreContainer.create(CoreContainer.java:655)  at org.apache.solr.core.CoreContainer.reload(CoreContainer.java:722)
 at org.apache.solr.handler.SnapPuller$2.run(SnapPuller.java:494)  Severe errors in solr configuration.
 Check your log files for more detailed information on what may be wrong.  -------------------------------------------------------------
org.xml.sax.SAXParseException; Premature end of file.  at org.apache.xerces.parsers.DOMParser.parse(Unknown
Source)  at org.apache.xerces.jaxp.DocumentBuilderImpl.parse(Unknown Source)  at javax.xml.parsers.DocumentBuilder.parse(DocumentBuilder.java:121)
 at org.apache.solr.core.Config.<init>(Config.java:118)  at org.apache.solr.schema.IndexSchema.readSchema(IndexSchema.java:422)
 at org.apache.solr.schema.IndexSchema.<init>(IndexSchema.java:122)  at org.apache.solr.core.CoreContainer.create(CoreContainer.java:655)
 at org.apache.solr.core.CoreContainer.reload(CoreContainer.java:722)  at org.apache.solr.handler.SnapPuller$2.run(SnapPuller.java:494)
 request: http://localhost:31664/solr/update?wt=javabin&version=2

Stack Trace:


request: http://localhost:31664/solr/update?wt=javabin&version=2
	at org.apache.solr.client.solrj.impl.CommonsHttpSolrServer.request(CommonsHttpSolrServer.java:435)
	at org.apache.solr.client.solrj.impl.CommonsHttpSolrServer.request(CommonsHttpSolrServer.java:244)
	at org.apache.solr.client.solrj.request.AbstractUpdateRequest.process(AbstractUpdateRequest.java:105)
	at org.apache.solr.client.solrj.SolrServer.deleteByQuery(SolrServer.java:111)
	at org.apache.solr.handler.TestReplicationHandler.testSnapPullWithMasterUrl(TestReplicationHandler.java:360)
	at org.apache.lucene.util.LuceneTestCase$LuceneTestCaseRunner.runChild(LuceneTestCase.java:878)
	at org.apache.lucene.util.LuceneTestCase$LuceneTestCaseRunner.runChild(LuceneTestCase.java:844)


REGRESSION:  org.apache.solr.handler.TestReplicationHandler.testReplicateAfterStartup

Error Message:
Severe errors in solr configuration.  Check your log files for more detailed information on
what may be wrong.  ------------------------------------------------------------- org.xml.sax.SAXParseException;
Premature end of file.  at org.apache.xerces.parsers.DOMParser.parse(Unknown Source)  at org.apache.xerces.jaxp.DocumentBuilderImpl.parse(Unknown
Source)  at javax.xml.parsers.DocumentBuilder.parse(DocumentBuilder.java:121)  at org.apache.solr.core.Config.<init>(Config.java:118)
 at org.apache.solr.schema.IndexSchema.readSchema(IndexSchema.java:422)  at org.apache.solr.schema.IndexSchema.<init>(IndexSchema.java:122)
 at org.apache.solr.core.CoreContainer.create(CoreContainer.java:655)  at org.apache.solr.core.CoreContainer.reload(CoreContainer.java:722)
 at org.apache.solr.handler.SnapPuller$2.run(SnapPuller.java:494)  Severe errors in solr configuration.
 Check your log files for more detailed information on what may be wrong.  -------------------------------------------------------------
org.xml.sax.SAXParseException; Premature end of file.  at org.apache.xerces.parsers.DOMParser.parse(Unknown
Source)  at org.apache.xerces.jaxp.DocumentBuilderImpl.parse(Unknown Source)  at javax.xml.parsers.DocumentBuilder.parse(DocumentBuilder.java:121)
 at org.apache.solr.core.Config.<init>(Config.java:118)  at org.apache.solr.schema.IndexSchema.readSchema(IndexSchema.java:422)
 at org.apache.solr.schema.IndexSchema.<init>(IndexSchema.java:122)  at org.apache.solr.core.CoreContainer.create(CoreContainer.java:655)
 at org.apache.solr.core.CoreContainer.reload(CoreContainer.java:722)  at org.apache.solr.handler.SnapPuller$2.run(SnapPuller.java:494)
 request: http://localhost:31664/solr/update?wt=javabin&version=2

Stack Trace:


request: http://localhost:31664/solr/update?wt=javabin&version=2
	at org.apache.solr.client.solrj.impl.CommonsHttpSolrServer.request(CommonsHttpSolrServer.java:435)
	at org.apache.solr.client.solrj.impl.CommonsHttpSolrServer.request(CommonsHttpSolrServer.java:244)
	at org.apache.solr.client.solrj.request.AbstractUpdateRequest.process(AbstractUpdateRequest.java:105)
	at org.apache.solr.client.solrj.SolrServer.deleteByQuery(SolrServer.java:111)
	at org.apache.solr.handler.TestReplicationHandler.testReplicateAfterStartup(TestReplicationHandler.java:405)
	at org.apache.lucene.util.LuceneTestCase$LuceneTestCaseRunner.runChild(LuceneTestCase.java:878)
	at org.apache.lucene.util.LuceneTestCase$LuceneTestCaseRunner.runChild(LuceneTestCase.java:844)


REGRESSION:  org.apache.solr.handler.TestReplicationHandler.testIndexAndConfigAliasReplication

Error Message:
Error executing query

Stack Trace:
org.apache.solr.client.solrj.SolrServerException: Error executing query
	at org.apache.solr.client.solrj.request.QueryRequest.process(QueryRequest.java:95)
	at org.apache.solr.client.solrj.SolrServer.query(SolrServer.java:119)
	at org.apache.solr.handler.TestReplicationHandler.query(TestReplicationHandler.java:142)
	at org.apache.solr.handler.TestReplicationHandler.clearIndexWithReplication(TestReplicationHandler.java:85)
	at org.apache.solr.handler.TestReplicationHandler.testIndexAndConfigAliasReplication(TestReplicationHandler.java:455)
	at org.apache.lucene.util.LuceneTestCase$LuceneTestCaseRunner.runChild(LuceneTestCase.java:878)
	at org.apache.lucene.util.LuceneTestCase$LuceneTestCaseRunner.runChild(LuceneTestCase.java:844)


request: http://localhost:31664/solr/select?q=*:*&wt=javabin&version=2
	at org.apache.solr.client.solrj.impl.CommonsHttpSolrServer.request(CommonsHttpSolrServer.java:435)
	at org.apache.solr.client.solrj.impl.CommonsHttpSolrServer.request(CommonsHttpSolrServer.java:244)
	at org.apache.solr.client.solrj.request.QueryRequest.process(QueryRequest.java:89)


REGRESSION:  org.apache.solr.handler.TestReplicationHandler.testBackup

Error Message:
Severe errors in solr configuration.  Check your log files for more detailed information on
what may be wrong.  ------------------------------------------------------------- org.xml.sax.SAXParseException;
Premature end of file.  at org.apache.xerces.parsers.DOMParser.parse(Unknown Source)  at org.apache.xerces.jaxp.DocumentBuilderImpl.parse(Unknown
Source)  at javax.xml.parsers.DocumentBuilder.parse(DocumentBuilder.java:121)  at org.apache.solr.core.Config.<init>(Config.java:118)
 at org.apache.solr.schema.IndexSchema.readSchema(IndexSchema.java:422)  at org.apache.solr.schema.IndexSchema.<init>(IndexSchema.java:122)
 at org.apache.solr.core.CoreContainer.create(CoreContainer.java:655)  at org.apache.solr.core.CoreContainer.reload(CoreContainer.java:722)
 at org.apache.solr.handler.SnapPuller$2.run(SnapPuller.java:494) -------------------------------------------------------------
org.apache.solr.common.SolrException: Schema Parsing Failed  at org.apache.solr.schema.IndexSchema.readSchema(IndexSchema.java:678)
 at org.apache.solr.schema.IndexSchema.<init>(IndexSchema.java:122)  at org.apache.solr.core.CoreContainer.create(CoreContainer.java:655)
 at org.apache.solr.core.CoreContainer.load(CoreContainer.java:412)  at org.apache.solr.core.CoreContainer$Initializer.initialize(CoreContainer.java:246)
 at org.apache.solr.servlet.SolrDispatchFilter.init(SolrDispatchFilter.java:86)  at org.mortbay.jetty.servlet.FilterHolder.doStart(FilterHolder.java:97)
 at org.mortbay.component.AbstractLifeCycle.start(AbstractLifeCycle.java:50)  at org.mortbay.jetty.servlet.ServletHandler.initialize(ServletHandler.java:662)
 at org.mortbay.jetty.servlet.ServletHandler.updateMappings(ServletHandler.java:1053)  at
org.mortbay.jetty.servlet.ServletHandler.setFilterMappings(ServletHandler.java:1089)  at org.mortbay.jetty.servlet.ServletHandler.addFilterWithMapping(ServletHandler.java:889)
 at org.mortbay.jetty.servlet.ServletHandler.addFilterWithMapping(ServletHandler.java:844)
 at org.mortbay.jetty.servlet.Context.addFilter(Context.java:20  Severe errors in solr configuration.
 Check your log files for more detailed information on what may be wrong.  -------------------------------------------------------------
org.xml.sax.SAXParseException; Premature end of file.  at org.apache.xerces.parsers.DOMParser.parse(Unknown
Source)  at org.apache.xerces.jaxp.DocumentBuilderImpl.parse(Unknown Source)  at javax.xml.parsers.DocumentBuilder.parse(DocumentBuilder.java:121)
 at org.apache.solr.core.Config.<init>(Config.java:118)  at org.apache.solr.schema.IndexSchema.readSchema(IndexSchema.java:422)
 at org.apache.solr.schema.IndexSchema.<init>(IndexSchema.java:122)  at org.apache.solr.core.CoreContainer.create(CoreContainer.java:655)
 at org.apache.solr.core.CoreContainer.reload(CoreContainer.java:722)  at org.apache.solr.handler.SnapPuller$2.run(SnapPuller.java:494)
------------------------------------------------------------- org.apache.solr.common.SolrException:
Schema Parsing Failed  at org.apache.solr.schema.IndexSchema.readSchema(IndexSchema.java:678)
 at org.apache.solr.schema.IndexSchema.<init>(IndexSchema.java:122)  at org.apache.solr.core.CoreContainer.create(CoreContainer.java:655)
 at org.apache.solr.core.CoreContainer.load(CoreContainer.java:412)  at org.apache.solr.core.CoreContainer$Initializer.initialize(CoreContainer.java:246)
 at org.apache.solr.servlet.SolrDispatchFilter.init(SolrDispatchFilter.java:86)  at org.mortbay.jetty.servlet.FilterHolder.doStart(FilterHolder.java:97)
 at org.mortbay.component.AbstractLifeCycle.start(AbstractLifeCycle.java:50)  at org.mortbay.jetty.servlet.ServletHandler.initialize(ServletHandler.java:662)
 at org.mortbay.jetty.servlet.ServletHandler.updateMappings(ServletHandler.java:1053)  at
org.mortbay.jetty.servlet.ServletHandler.setFilterMappings(ServletHandler.java:1089)  at org.mortbay.jetty.servlet.ServletHandler.addFilterWithMapping(ServletHandler.java:889)
 at org.mortbay.jetty.servlet.ServletHandler.addFilterWithMapping(ServletHandler.java:844)
 at org.mortbay.jetty.servlet.Context.addFilter(Context.java:20  request: http://localhost:31671/solr/update?wt=javabin&version=2

Stack Trace:


request: http://localhost:31671/solr/update?wt=javabin&version=2
	at org.apache.solr.client.solrj.impl.CommonsHttpSolrServer.request(CommonsHttpSolrServer.java:435)
	at org.apache.solr.client.solrj.impl.CommonsHttpSolrServer.request(CommonsHttpSolrServer.java:244)
	at org.apache.solr.client.solrj.request.AbstractUpdateRequest.process(AbstractUpdateRequest.java:105)
	at org.apache.solr.client.solrj.SolrServer.deleteByQuery(SolrServer.java:111)
	at org.apache.solr.handler.TestReplicationHandler.testBackup(TestReplicationHandler.java:535)
	at org.apache.lucene.util.LuceneTestCase$LuceneTestCaseRunner.runChild(LuceneTestCase.java:878)
	at org.apache.lucene.util.LuceneTestCase$LuceneTestCaseRunner.runChild(LuceneTestCase.java:844)




Build Log (for compile errors):
[...truncated 9022 lines...]



---------------------------------------------------------------------
To unsubscribe, e-mail: dev-unsubscribe@lucene.apache.org
For additional commands, e-mail: dev-help@lucene.apache.org


Mime
View raw message