lucene-dev mailing list archives

Site index · List index
Message view « Date » · « Thread »
Top « Date » · « Thread »
From Apache Hudson Server <hud...@hudson.apache.org>
Subject Build failed in Hudson: Solr-trunk #1285
Date Mon, 18 Oct 2010 08:52:56 GMT
See <https://hudson.apache.org/hudson/job/Solr-trunk/1285/changes>

Changes:

[yonik] tests: temp hack to close unused core container

[rmuir] LUCENE-2712: Fix FieldBoostMapAttribute to not use CharSequence as a map key

[rmuir] remove suppressed generics violations

[rmuir] only spellchecker tests need create spellcheck indexes

[yonik] tests: close requests

[yonik] tests: close requests

[yonik] tests: close requests

[yonik] tests: close requests

[yonik] tests: close requests

[yonik] close request even if exception

[yonik] tests: close requests (doesn't cause an error)

[yonik] tests: close requests (doesn't cause an error)

[rmuir] clean up resources in this test

[rmuir] disable this test

[rmuir] more unclosed resources in this spellcheck test

[rmuir] clean up searchers

[rmuir] close up searchers in spellchecker tests

[yonik] close requests.  this instance did not cause a real problem

[rmuir] close the searcher in this test

[yonik] test-related: log core container shutdown

[yonik] test-related: move constructors together, log core container creation for all

[uschindler] update ANT to 1.7.1

[yonik] tests: fix resource leak

[yonik] tests: fix resource leak

[rmuir] for now, disable this test with simpletext. takes a few minutes on my computer, 15
minutes on hudson

[yonik] close the request we created

[yonik] tests: fix resource leaks

[rmuir] for now, when a test fails list all the tests that ran in that jvm

[yonik] tests: track number of searcher open and closes

[yonik] tests: jsontest - allow asserting that a path does not exist

[rmuir] add another for now, since it appears to have TZ problems :(

------------------------------------------
[...truncated 16174 lines...]
    [junit] 	at org.junit.internal.runners.statements.InvokeMethod.evaluate(InvokeMethod.java:20)
    [junit] 	at org.junit.rules.TestWatchman$1.evaluate(TestWatchman.java:48)
    [junit] 	at org.junit.internal.runners.statements.RunBefores.evaluate(RunBefores.java:28)
    [junit] 	at org.junit.internal.runners.statements.RunAfters.evaluate(RunAfters.java:31)
    [junit] 	at org.junit.runners.BlockJUnit4ClassRunner.runChild(BlockJUnit4ClassRunner.java:76)
    [junit] 	at org.apache.lucene.util.LuceneTestCase$LuceneTestCaseRunner.runChild(LuceneTestCase.java:881)
    [junit] 	at org.apache.lucene.util.LuceneTestCase$LuceneTestCaseRunner.runChild(LuceneTestCase.java:847)
    [junit] 	at org.junit.runners.ParentRunner$3.run(ParentRunner.java:193)
    [junit] 	at org.junit.runners.ParentRunner$1.schedule(ParentRunner.java:52)
    [junit] 	at org.junit.runners.ParentRunner.runChildren(ParentRunner.java:191)
    [junit] 	at org.junit.runners.ParentRunner.access$000(ParentRunner.java:42)
    [junit] 	at org.junit.runners.ParentRunner$2.evaluate(ParentRunner.java:184)
    [junit] 	at org.junit.internal.runners.statements.RunBefores.evaluate(RunBefores.java:28)
    [junit] 	at org.junit.internal.runners.statements.RunAfters.evaluate(RunAfters.java:31)
    [junit] 	at org.junit.runners.ParentRunner.run(ParentRunner.java:236)
    [junit] 	at junit.framework.JUnit4TestAdapter.run(JUnit4TestAdapter.java:39)
    [junit] 	at org.apache.tools.ant.taskdefs.optional.junit.JUnitTestRunner.run(JUnitTestRunner.java:420)
    [junit] 	at org.apache.tools.ant.taskdefs.optional.junit.JUnitTestRunner.launch(JUnitTestRunner.java:911)
    [junit] 	at org.apache.tools.ant.taskdefs.optional.junit.JUnitTestRunner.main(JUnitTestRunner.java:743)
    [junit] Caused by: java.lang.RuntimeException: com.ctc.wstx.exc.WstxParsingException:
Unexpected close tag </id>; expected </node>.
    [junit]  at [row,col {unknown-source}]: [11,18]
    [junit] 	at org.apache.solr.handler.dataimport.XPathRecordReader.streamRecords(XPathRecordReader.java:181)
    [junit] 	at org.apache.solr.handler.dataimport.XPathEntityProcessor.initQuery(XPathEntityProcessor.java:295)
    [junit] 	... 41 more
    [junit] Caused by: com.ctc.wstx.exc.WstxParsingException: Unexpected close tag </id>;
expected </node>.
    [junit]  at [row,col {unknown-source}]: [11,18]
    [junit] 	at com.ctc.wstx.sr.StreamScanner.constructWfcException(StreamScanner.java:630)
    [junit] 	at com.ctc.wstx.sr.StreamScanner.throwParseError(StreamScanner.java:461)
    [junit] 	at com.ctc.wstx.sr.BasicStreamReader.reportWrongEndElem(BasicStreamReader.java:3258)
    [junit] 	at com.ctc.wstx.sr.BasicStreamReader.readEndElem(BasicStreamReader.java:3200)
    [junit] 	at com.ctc.wstx.sr.BasicStreamReader.nextFromTree(BasicStreamReader.java:2832)
    [junit] 	at com.ctc.wstx.sr.BasicStreamReader.next(BasicStreamReader.java:1019)
    [junit] 	at org.apache.solr.handler.dataimport.XPathRecordReader$Node.parse(XPathRecordReader.java:275)
    [junit] 	at org.apache.solr.handler.dataimport.XPathRecordReader$Node.handleStartElement(XPathRecordReader.java:340)
    [junit] 	at org.apache.solr.handler.dataimport.XPathRecordReader$Node.parse(XPathRecordReader.java:304)
    [junit] 	at org.apache.solr.handler.dataimport.XPathRecordReader$Node.handleStartElement(XPathRecordReader.java:340)
    [junit] 	at org.apache.solr.handler.dataimport.XPathRecordReader$Node.parse(XPathRecordReader.java:304)
    [junit] 	at org.apache.solr.handler.dataimport.XPathRecordReader$Node.access$200(XPathRecordReader.java:196)
    [junit] 	at org.apache.solr.handler.dataimport.XPathRecordReader.streamRecords(XPathRecordReader.java:178)
    [junit] 	... 42 more
    [junit] ------------- ---------------- ---------------
    [junit] Testsuite: org.apache.solr.handler.dataimport.TestEvaluatorBag
    [junit] Tests run: 4, Failures: 0, Errors: 0, Time elapsed: 0.018 sec
    [junit] 
    [junit] ------------- Standard Error -----------------
    [junit] NOTE: Ignoring test method 'testGetDateFormatEvaluator': Known Locale/TZ problems:
see https://issues.apache.org/jira/browse/SOLR-1916
    [junit] ------------- ---------------- ---------------
    [junit] Testsuite: org.apache.solr.handler.dataimport.TestFieldReader
    [junit] Tests run: 1, Failures: 0, Errors: 0, Time elapsed: 0.016 sec
    [junit] 
    [junit] Testsuite: org.apache.solr.handler.dataimport.TestFileListEntityProcessor
    [junit] Tests run: 3, Failures: 0, Errors: 0, Time elapsed: 0.022 sec
    [junit] 
    [junit] ------------- Standard Error -----------------
    [junit] NOTE: Ignoring test method 'testNTOT': Known Locale/TZ problems: see https://issues.apache.org/jira/browse/SOLR-1916
    [junit] ------------- ---------------- ---------------
    [junit] Testsuite: org.apache.solr.handler.dataimport.TestJdbcDataSource
    [junit] Tests run: 3, Failures: 0, Errors: 0, Time elapsed: 0.065 sec
    [junit] 
    [junit] ------------- Standard Error -----------------
    [junit] NOTE: Ignoring test method 'testBasic': Needs a Mock database server to work
    [junit] ------------- ---------------- ---------------
    [junit] Testsuite: org.apache.solr.handler.dataimport.TestLineEntityProcessor
    [junit] Tests run: 4, Failures: 0, Errors: 0, Time elapsed: 0.014 sec
    [junit] 
    [junit] Testsuite: org.apache.solr.handler.dataimport.TestNumberFormatTransformer
    [junit] Tests run: 9, Failures: 0, Errors: 0, Time elapsed: 0.024 sec
    [junit] 
    [junit] Testsuite: org.apache.solr.handler.dataimport.TestPlainTextEntityProcessor
    [junit] Tests run: 1, Failures: 0, Errors: 0, Time elapsed: 0.018 sec
    [junit] 
    [junit] Testsuite: org.apache.solr.handler.dataimport.TestRegexTransformer
    [junit] Tests run: 5, Failures: 0, Errors: 0, Time elapsed: 0.021 sec
    [junit] 
    [junit] Testsuite: org.apache.solr.handler.dataimport.TestScriptTransformer
    [junit] Tests run: 4, Failures: 0, Errors: 0, Time elapsed: 0.274 sec
    [junit] 
    [junit] Testsuite: org.apache.solr.handler.dataimport.TestSqlEntityProcessor
    [junit] Tests run: 4, Failures: 0, Errors: 0, Time elapsed: 0.016 sec
    [junit] 
    [junit] Testsuite: org.apache.solr.handler.dataimport.TestSqlEntityProcessor2
    [junit] Tests run: 6, Failures: 0, Errors: 0, Time elapsed: 0.52 sec
    [junit] 
    [junit] ------------- Standard Error -----------------
    [junit] NOTE: Ignoring test method 'testLastIndexTime': Known Locale/TZ problems: see
https://issues.apache.org/jira/browse/SOLR-1916
    [junit] 18 Ott 2010 11:49:22 org.apache.solr.handler.dataimport.JdbcDataSource finalize
    [junit] SEVERE: JdbcDataSource was not closed prior to finalize(), indicates a bug --
POSSIBLE RESOURCE LEAK!!!
    [junit] 18 Ott 2010 11:49:22 org.apache.solr.handler.dataimport.JdbcDataSource finalize
    [junit] SEVERE: JdbcDataSource was not closed prior to finalize(), indicates a bug --
POSSIBLE RESOURCE LEAK!!!
    [junit] 18 Ott 2010 11:49:22 org.apache.solr.handler.dataimport.JdbcDataSource finalize
    [junit] SEVERE: JdbcDataSource was not closed prior to finalize(), indicates a bug --
POSSIBLE RESOURCE LEAK!!!
    [junit] ------------- ---------------- ---------------
    [junit] Testsuite: org.apache.solr.handler.dataimport.TestSqlEntityProcessorDelta
    [junit] Tests run: 8, Failures: 0, Errors: 0, Time elapsed: 0.985 sec
    [junit] 
    [junit] Testsuite: org.apache.solr.handler.dataimport.TestSqlEntityProcessorDelta2
    [junit] Tests run: 8, Failures: 0, Errors: 0, Time elapsed: 1.077 sec
    [junit] 
    [junit] Testsuite: org.apache.solr.handler.dataimport.TestTemplateString
    [junit] Tests run: 1, Failures: 0, Errors: 0, Time elapsed: 0.01 sec
    [junit] 
    [junit] Testsuite: org.apache.solr.handler.dataimport.TestTemplateTransformer
    [junit] Tests run: 1, Failures: 0, Errors: 0, Time elapsed: 0.007 sec
    [junit] 
    [junit] Testsuite: org.apache.solr.handler.dataimport.TestThreaded
    [junit] Tests run: 1, Failures: 0, Errors: 0, Time elapsed: 0.352 sec
    [junit] 
    [junit] Testsuite: org.apache.solr.handler.dataimport.TestURLDataSource
    [junit] Tests run: 1, Failures: 0, Errors: 0, Time elapsed: 0.009 sec
    [junit] 
    [junit] Testsuite: org.apache.solr.handler.dataimport.TestVariableResolver
    [junit] Tests run: 9, Failures: 0, Errors: 0, Time elapsed: 0.02 sec
    [junit] 
    [junit] Testsuite: org.apache.solr.handler.dataimport.TestXPathEntityProcessor
    [junit] Tests run: 8, Failures: 0, Errors: 0, Time elapsed: 0.496 sec
    [junit] 
    [junit] Testsuite: org.apache.solr.handler.dataimport.TestXPathRecordReader
    [junit] Tests run: 21, Failures: 0, Errors: 0, Time elapsed: 0.03 sec
    [junit] 

compileExtras:

compileExtrasTests:
    [mkdir] Created dir: /usr<https://hudson.apache.org/hudson/job/Solr-trunk/ws/checkout/solr/contrib/dataimporthandler/target/extras/test-classes>
    [javac] Compiling 2 source files to /usr<https://hudson.apache.org/hudson/job/Solr-trunk/ws/checkout/solr/contrib/dataimporthandler/target/extras/test-classes>
    [javac] warning: [path] bad path element "/home/hudson/.ant/lib/xbean.jar": no such file
or directory
    [javac] 1 warning

testExtras:
    [junit] Testsuite: org.apache.solr.handler.dataimport.TestMailEntityProcessor
    [junit] Tests run: 0, Failures: 0, Errors: 0, Time elapsed: 0.35 sec
    [junit] 
    [junit] ------------- Standard Error -----------------
    [junit] NOTE: Ignoring test method 'testConnection': Needs a Mock Mail Server to work
    [junit] NOTE: Ignoring test method 'testRecursion': Needs a Mock Mail Server to work
    [junit] NOTE: Ignoring test method 'testExclude': Needs a Mock Mail Server to work
    [junit] NOTE: Ignoring test method 'testInclude': Needs a Mock Mail Server to work
    [junit] NOTE: Ignoring test method 'testIncludeAndExclude': Needs a Mock Mail Server to
work
    [junit] NOTE: Ignoring test method 'testFetchTimeSince': Needs a Mock Mail Server to work
    [junit] ------------- ---------------- ---------------
    [junit] Testsuite: org.apache.solr.handler.dataimport.TestTikaEntityProcessor
    [junit] Tests run: 1, Failures: 0, Errors: 0, Time elapsed: 3.156 sec
    [junit] 

test:

init:

init-forrest-entities:

compile-lucene:

compile-solrj:

compile:
    [javac] Compiling 1 source file to /usr<https://hudson.apache.org/hudson/job/Solr-trunk/ws/checkout/solr/build/solr>
    [javac] warning: [path] bad path element "/home/hudson/.ant/lib/xbean.jar": no such file
or directory
    [javac] 1 warning

compileTests:

make-manifest:

compile:

compileTests:
    [mkdir] Created dir: /usr<https://hudson.apache.org/hudson/job/Solr-trunk/ws/checkout/solr/contrib/extraction/build/test-classes>
    [javac] Compiling 1 source file to /usr<https://hudson.apache.org/hudson/job/Solr-trunk/ws/checkout/solr/contrib/extraction/build/test-classes>
    [javac] warning: [path] bad path element "/home/hudson/.ant/lib/xbean.jar": no such file
or directory
    [javac] 1 warning

test:
    [junit] Testsuite: org.apache.solr.handler.ExtractingRequestHandlerTest
    [junit] Tests run: 8, Failures: 0, Errors: 0, Time elapsed: 3.499 sec
    [junit] 

test:

clover.check:

clover.setup:
[clover-setup] Clover Version 2.6.3, built on November 20 2009 (build-778)
[clover-setup] Loaded from: /home/hudson/tools/clover/clover2latest/clover-2.6.3.jar
[clover-setup] Clover: Open Source License registered to Apache.
[clover-setup] Clover is enabled with initstring '/usr<https://hudson.apache.org/hudson/job/Solr-trunk/ws/checkout/solr/build/tests/clover/db/solr_coverage.db'>

clover.info:

clover:

generate-clover-reports:
    [mkdir] Created dir: /usr<https://hudson.apache.org/hudson/job/Solr-trunk/ws/checkout/solr/build/tests/clover/reports>
[clover-report] Clover Version 2.6.3, built on November 20 2009 (build-778)
[clover-report] Loaded from: /home/hudson/tools/clover/clover2latest/clover-2.6.3.jar
[clover-report] Clover: Open Source License registered to Apache.
[clover-report] Loading coverage database from: '/usr<https://hudson.apache.org/hudson/job/Solr-trunk/ws/checkout/solr/build/tests/clover/db/solr_coverage.db'>
[clover-report] Loading coverage database from: '/usr<https://hudson.apache.org/hudson/job/Solr-trunk/ws/checkout/solr/build/tests/clover/db/solr_coverage.db'>
[clover-report] Writing report to '/usr<https://hudson.apache.org/hudson/job/Solr-trunk/ws/checkout/solr/build/tests/clover/reports/clover.xml'>
[clover-report] Writing HTML report to '/usr<https://hudson.apache.org/hudson/job/Solr-trunk/ws/checkout/solr/build/tests/clover/reports'>
[clover-report] Done. Processed 37 packages in 5366ms (145ms per package).

BUILD SUCCESSFUL
Total time: 6 minutes 35 seconds
[TASKS] Scanning workspace files for tasks...
Publishing Javadoc
Archiving artifacts
Recording test results
Publishing Clover coverage report...
Publishing Clover HTML report...
Publishing Clover XML report...
Publishing Clover coverage results...
FATAL: Unable to copy coverage from <https://hudson.apache.org/hudson/job/Solr-trunk/ws/checkout/solr/build/tests/clover/reports>
to /home/hudson/hudson/jobs/Solr-trunk/builds/2010-10-18_08-05-39
hudson.util.IOException2: Cannot parse coverage results
	at hudson.plugins.clover.CloverCoverageParser.parse(CloverCoverageParser.java:89)
	at hudson.plugins.clover.CloverCoverageParser.parse(CloverCoverageParser.java:51)
	at hudson.plugins.clover.CloverPublisher.processCloverXml(CloverPublisher.java:202)
	at hudson.plugins.clover.CloverPublisher.perform(CloverPublisher.java:163)
	at hudson.tasks.BuildStepMonitor$3.perform(BuildStepMonitor.java:36)
	at hudson.model.AbstractBuild$AbstractRunner.perform(AbstractBuild.java:601)
	at hudson.model.AbstractBuild$AbstractRunner.performAllBuildSteps(AbstractBuild.java:580)
	at hudson.model.AbstractBuild$AbstractRunner.performAllBuildSteps(AbstractBuild.java:558)
	at hudson.model.Build$RunnerImpl.post2(Build.java:157)
	at hudson.model.AbstractBuild$AbstractRunner.post(AbstractBuild.java:528)
	at hudson.model.Run.run(Run.java:1303)
	at hudson.model.FreeStyleBuild.run(FreeStyleBuild.java:46)
	at hudson.model.ResourceController.execute(ResourceController.java:88)
	at hudson.model.Executor.run(Executor.java:140)
Caused by: org.xml.sax.SAXParseException: XML document structures must start and end within
the same entity.
	at com.sun.org.apache.xerces.internal.parsers.AbstractSAXParser.parse(AbstractSAXParser.java:1231)
	at com.sun.org.apache.xerces.internal.jaxp.SAXParserImpl$JAXPSAXParser.parse(SAXParserImpl.java:522)
	at org.apache.commons.digester.Digester.parse(Digester.java:1666)
	at hudson.plugins.clover.CloverCoverageParser.parse(CloverCoverageParser.java:87)
	... 13 more
ERROR: Publisher hudson.plugins.clover.CloverPublisher aborted due to exception
java.lang.NullPointerException
	at hudson.plugins.clover.CloverBuildAction.<init>(CloverBuildAction.java:133)
	at hudson.plugins.clover.CloverBuildAction.load(CloverBuildAction.java:265)
	at hudson.plugins.clover.CloverPublisher.processCloverXml(CloverPublisher.java:208)
	at hudson.plugins.clover.CloverPublisher.perform(CloverPublisher.java:163)
	at hudson.tasks.BuildStepMonitor$3.perform(BuildStepMonitor.java:36)
	at hudson.model.AbstractBuild$AbstractRunner.perform(AbstractBuild.java:601)
	at hudson.model.AbstractBuild$AbstractRunner.performAllBuildSteps(AbstractBuild.java:580)
	at hudson.model.AbstractBuild$AbstractRunner.performAllBuildSteps(AbstractBuild.java:558)
	at hudson.model.Build$RunnerImpl.post2(Build.java:157)
	at hudson.model.AbstractBuild$AbstractRunner.post(AbstractBuild.java:528)
	at hudson.model.Run.run(Run.java:1303)
	at hudson.model.FreeStyleBuild.run(FreeStyleBuild.java:46)
	at hudson.model.ResourceController.execute(ResourceController.java:88)
	at hudson.model.Executor.run(Executor.java:140)


---------------------------------------------------------------------
To unsubscribe, e-mail: dev-unsubscribe@lucene.apache.org
For additional commands, e-mail: dev-help@lucene.apache.org


Mime
View raw message