lucene-dev mailing list archives

Site index · List index
Message view « Date » · « Thread »
Top « Date » · « Thread »
From Apache Hudson Server <hud...@hudson.apache.org>
Subject Lucene-Solr-tests-only-trunk - Build # 355 - Failure
Date Wed, 20 Oct 2010 22:59:52 GMT
Build: http://hudson.zones.apache.org/hudson/job/Lucene-Solr-tests-only-trunk/355/

12 tests failed.
REGRESSION:  org.apache.solr.TestGroupingSearch.testGroupingGroupSortingScore_basic

Error Message:
Exception during query

Stack Trace:
java.lang.RuntimeException: Exception during query
	at org.apache.solr.SolrTestCaseJ4.assertQ(SolrTestCaseJ4.java:369)
	at org.apache.solr.SolrTestCaseJ4.assertQ(SolrTestCaseJ4.java:336)
	at org.apache.solr.TestGroupingSearch.testGroupingGroupSortingScore_basic(TestGroupingSearch.java:47)
	at org.apache.lucene.util.LuceneTestCase$LuceneTestCaseRunner.runChild(LuceneTestCase.java:881)
	at org.apache.lucene.util.LuceneTestCase$LuceneTestCaseRunner.runChild(LuceneTestCase.java:847)
Caused by: org.apache.solr.common.SolrException: Unknown query type 'func'
	at org.apache.solr.core.SolrCore.getQueryPlugin(SolrCore.java:1508)
	at org.apache.solr.search.QParser.getParser(QParser.java:286)
	at org.apache.solr.handler.component.QueryComponent.process(QueryComponent.java:330)
	at org.apache.solr.handler.component.SearchHandler.handleRequestBody(SearchHandler.java:231)
	at org.apache.solr.handler.RequestHandlerBase.handleRequest(RequestHandlerBase.java:131)
	at org.apache.solr.core.SolrCore.execute(SolrCore.java:1359)
	at org.apache.solr.util.TestHarness.queryAndResponse(TestHarness.java:348)
	at org.apache.solr.util.TestHarness.query(TestHarness.java:331)
	at org.apache.solr.util.TestHarness.query(TestHarness.java:316)
	at org.apache.solr.SolrTestCaseJ4.assertQ(SolrTestCaseJ4.java:343)


REGRESSION:  org.apache.solr.TestGroupingSearch.testGroupingGroupSortingScore_basicWithGroupSortEqualToSort

Error Message:
Exception during query

Stack Trace:
java.lang.RuntimeException: Exception during query
	at org.apache.solr.SolrTestCaseJ4.assertQ(SolrTestCaseJ4.java:369)
	at org.apache.solr.SolrTestCaseJ4.assertQ(SolrTestCaseJ4.java:336)
	at org.apache.solr.TestGroupingSearch.testGroupingGroupSortingScore_basicWithGroupSortEqualToSort(TestGroupingSearch.java:77)
	at org.apache.lucene.util.LuceneTestCase$LuceneTestCaseRunner.runChild(LuceneTestCase.java:881)
	at org.apache.lucene.util.LuceneTestCase$LuceneTestCaseRunner.runChild(LuceneTestCase.java:847)
Caused by: org.apache.solr.common.SolrException: Unknown query type 'func'
	at org.apache.solr.core.SolrCore.getQueryPlugin(SolrCore.java:1508)
	at org.apache.solr.search.QParser.getParser(QParser.java:286)
	at org.apache.solr.handler.component.QueryComponent.process(QueryComponent.java:330)
	at org.apache.solr.handler.component.SearchHandler.handleRequestBody(SearchHandler.java:231)
	at org.apache.solr.handler.RequestHandlerBase.handleRequest(RequestHandlerBase.java:131)
	at org.apache.solr.core.SolrCore.execute(SolrCore.java:1359)
	at org.apache.solr.util.TestHarness.queryAndResponse(TestHarness.java:348)
	at org.apache.solr.util.TestHarness.query(TestHarness.java:331)
	at org.apache.solr.util.TestHarness.query(TestHarness.java:316)
	at org.apache.solr.SolrTestCaseJ4.assertQ(SolrTestCaseJ4.java:343)


REGRESSION:  org.apache.solr.TestGroupingSearch.testGroupingGroupSortingName

Error Message:
Exception during query

Stack Trace:
java.lang.RuntimeException: Exception during query
	at org.apache.solr.SolrTestCaseJ4.assertQ(SolrTestCaseJ4.java:369)
	at org.apache.solr.SolrTestCaseJ4.assertQ(SolrTestCaseJ4.java:336)
	at org.apache.solr.TestGroupingSearch.testGroupingGroupSortingName(TestGroupingSearch.java:103)
	at org.apache.lucene.util.LuceneTestCase$LuceneTestCaseRunner.runChild(LuceneTestCase.java:881)
	at org.apache.lucene.util.LuceneTestCase$LuceneTestCaseRunner.runChild(LuceneTestCase.java:847)
Caused by: org.apache.solr.common.SolrException: Unknown query type 'func'
	at org.apache.solr.core.SolrCore.getQueryPlugin(SolrCore.java:1508)
	at org.apache.solr.search.QParser.getParser(QParser.java:286)
	at org.apache.solr.handler.component.QueryComponent.process(QueryComponent.java:330)
	at org.apache.solr.handler.component.SearchHandler.handleRequestBody(SearchHandler.java:231)
	at org.apache.solr.handler.RequestHandlerBase.handleRequest(RequestHandlerBase.java:131)
	at org.apache.solr.core.SolrCore.execute(SolrCore.java:1359)
	at org.apache.solr.util.TestHarness.queryAndResponse(TestHarness.java:348)
	at org.apache.solr.util.TestHarness.query(TestHarness.java:331)
	at org.apache.solr.util.TestHarness.query(TestHarness.java:316)
	at org.apache.solr.SolrTestCaseJ4.assertQ(SolrTestCaseJ4.java:343)


REGRESSION:  org.apache.solr.TestGroupingSearch.testGroupingGroupSortingWeight

Error Message:
Exception during query

Stack Trace:
java.lang.RuntimeException: Exception during query
	at org.apache.solr.SolrTestCaseJ4.assertQ(SolrTestCaseJ4.java:369)
	at org.apache.solr.SolrTestCaseJ4.assertQ(SolrTestCaseJ4.java:336)
	at org.apache.solr.TestGroupingSearch.testGroupingGroupSortingWeight(TestGroupingSearch.java:125)
	at org.apache.lucene.util.LuceneTestCase$LuceneTestCaseRunner.runChild(LuceneTestCase.java:881)
	at org.apache.lucene.util.LuceneTestCase$LuceneTestCaseRunner.runChild(LuceneTestCase.java:847)
Caused by: org.apache.solr.common.SolrException: Unknown query type 'func'
	at org.apache.solr.core.SolrCore.getQueryPlugin(SolrCore.java:1508)
	at org.apache.solr.search.QParser.getParser(QParser.java:286)
	at org.apache.solr.handler.component.QueryComponent.process(QueryComponent.java:330)
	at org.apache.solr.handler.component.SearchHandler.handleRequestBody(SearchHandler.java:231)
	at org.apache.solr.handler.RequestHandlerBase.handleRequest(RequestHandlerBase.java:131)
	at org.apache.solr.core.SolrCore.execute(SolrCore.java:1359)
	at org.apache.solr.util.TestHarness.queryAndResponse(TestHarness.java:348)
	at org.apache.solr.util.TestHarness.query(TestHarness.java:331)
	at org.apache.solr.util.TestHarness.query(TestHarness.java:316)
	at org.apache.solr.SolrTestCaseJ4.assertQ(SolrTestCaseJ4.java:343)


REGRESSION:  org.apache.solr.TestGroupingSearch.testGroupAPI

Error Message:
Exception during query

Stack Trace:
java.lang.RuntimeException: Exception during query
	at org.apache.solr.SolrTestCaseJ4.assertQ(SolrTestCaseJ4.java:369)
	at org.apache.solr.SolrTestCaseJ4.assertQ(SolrTestCaseJ4.java:336)
	at org.apache.solr.TestGroupingSearch.testGroupAPI(TestGroupingSearch.java:166)
	at org.apache.lucene.util.LuceneTestCase$LuceneTestCaseRunner.runChild(LuceneTestCase.java:881)
	at org.apache.lucene.util.LuceneTestCase$LuceneTestCaseRunner.runChild(LuceneTestCase.java:847)
Caused by: org.apache.solr.common.SolrException: Unknown query type 'func'
	at org.apache.solr.core.SolrCore.getQueryPlugin(SolrCore.java:1508)
	at org.apache.solr.search.QParser.getParser(QParser.java:286)
	at org.apache.solr.handler.component.QueryComponent.prepare(QueryComponent.java:92)
	at org.apache.solr.handler.component.SearchHandler.handleRequestBody(SearchHandler.java:210)
	at org.apache.solr.handler.RequestHandlerBase.handleRequest(RequestHandlerBase.java:131)
	at org.apache.solr.core.SolrCore.execute(SolrCore.java:1359)
	at org.apache.solr.util.TestHarness.queryAndResponse(TestHarness.java:348)
	at org.apache.solr.util.TestHarness.query(TestHarness.java:331)
	at org.apache.solr.util.TestHarness.query(TestHarness.java:316)
	at org.apache.solr.SolrTestCaseJ4.assertQ(SolrTestCaseJ4.java:343)


REGRESSION:  org.apache.solr.cloud.BasicDistributedZkTest.testDistribSearch

Error Message:
Error executing query

Stack Trace:
org.apache.solr.client.solrj.SolrServerException: Error executing query
	at org.apache.solr.client.solrj.request.QueryRequest.process(QueryRequest.java:95)
	at org.apache.solr.client.solrj.SolrServer.query(SolrServer.java:119)
	at org.apache.solr.BaseDistributedSearchTestCase.query(BaseDistributedSearchTestCase.java:301)
	at org.apache.solr.cloud.BasicDistributedZkTest.doTest(BasicDistributedZkTest.java:138)
	at org.apache.solr.BaseDistributedSearchTestCase.testDistribSearch(BaseDistributedSearchTestCase.java:562)
	at org.apache.lucene.util.LuceneTestCase$LuceneTestCaseRunner.runChild(LuceneTestCase.java:881)
	at org.apache.lucene.util.LuceneTestCase$LuceneTestCaseRunner.runChild(LuceneTestCase.java:847)
Caused by: org.apache.solr.common.SolrException: Unknown query type 'func'

Unknown query type 'func'

request: http://localhost:16321/solr/select?q={!func}a_si&wt=javabin&version=2
	at org.apache.solr.client.solrj.impl.CommonsHttpSolrServer.request(CommonsHttpSolrServer.java:435)
	at org.apache.solr.client.solrj.impl.CommonsHttpSolrServer.request(CommonsHttpSolrServer.java:244)
	at org.apache.solr.client.solrj.request.QueryRequest.process(QueryRequest.java:89)


REGRESSION:  org.apache.solr.handler.SpellCheckerRequestHandlerTest.testSpellCheck_01_correctWords

Error Message:
java.lang.ClassCastException: java.lang.String cannot be cast to java.lang.Float

Stack Trace:
java.lang.RuntimeException: java.lang.ClassCastException: java.lang.String cannot be cast
to java.lang.Float
	at org.apache.solr.util.TestHarness.<init>(TestHarness.java:152)
	at org.apache.solr.util.TestHarness.<init>(TestHarness.java:134)
	at org.apache.solr.util.TestHarness.<init>(TestHarness.java:124)
	at org.apache.solr.util.AbstractSolrTestCase.setUp(AbstractSolrTestCase.java:121)
	at org.apache.solr.handler.SpellCheckerRequestHandlerTest.setUp(SpellCheckerRequestHandlerTest.java:64)
	at org.apache.lucene.util.LuceneTestCase$LuceneTestCaseRunner.runChild(LuceneTestCase.java:881)
	at org.apache.lucene.util.LuceneTestCase$LuceneTestCaseRunner.runChild(LuceneTestCase.java:847)
Caused by: java.lang.ClassCastException: java.lang.String cannot be cast to java.lang.Float
	at org.apache.solr.spelling.suggest.Suggester.init(Suggester.java:78)
	at org.apache.solr.handler.component.SpellCheckComponent.inform(SpellCheckComponent.java:597)
	at org.apache.solr.core.SolrResourceLoader.inform(SolrResourceLoader.java:539)
	at org.apache.solr.core.SolrCore.<init>(SolrCore.java:592)
	at org.apache.solr.util.TestHarness$Initializer.initialize(TestHarness.java:190)
	at org.apache.solr.util.TestHarness.<init>(TestHarness.java:139)


REGRESSION:  org.apache.solr.handler.SpellCheckerRequestHandlerTest.testSpellCheck_02_incorrectWords

Error Message:
java.lang.ClassCastException: java.lang.String cannot be cast to java.lang.Float

Stack Trace:
java.lang.RuntimeException: java.lang.ClassCastException: java.lang.String cannot be cast
to java.lang.Float
	at org.apache.solr.util.TestHarness.<init>(TestHarness.java:152)
	at org.apache.solr.util.TestHarness.<init>(TestHarness.java:134)
	at org.apache.solr.util.TestHarness.<init>(TestHarness.java:124)
	at org.apache.solr.util.AbstractSolrTestCase.setUp(AbstractSolrTestCase.java:121)
	at org.apache.solr.handler.SpellCheckerRequestHandlerTest.setUp(SpellCheckerRequestHandlerTest.java:64)
	at org.apache.lucene.util.LuceneTestCase$LuceneTestCaseRunner.runChild(LuceneTestCase.java:881)
	at org.apache.lucene.util.LuceneTestCase$LuceneTestCaseRunner.runChild(LuceneTestCase.java:847)
Caused by: java.lang.ClassCastException: java.lang.String cannot be cast to java.lang.Float
	at org.apache.solr.spelling.suggest.Suggester.init(Suggester.java:78)
	at org.apache.solr.handler.component.SpellCheckComponent.inform(SpellCheckComponent.java:597)
	at org.apache.solr.core.SolrResourceLoader.inform(SolrResourceLoader.java:539)
	at org.apache.solr.core.SolrCore.<init>(SolrCore.java:592)
	at org.apache.solr.util.TestHarness$Initializer.initialize(TestHarness.java:190)
	at org.apache.solr.util.TestHarness.<init>(TestHarness.java:139)


REGRESSION:  org.apache.solr.handler.SpellCheckerRequestHandlerTest.testSpellCheck_03_multiWords_correctWords

Error Message:
java.lang.ClassCastException: java.lang.String cannot be cast to java.lang.Float

Stack Trace:
java.lang.RuntimeException: java.lang.ClassCastException: java.lang.String cannot be cast
to java.lang.Float
	at org.apache.solr.util.TestHarness.<init>(TestHarness.java:152)
	at org.apache.solr.util.TestHarness.<init>(TestHarness.java:134)
	at org.apache.solr.util.TestHarness.<init>(TestHarness.java:124)
	at org.apache.solr.util.AbstractSolrTestCase.setUp(AbstractSolrTestCase.java:121)
	at org.apache.solr.handler.SpellCheckerRequestHandlerTest.setUp(SpellCheckerRequestHandlerTest.java:64)
	at org.apache.lucene.util.LuceneTestCase$LuceneTestCaseRunner.runChild(LuceneTestCase.java:881)
	at org.apache.lucene.util.LuceneTestCase$LuceneTestCaseRunner.runChild(LuceneTestCase.java:847)
Caused by: java.lang.ClassCastException: java.lang.String cannot be cast to java.lang.Float
	at org.apache.solr.spelling.suggest.Suggester.init(Suggester.java:78)
	at org.apache.solr.handler.component.SpellCheckComponent.inform(SpellCheckComponent.java:597)
	at org.apache.solr.core.SolrResourceLoader.inform(SolrResourceLoader.java:539)
	at org.apache.solr.core.SolrCore.<init>(SolrCore.java:592)
	at org.apache.solr.util.TestHarness$Initializer.initialize(TestHarness.java:190)
	at org.apache.solr.util.TestHarness.<init>(TestHarness.java:139)


REGRESSION:  org.apache.solr.handler.SpellCheckerRequestHandlerTest.testSpellCheck_04_multiWords_incorrectWords

Error Message:
java.lang.ClassCastException: java.lang.String cannot be cast to java.lang.Float

Stack Trace:
java.lang.RuntimeException: java.lang.ClassCastException: java.lang.String cannot be cast
to java.lang.Float
	at org.apache.solr.util.TestHarness.<init>(TestHarness.java:152)
	at org.apache.solr.util.TestHarness.<init>(TestHarness.java:134)
	at org.apache.solr.util.TestHarness.<init>(TestHarness.java:124)
	at org.apache.solr.util.AbstractSolrTestCase.setUp(AbstractSolrTestCase.java:121)
	at org.apache.solr.handler.SpellCheckerRequestHandlerTest.setUp(SpellCheckerRequestHandlerTest.java:64)
	at org.apache.lucene.util.LuceneTestCase$LuceneTestCaseRunner.runChild(LuceneTestCase.java:881)
	at org.apache.lucene.util.LuceneTestCase$LuceneTestCaseRunner.runChild(LuceneTestCase.java:847)
Caused by: java.lang.ClassCastException: java.lang.String cannot be cast to java.lang.Float
	at org.apache.solr.spelling.suggest.Suggester.init(Suggester.java:78)
	at org.apache.solr.handler.component.SpellCheckComponent.inform(SpellCheckComponent.java:597)
	at org.apache.solr.core.SolrResourceLoader.inform(SolrResourceLoader.java:539)
	at org.apache.solr.core.SolrCore.<init>(SolrCore.java:592)
	at org.apache.solr.util.TestHarness$Initializer.initialize(TestHarness.java:190)
	at org.apache.solr.util.TestHarness.<init>(TestHarness.java:139)


REGRESSION:  org.apache.solr.handler.SpellCheckerRequestHandlerTest.testSpellCheck_05_buildDictionary

Error Message:
java.lang.ClassCastException: java.lang.String cannot be cast to java.lang.Float

Stack Trace:
java.lang.RuntimeException: java.lang.ClassCastException: java.lang.String cannot be cast
to java.lang.Float
	at org.apache.solr.util.TestHarness.<init>(TestHarness.java:152)
	at org.apache.solr.util.TestHarness.<init>(TestHarness.java:134)
	at org.apache.solr.util.TestHarness.<init>(TestHarness.java:124)
	at org.apache.solr.util.AbstractSolrTestCase.setUp(AbstractSolrTestCase.java:121)
	at org.apache.solr.handler.SpellCheckerRequestHandlerTest.setUp(SpellCheckerRequestHandlerTest.java:64)
	at org.apache.lucene.util.LuceneTestCase$LuceneTestCaseRunner.runChild(LuceneTestCase.java:881)
	at org.apache.lucene.util.LuceneTestCase$LuceneTestCaseRunner.runChild(LuceneTestCase.java:847)
Caused by: java.lang.ClassCastException: java.lang.String cannot be cast to java.lang.Float
	at org.apache.solr.spelling.suggest.Suggester.init(Suggester.java:78)
	at org.apache.solr.handler.component.SpellCheckComponent.inform(SpellCheckComponent.java:597)
	at org.apache.solr.core.SolrResourceLoader.inform(SolrResourceLoader.java:539)
	at org.apache.solr.core.SolrCore.<init>(SolrCore.java:592)
	at org.apache.solr.util.TestHarness$Initializer.initialize(TestHarness.java:190)
	at org.apache.solr.util.TestHarness.<init>(TestHarness.java:139)


FAILED:  junit.framework.TestSuite.org.apache.solr.spelling.suggest.SuggesterTest

Error Message:
java.lang.ClassCastException: java.lang.String cannot be cast to java.lang.Float

Stack Trace:
java.lang.RuntimeException: java.lang.ClassCastException: java.lang.String cannot be cast
to java.lang.Float
	at org.apache.solr.util.TestHarness.<init>(TestHarness.java:152)
	at org.apache.solr.util.TestHarness.<init>(TestHarness.java:134)
	at org.apache.solr.util.TestHarness.<init>(TestHarness.java:124)
	at org.apache.solr.SolrTestCaseJ4.initCore(SolrTestCaseJ4.java:234)
	at org.apache.solr.SolrTestCaseJ4.initCore(SolrTestCaseJ4.java:96)
	at org.apache.solr.SolrTestCaseJ4.initCore(SolrTestCaseJ4.java:84)
	at org.apache.solr.spelling.suggest.SuggesterTest.beforeClass(SuggesterTest.java:38)
Caused by: java.lang.ClassCastException: java.lang.String cannot be cast to java.lang.Float
	at org.apache.solr.spelling.suggest.Suggester.init(Suggester.java:78)
	at org.apache.solr.handler.component.SpellCheckComponent.inform(SpellCheckComponent.java:597)
	at org.apache.solr.core.SolrResourceLoader.inform(SolrResourceLoader.java:539)
	at org.apache.solr.core.SolrCore.<init>(SolrCore.java:592)
	at org.apache.solr.util.TestHarness$Initializer.initialize(TestHarness.java:190)
	at org.apache.solr.util.TestHarness.<init>(TestHarness.java:139)




Build Log (for compile errors):
[...truncated 9395 lines...]



---------------------------------------------------------------------
To unsubscribe, e-mail: dev-unsubscribe@lucene.apache.org
For additional commands, e-mail: dev-help@lucene.apache.org


Mime
View raw message