lucene-dev mailing list archives

Site index · List index
Message view « Date » · « Thread »
Top « Date » · « Thread »
From Apache Hudson Server <hud...@hudson.apache.org>
Subject Build failed in Hudson: Lucene-Solr-tests-only-3.x #112
Date Fri, 15 Oct 2010 19:15:25 GMT
See <https://hudson.apache.org/hudson/job/Lucene-Solr-tests-only-3.x/112/>

------------------------------------------
[...truncated 8965 lines...]
    [junit] Tests run: 1, Failures: 0, Errors: 0, Time elapsed: 4.85 sec
    [junit] 
    [junit] Testsuite: org.apache.solr.util.TestUtils
    [junit] Tests run: 3, Failures: 0, Errors: 0, Time elapsed: 0.014 sec
    [junit] 
    [junit] Testsuite: org.apache.solr.search.function.TestFunctionQuery
    [junit] Tests run: 7, Failures: 0, Errors: 0, Time elapsed: 4.041 sec
    [junit] 
    [junit] ------------- Standard Error -----------------
    [junit] 10-15-2010 08:14:30 PM org.apache.solr.SolrTestCaseJ4 assertQ
    [junit] GRAVE: REQUEST FAILED: fl=*,score&q={!func}10+wow+dude+ignore_exception
    [junit] ------------- ---------------- ---------------
    [junit] Testsuite: org.apache.solr.search.TestQueryUtils
    [junit] Tests run: 1, Failures: 0, Errors: 0, Time elapsed: 1.431 sec
    [junit] 
    [junit] Testsuite: org.apache.solr.spelling.suggest.SuggesterTest
    [junit] Tests run: 2, Failures: 0, Errors: 0, Time elapsed: 0.369 sec
    [junit] 
    [junit] Testsuite: org.apache.solr.servlet.CacheHeaderTest
    [junit] Tests run: 5, Failures: 0, Errors: 0, Time elapsed: 1.411 sec
    [junit] 
    [junit] Testsuite: org.apache.solr.update.processor.UpdateRequestProcessorFactoryTest
    [junit] Tests run: 1, Failures: 0, Errors: 0, Time elapsed: 1.841 sec
    [junit] 
    [junit] Testsuite: org.apache.solr.request.SimpleFacetsTest
    [junit] Tests run: 7, Failures: 0, Errors: 0, Time elapsed: 6.088 sec
    [junit] 
    [junit] Testsuite: org.apache.solr.util.SolrPluginUtilsTest
    [junit] Tests run: 7, Failures: 0, Errors: 0, Time elapsed: 0.972 sec
    [junit] 
    [junit] Testsuite: org.apache.solr.schema.CopyFieldTest
    [junit] Tests run: 6, Failures: 0, Errors: 0, Time elapsed: 0.844 sec
    [junit] 
    [junit] Testsuite: org.apache.solr.update.TestIndexingPerformance
    [junit] Tests run: 1, Failures: 0, Errors: 0, Time elapsed: 2.288 sec
    [junit] 
    [junit] ------------- Standard Output ---------------
    [junit] includeDoc=true doc=[text, simple, text, test, text, how now brown cow, text,
what's that?, text, radical!, text, what's all this about, anyway?, text, just how fast is
this text indexing?]
    [junit] iter=1000 time=658 throughput=1519
    [junit] ------------- ---------------- ---------------
    [junit] Testsuite: org.apache.solr.util.DateMathParserTest
    [junit] Tests run: 7, Failures: 0, Errors: 0, Time elapsed: 0.107 sec
    [junit] 
    [junit] Testsuite: org.apache.solr.search.QueryParsingTest
    [junit] Tests run: 2, Failures: 0, Errors: 0, Time elapsed: 1.376 sec
    [junit] 
    [junit] Testsuite: org.apache.solr.velocity.VelocityResponseWriterTest
    [junit] Tests run: 1, Failures: 0, Errors: 0, Time elapsed: 1.629 sec
    [junit] 
    [junit] Testsuite: org.apache.solr.handler.component.DistributedTermsComponentTest
    [junit] Tests run: 1, Failures: 0, Errors: 0, Time elapsed: 13.938 sec
    [junit] 
    [junit] Testsuite: org.apache.solr.handler.component.DistributedSpellCheckComponentTest
    [junit] Tests run: 1, Failures: 0, Errors: 0, Time elapsed: 17.097 sec
    [junit] 
    [junit] Testsuite: org.apache.solr.schema.LegacyDateFieldTest
    [junit] Tests run: 4, Failures: 0, Errors: 0, Time elapsed: 0.015 sec
    [junit] 
    [junit] Testsuite: org.apache.solr.response.TestCSVResponseWriter
    [junit] Tests run: 1, Failures: 0, Errors: 0, Time elapsed: 1.407 sec
    [junit] 
    [junit] Testsuite: org.apache.solr.schema.TestBinaryField
    [junit] Tests run: 1, Failures: 0, Errors: 0, Time elapsed: 0.627 sec
    [junit] 
    [junit] Testsuite: org.apache.solr.schema.PolyFieldTest
    [junit] Tests run: 4, Failures: 0, Errors: 0, Time elapsed: 1.648 sec
    [junit] 
    [junit] Testsuite: org.apache.solr.TestDistributedSearch
    [junit] Tests run: 1, Failures: 0, Errors: 0, Time elapsed: 38.991 sec
    [junit] 
    [junit] Testsuite: org.apache.solr.analysis.TestCollationKeyFilterFactory
    [junit] Tests run: 5, Failures: 0, Errors: 0, Time elapsed: 0.157 sec
    [junit] 
    [junit] Testsuite: org.apache.solr.analysis.TestDutchStemFilterFactory
    [junit] Tests run: 1, Failures: 0, Errors: 0, Time elapsed: 0.024 sec
    [junit] 
    [junit] Testsuite: org.apache.solr.search.TestExtendedDismaxParser
    [junit] Tests run: 1, Failures: 0, Errors: 0, Time elapsed: 1.032 sec
    [junit] 
    [junit] Testsuite: org.apache.solr.analysis.TestHindiFilters
    [junit] Tests run: 4, Failures: 0, Errors: 0, Time elapsed: 0.043 sec
    [junit] 
    [junit] Testsuite: org.apache.solr.analysis.TestItalianLightStemFilterFactory
    [junit] Tests run: 1, Failures: 0, Errors: 0, Time elapsed: 0.02 sec
    [junit] 
    [junit] Testsuite: org.apache.solr.analysis.TestKeepWordFilter
    [junit] Tests run: 1, Failures: 0, Errors: 0, Time elapsed: 0.013 sec
    [junit] 
    [junit] Testsuite: org.apache.solr.analysis.TestShingleFilterFactory
    [junit] Tests run: 13, Failures: 0, Errors: 0, Time elapsed: 0.025 sec
    [junit] 
    [junit] Testsuite: org.apache.solr.analysis.TestStandardFactories
    [junit] Tests run: 9, Failures: 0, Errors: 0, Time elapsed: 0.024 sec
    [junit] 
    [junit] Testsuite: org.apache.solr.analysis.TestSynonymFilter
    [junit] Tests run: 7, Failures: 0, Errors: 0, Time elapsed: 0.023 sec
    [junit] 
    [junit] Testsuite: org.apache.solr.search.function.SortByFunctionTest
    [junit] Tests run: 1, Failures: 0, Errors: 0, Time elapsed: 1.097 sec
    [junit] 
    [junit] Testsuite: org.apache.solr.analysis.TestTrimFilter
    [junit] Tests run: 1, Failures: 0, Errors: 0, Time elapsed: 0.009 sec
    [junit] 
    [junit] Testsuite: org.apache.solr.search.TestSearchPerf
    [junit] Tests run: 1, Failures: 0, Errors: 0, Time elapsed: 0.461 sec
    [junit] 
    [junit] Testsuite: org.apache.solr.servlet.SolrRequestParserTest
    [junit] Tests run: 4, Failures: 0, Errors: 0, Time elapsed: 0.881 sec
    [junit] 
    [junit] Testsuite: org.apache.solr.servlet.NoCacheHeaderTest
    [junit] Tests run: 3, Failures: 0, Errors: 0, Time elapsed: 1.004 sec
    [junit] 
    [junit] Testsuite: org.apache.solr.client.solrj.TestBatchUpdate
    [junit] Tests run: 3, Failures: 0, Errors: 0, Time elapsed: 1.521 sec
    [junit] 
    [junit] Testsuite: org.apache.solr.client.solrj.beans.TestDocumentObjectBinder
    [junit] Tests run: 4, Failures: 0, Errors: 0, Time elapsed: 0.045 sec
    [junit] 
    [junit] Testsuite: org.apache.solr.update.DirectUpdateHandlerOptimizeTest
    [junit] Tests run: 1, Failures: 0, Errors: 0, Time elapsed: 0.91 sec
    [junit] 
    [junit] Testsuite: org.apache.solr.util.ArraysUtilsTest
    [junit] Tests run: 1, Failures: 0, Errors: 0, Time elapsed: 0.013 sec
    [junit] 
    [junit] Testsuite: org.apache.solr.client.solrj.embedded.MergeIndexesEmbeddedTest
    [junit] Tests run: 1, Failures: 0, Errors: 0, Time elapsed: 0.444 sec
    [junit] 
    [junit] Testsuite: org.apache.solr.common.util.TestHash
    [junit] Tests run: 2, Failures: 0, Errors: 0, Time elapsed: 0.111 sec
    [junit] 
    [junit] Testsuite: org.apache.solr.common.util.TestNamedListCodec
    [junit] Tests run: 4, Failures: 0, Errors: 0, Time elapsed: 0.288 sec
    [junit] 
    [junit] Testsuite: org.apache.solr.core.RAMDirectoryFactoryTest
    [junit] Tests run: 2, Failures: 0, Errors: 0, Time elapsed: 0.012 sec
    [junit] 
    [junit] Testsuite: org.apache.solr.core.SOLR749Test
    [junit] Tests run: 1, Failures: 0, Errors: 0, Time elapsed: 0.74 sec
    [junit] 
    [junit] Tests FAILED
    [junit] Testsuite: org.apache.solr.handler.TestReplicationHandler
    [junit] Tests run: 7, Failures: 0, Errors: 0, Time elapsed: 34.432 sec
    [junit] 
    [junit] ------------- Standard Error -----------------
    [junit] 15-okt-2010 21:14:44 org.apache.solr.handler.SnapPuller fetchLatestIndex
    [junit] SEVERE: Master at: http://localhost:22896/solr/replication is not available. Index
fetch failed. Exception: The host did not accept the connection within timeout of 5000 ms
    [junit] ------------- ---------------- ---------------
    [junit] Testsuite: org.apache.solr.core.TestJmxIntegration
    [junit] Tests run: 2, Failures: 0, Errors: 0, Time elapsed: 1.395 sec
    [junit] 
    [junit] Testsuite: org.apache.solr.handler.AnalysisRequestHandlerTest
    [junit] Tests run: 1, Failures: 0, Errors: 0, Time elapsed: 0.484 sec
    [junit] 
    [junit] Testsuite: org.apache.solr.handler.component.SpellCheckComponentTest
    [junit] Tests run: 8, Failures: 0, Errors: 0, Time elapsed: 1.264 sec
    [junit] 
    [junit] Testsuite: org.apache.solr.handler.component.StatsComponentTest
    [junit] Tests run: 1, Failures: 0, Errors: 0, Time elapsed: 3.866 sec
    [junit] 
    [junit] ------------- Standard Error -----------------
    [junit] 16 oct. 2010 07:14:49 org.apache.solr.handler.SnapPuller fetchLatestIndex
    [junit] GRAVE: Master at: http://localhost:22896/solr/replication is not available. Index
fetch failed. Exception: The host did not accept the connection within timeout of 5000 ms
    [junit] 16 oct. 2010 07:14:50 org.apache.solr.handler.SnapPuller fetchLatestIndex
    [junit] GRAVE: Master at: http://localhost:22956/solr/replication is not available. Index
fetch failed. Exception: The host did not accept the connection within timeout of 5000 ms
    [junit] ------------- ---------------- ---------------
    [junit] Testsuite: org.apache.solr.highlight.FastVectorHighlighterTest
    [junit] Tests run: 2, Failures: 0, Errors: 0, Time elapsed: 0.933 sec
    [junit] 
    [junit] Testsuite: org.apache.solr.request.JSONWriterTest
    [junit] Tests run: 3, Failures: 0, Errors: 0, Time elapsed: 0.778 sec
    [junit] 
    [junit] Testsuite: org.apache.solr.schema.RequiredFieldsTest
    [junit] Tests run: 3, Failures: 0, Errors: 0, Time elapsed: 1.055 sec
    [junit] 
    [junit] ------------- Standard Error -----------------
    [junit] 16.Eki.2010 02:14:52 org.apache.solr.schema.IndexSchema readSchema
    [junit] SEVERE: uniqueKey should not be multivalued
    [junit] ------------- ---------------- ---------------
    [junit] Testsuite: org.apache.solr.search.TestFastLRUCache
    [junit] Tests run: 2, Failures: 0, Errors: 0, Time elapsed: 0.027 sec
    [junit] 
    [junit] Testsuite: org.apache.solr.search.TestIndexSearcher
    [junit] Tests run: 1, Failures: 0, Errors: 0, Time elapsed: 0.756 sec
    [junit] 
    [junit] ------------- Standard Error -----------------
    [junit] 15 ???? 2010 14:14:54 org.apache.solr.handler.SnapPuller fetchLatestIndex
    [junit] SEVERE: Master at: http://localhost:22896/solr/replication is not available. Index
fetch failed. Exception: The host did not accept the connection within timeout of 5000 ms
    [junit] ------------- ---------------- ---------------
    [junit] Testsuite: org.apache.solr.spelling.SpellingQueryConverterTest
    [junit] Tests run: 4, Failures: 0, Errors: 0, Time elapsed: 0.432 sec
    [junit] 
    [junit] Testsuite: org.apache.solr.request.TestFaceting
    [junit] Tests run: 3, Failures: 0, Errors: 0, Time elapsed: 5.68 sec
    [junit] 
    [junit] Testsuite: org.apache.solr.schema.DateFieldTest
    [junit] Tests run: 6, Failures: 0, Errors: 0, Time elapsed: 0.709 sec
    [junit] 
    [junit] Testsuite: org.apache.solr.search.TestSolrQueryParser
    [junit] Tests run: 1, Failures: 0, Errors: 0, Time elapsed: 0.786 sec
    [junit] 
    [junit] Testsuite: org.apache.solr.update.processor.SignatureUpdateProcessorFactoryTest
    [junit] Tests run: 2, Failures: 0, Errors: 0, Time elapsed: 2.513 sec
    [junit] 
    [junit] Testsuite: org.apache.solr.util.TestOpenBitSet
    [junit] Tests run: 3, Failures: 0, Errors: 0, Time elapsed: 0.46 sec
    [junit] 
    [junit] Testsuite: org.apache.solr.search.TestSort
    [junit] Tests run: 1, Failures: 0, Errors: 0, Time elapsed: 1.43 sec
    [junit] 
    [junit] Testsuite: org.apache.solr.spelling.FileBasedSpellCheckerTest
    [junit] Tests run: 3, Failures: 0, Errors: 0, Time elapsed: 0.78 sec
    [junit] 
    [junit] Testsuite: org.apache.solr.update.DirectUpdateHandlerTest
    [junit] Tests run: 7, Failures: 0, Errors: 0, Time elapsed: 2.591 sec
    [junit] 
    [junit] Testsuite: org.apache.solr.util.PrimUtilsTest
    [junit] Tests run: 1, Failures: 0, Errors: 0, Time elapsed: 0.018 sec
    [junit] 
    [junit] Testsuite: org.apache.solr.search.TestRangeQuery
    [junit] Tests run: 2, Failures: 0, Errors: 0, Time elapsed: 25.58 sec
    [junit] 
    [junit] Testsuite: org.apache.solr.spelling.IndexBasedSpellCheckerTest
    [junit] Tests run: 5, Failures: 0, Errors: 0, Time elapsed: 0.737 sec
    [junit] 
    [junit] Testsuite: org.apache.solr.update.DocumentBuilderTest
    [junit] Tests run: 3, Failures: 0, Errors: 0, Time elapsed: 0.458 sec
    [junit] 
    [junit] Testsuite: org.apache.solr.util.TestNumberUtils
    [junit] Tests run: 1, Failures: 0, Errors: 0, Time elapsed: 0.327 sec
    [junit] 

BUILD FAILED
/usr<https://hudson.apache.org/hudson/job/Lucene-Solr-tests-only-3.x/ws/checkout/build.xml>:27:
The following error occurred while executing this line:
/usr<https://hudson.apache.org/hudson/job/Lucene-Solr-tests-only-3.x/ws/checkout/solr/build.xml>:387:

The following error occurred while executing this line:
/usr<https://hudson.apache.org/hudson/job/Lucene-Solr-tests-only-3.x/ws/checkout/solr/build.xml>:481:
Tests failed!
The following error occurred while executing this line:
/usr<https://hudson.apache.org/hudson/job/Lucene-Solr-tests-only-3.x/ws/checkout/solr/build.xml>:481:
Tests failed!
The following error occurred while executing this line:
/usr<https://hudson.apache.org/hudson/job/Lucene-Solr-tests-only-3.x/ws/checkout/solr/build.xml>:481:
Tests failed!
The following error occurred while executing this line:
/usr<https://hudson.apache.org/hudson/job/Lucene-Solr-tests-only-3.x/ws/checkout/solr/build.xml>:481:
Tests failed!
The following error occurred while executing this line:
/usr<https://hudson.apache.org/hudson/job/Lucene-Solr-tests-only-3.x/ws/checkout/solr/build.xml>:481:
Tests failed!
The following error occurred while executing this line:
/usr<https://hudson.apache.org/hudson/job/Lucene-Solr-tests-only-3.x/ws/checkout/solr/build.xml>:481:
Tests failed!

Total time: 5 minutes 7 seconds
Recording test results


---------------------------------------------------------------------
To unsubscribe, e-mail: dev-unsubscribe@lucene.apache.org
For additional commands, e-mail: dev-help@lucene.apache.org


Mime
View raw message