lucene-dev mailing list archives

Site index · List index
Message view « Date » · « Thread »
Top « Date » · « Thread »
From "Uwe Schindler" <...@thetaphi.de>
Subject RE: Build failed in Hudson: Solr-3.x #121
Date Sat, 02 Oct 2010 11:15:59 GMT
These seem to be real errors, have no idea...

-----
Uwe Schindler
H.-H.-Meier-Allee 63, D-28213 Bremen
http://www.thetaphi.de
eMail: uwe@thetaphi.de


> -----Original Message-----
> From: Apache Hudson Server [mailto:hudson@hudson.apache.org]
> Sent: Saturday, October 02, 2010 12:59 PM
> To: dev@lucene.apache.org
> Subject: Build failed in Hudson: Solr-3.x #121
> 
> See <https://hudson.apache.org/hudson/job/Solr-3.x/121/>
> 
> ------------------------------------------
> [...truncated 11158 lines...]
>     [junit] 	at
> org.apache.solr.util.TestHarness.queryAndResponse(TestHarness.java:334)
>     [junit] 	at org.apache.solr.util.TestHarness.query(TestHarness.java:321)
>     [junit] 	at
> org.apache.solr.handler.dataimport.AbstractDataImportHandlerTestCase.runFu
> llImport(AbstractDataImportHandlerTestCase.java:108)
>     [junit] 	at
> org.apache.solr.handler.dataimport.TestDocBuilder2.testFileListEntityProcessor
> _lastIndexTime(TestDocBuilder2.java:245)
>     [junit] 	at sun.reflect.NativeMethodAccessorImpl.invoke0(Native
> Method)
>     [junit] 	at
> sun.reflect.NativeMethodAccessorImpl.invoke(NativeMethodAccessorImpl.java:
> 39)
>     [junit] 	at
> sun.reflect.DelegatingMethodAccessorImpl.invoke(DelegatingMethodAccessorI
> mpl.java:25)
>     [junit] 	at java.lang.reflect.Method.invoke(Method.java:585)
>     [junit] 	at
> org.junit.runners.model.FrameworkMethod$1.runReflectiveCall(FrameworkMe
> thod.java:44)
>     [junit] 	at
> org.junit.internal.runners.model.ReflectiveCallable.run(ReflectiveCallable.java:
> 15)
>     [junit] 	at
> org.junit.runners.model.FrameworkMethod.invokeExplosively(FrameworkMeth
> od.java:41)
>     [junit] 	at
> org.junit.internal.runners.statements.InvokeMethod.evaluate(InvokeMethod.jav
> a:20)
>     [junit] 	at
> org.junit.rules.TestWatchman$1.evaluate(TestWatchman.java:48)
>     [junit] 	at
> org.junit.internal.runners.statements.RunBefores.evaluate(RunBefores.java:28)
>     [junit] 	at
> org.junit.internal.runners.statements.RunAfters.evaluate(RunAfters.java:31)
>     [junit] 	at
> org.junit.runners.BlockJUnit4ClassRunner.runChild(BlockJUnit4ClassRunner.java
> :76)
>     [junit] 	at
> org.apache.lucene.util.LuceneTestCase$LuceneTestCaseRunner.runChild(Lucen
> eTestCase.java:693)
>     [junit] 	at
> org.apache.lucene.util.LuceneTestCase$LuceneTestCaseRunner.runChild(Lucen
> eTestCase.java:666)
>     [junit] 	at
> org.junit.runners.ParentRunner$3.run(ParentRunner.java:193)
>     [junit] 	at
> org.junit.runners.ParentRunner$1.schedule(ParentRunner.java:52)
>     [junit] 	at
> org.junit.runners.ParentRunner.runChildren(ParentRunner.java:191)
>     [junit] 	at
> org.junit.runners.ParentRunner.access$000(ParentRunner.java:42)
>     [junit] 	at
> org.junit.runners.ParentRunner$2.evaluate(ParentRunner.java:184)
>     [junit] 	at
> org.junit.internal.runners.statements.RunBefores.evaluate(RunBefores.java:28)
>     [junit] 	at
> org.junit.internal.runners.statements.RunAfters.evaluate(RunAfters.java:31)
>     [junit] 	at org.junit.runners.ParentRunner.run(ParentRunner.java:236)
>     [junit] 	at
> junit.framework.JUnit4TestAdapter.run(JUnit4TestAdapter.java:39)
>     [junit] 	at
> org.apache.tools.ant.taskdefs.optional.junit.JUnitTestRunner.run(JUnitTestRunn
> er.java:421)
>     [junit] 	at
> org.apache.tools.ant.taskdefs.optional.junit.JUnitTestRunner.launch(JUnitTestRu
> nner.java:912)
>     [junit] 	at
> org.apache.tools.ant.taskdefs.optional.junit.JUnitTestRunner.main(JUnitTestRun
> ner.java:743)
>     [junit] Caused by: java.text.ParseException: Unparseable date: "1969-12-31
> 19:00:00"
>     [junit] 	at java.text.DateFormat.parse(DateFormat.java:335)
>     [junit] 	at
> org.apache.solr.handler.dataimport.FileListEntityProcessor.getDate(FileListEntit
> yProcessor.java:165)
>     [junit] 	... 40 more
>     [junit] 2.10.2010 1:58:51 org.apache.solr.handler.dataimport.DataImporter
> doFullImport
>     [junit] SEVERE: Full Import failed
>     [junit] org.apache.solr.handler.dataimport.DataImportHandlerException:
> Invalid expression for date Processing Document # 1
>     [junit] 	at
> org.apache.solr.handler.dataimport.FileListEntityProcessor.getDate(FileListEntit
> yProcessor.java:167)
>     [junit] 	at
> org.apache.solr.handler.dataimport.FileListEntityProcessor.nextRow(FileListEnti
> tyProcessor.java:204)
>     [junit] 	at
> org.apache.solr.handler.dataimport.EntityProcessorWrapper.nextRow(EntityPro
> cessorWrapper.java:233)
>     [junit] 	at
> org.apache.solr.handler.dataimport.DocBuilder.buildDocument(DocBuilder.java
> :579)
>     [junit] 	at
> org.apache.solr.handler.dataimport.DocBuilder.doFullDump(DocBuilder.java:26
> 0)
>     [junit] 	at
> org.apache.solr.handler.dataimport.DocBuilder.execute(DocBuilder.java:184)
>     [junit] 	at
> org.apache.solr.handler.dataimport.DataImporter.doFullImport(DataImporter.j
> ava:334)
>     [junit] 	at
> org.apache.solr.handler.dataimport.DataImporter.runCmd(DataImporter.java:3
> 92)
>     [junit] 	at
> org.apache.solr.handler.dataimport.DataImportHandler.handleRequestBody(Da
> taImportHandler.java:203)
>     [junit] 	at
> org.apache.solr.handler.RequestHandlerBase.handleRequest(RequestHandlerB
> ase.java:131)
>     [junit] 	at org.apache.solr.core.SolrCore.execute(SolrCore.java:1322)
>     [junit] 	at
> org.apache.solr.util.TestHarness.queryAndResponse(TestHarness.java:334)
>     [junit] 	at org.apache.solr.util.TestHarness.query(TestHarness.java:321)
>     [junit] 	at
> org.apache.solr.handler.dataimport.AbstractDataImportHandlerTestCase.runFu
> llImport(AbstractDataImportHandlerTestCase.java:108)
>     [junit] 	at
> org.apache.solr.handler.dataimport.TestDocBuilder2.testFileListEntityProcessor
> _lastIndexTime(TestDocBuilder2.java:245)
>     [junit] 	at sun.reflect.NativeMethodAccessorImpl.invoke0(Native
> Method)
>     [junit] 	at
> sun.reflect.NativeMethodAccessorImpl.invoke(NativeMethodAccessorImpl.java:
> 39)
>     [junit] 	at
> sun.reflect.DelegatingMethodAccessorImpl.invoke(DelegatingMethodAccessorI
> mpl.java:25)
>     [junit] 	at java.lang.reflect.Method.invoke(Method.java:585)
>     [junit] 	at
> org.junit.runners.model.FrameworkMethod$1.runReflectiveCall(FrameworkMe
> thod.java:44)
>     [junit] 	at
> org.junit.internal.runners.model.ReflectiveCallable.run(ReflectiveCallable.java:
> 15)
>     [junit] 	at
> org.junit.runners.model.FrameworkMethod.invokeExplosively(FrameworkMeth
> od.java:41)
>     [junit] 	at
> org.junit.internal.runners.statements.InvokeMethod.evaluate(InvokeMethod.jav
> a:20)
>     [junit] 	at
> org.junit.rules.TestWatchman$1.evaluate(TestWatchman.java:48)
>     [junit] 	at
> org.junit.internal.runners.statements.RunBefores.evaluate(RunBefores.java:28)
>     [junit] 	at
> org.junit.internal.runners.statements.RunAfters.evaluate(RunAfters.java:31)
>     [junit] 	at
> org.junit.runners.BlockJUnit4ClassRunner.runChild(BlockJUnit4ClassRunner.java
> :76)
>     [junit] 	at
> org.apache.lucene.util.LuceneTestCase$LuceneTestCaseRunner.runChild(Lucen
> eTestCase.java:693)
>     [junit] 	at
> org.apache.lucene.util.LuceneTestCase$LuceneTestCaseRunner.runChild(Lucen
> eTestCase.java:666)
>     [junit] 	at
> org.junit.runners.ParentRunner$3.run(ParentRunner.java:193)
>     [junit] 	at
> org.junit.runners.ParentRunner$1.schedule(ParentRunner.java:52)
>     [junit] 	at
> org.junit.runners.ParentRunner.runChildren(ParentRunner.java:191)
>     [junit] 	at
> org.junit.runners.ParentRunner.access$000(ParentRunner.java:42)
>     [junit] 	at
> org.junit.runners.ParentRunner$2.evaluate(ParentRunner.java:184)
>     [junit] 	at
> org.junit.internal.runners.statements.RunBefores.evaluate(RunBefores.java:28)
>     [junit] 	at
> org.junit.internal.runners.statements.RunAfters.evaluate(RunAfters.java:31)
>     [junit] 	at org.junit.runners.ParentRunner.run(ParentRunner.java:236)
>     [junit] 	at
> junit.framework.JUnit4TestAdapter.run(JUnit4TestAdapter.java:39)
>     [junit] 	at
> org.apache.tools.ant.taskdefs.optional.junit.JUnitTestRunner.run(JUnitTestRunn
> er.java:421)
>     [junit] 	at
> org.apache.tools.ant.taskdefs.optional.junit.JUnitTestRunner.launch(JUnitTestRu
> nner.java:912)
>     [junit] 	at
> org.apache.tools.ant.taskdefs.optional.junit.JUnitTestRunner.main(JUnitTestRun
> ner.java:743)
>     [junit] Caused by: java.text.ParseException: Unparseable date: "1969-12-31
> 19:00:00"
>     [junit] 	at java.text.DateFormat.parse(DateFormat.java:335)
>     [junit] 	at
> org.apache.solr.handler.dataimport.FileListEntityProcessor.getDate(FileListEntit
> yProcessor.java:165)
>     [junit] 	... 40 more
>     [junit] ------------- ---------------- ---------------
>     [junit] TEST org.apache.solr.handler.dataimport.TestDocBuilder2 FAILED
>     [junit] Testsuite: org.apache.solr.handler.dataimport.TestEntityProcessorBase
>     [junit] Tests run: 1, Failures: 0, Errors: 0, Time elapsed: 0.019 sec
>     [junit]
>     [junit] Testsuite: org.apache.solr.handler.dataimport.TestErrorHandling
>     [junit] Tests run: 4, Failures: 0, Errors: 0, Time elapsed: 1.012 sec
>     [junit]
>     [junit] Testsuite: org.apache.solr.handler.dataimport.TestEvaluatorBag
>     [junit] Tests run: 5, Failures: 0, Errors: 0, Time elapsed: 0.021 sec
>     [junit]
>     [junit] Testsuite: org.apache.solr.handler.dataimport.TestFieldReader
>     [junit] Tests run: 1, Failures: 0, Errors: 0, Time elapsed: 0.014 sec
>     [junit]
>     [junit] Testsuite:
> org.apache.solr.handler.dataimport.TestFileListEntityProcessor
>     [junit] Testcase:
> testNTOT(org.apache.solr.handler.dataimport.TestFileListEntityProcessor):
> 	Caused an ERROR
>     [junit] Invalid expression for date
>     [junit] org.apache.solr.handler.dataimport.DataImportHandlerException:
> Invalid expression for date
>     [junit] 	at
> org.apache.solr.handler.dataimport.FileListEntityProcessor.getDate(FileListEntit
> yProcessor.java:167)
>     [junit] 	at
> org.apache.solr.handler.dataimport.FileListEntityProcessor.nextRow(FileListEnti
> tyProcessor.java:204)
>     [junit] 	at
> org.apache.solr.handler.dataimport.TestFileListEntityProcessor.getFiles(TestFile
> ListEntityProcessor.java:127)
>     [junit] 	at
> org.apache.solr.handler.dataimport.TestFileListEntityProcessor.testNTOT(TestFi
> leListEntityProcessor.java:166)
>     [junit] 	at
> org.apache.lucene.util.LuceneTestCase$LuceneTestCaseRunner.runChild(Lucen
> eTestCase.java:693)
>     [junit] 	at
> org.apache.lucene.util.LuceneTestCase$LuceneTestCaseRunner.runChild(Lucen
> eTestCase.java:666)
>     [junit] Caused by: java.text.ParseException: Unparseable date: "2010-10-02
> 06:58:02"
>     [junit] 	at java.text.DateFormat.parse(DateFormat.java:335)
>     [junit] 	at
> org.apache.solr.handler.dataimport.FileListEntityProcessor.getDate(FileListEntit
> yProcessor.java:165)
>     [junit]
>     [junit]
>     [junit] Tests run: 4, Failures: 0, Errors: 1, Time elapsed: 0.02 sec
>     [junit]
>     [junit] ------------- Standard Output ---------------
>     [junit] NOTE: reproduce with: ant test -Dtestcase=TestFileListEntityProcessor
> -Dtestmethod=testNTOT -Dtests.seed=572684061116443423:-
> 5663898800630360505
>     [junit] NOTE: test params are: locale=fi, timezone=Brazil/East
>     [junit] ------------- ---------------- ---------------
>     [junit] TEST org.apache.solr.handler.dataimport.TestFileListEntityProcessor
> FAILED
>     [junit] Testsuite: org.apache.solr.handler.dataimport.TestJdbcDataSource
>     [junit] Tests run: 3, Failures: 0, Errors: 0, Time elapsed: 0.055 sec
>     [junit]
>     [junit] Testsuite: org.apache.solr.handler.dataimport.TestLineEntityProcessor
>     [junit] Tests run: 4, Failures: 0, Errors: 0, Time elapsed: 0.034 sec
>     [junit]
>     [junit] ------------- Standard Output ---------------
>     [junit]
>     [junit]      rawLine=''
>     [junit]      rawLine='# this is what the output from 'find . -ls; looks like,
> athough the format'
>     [junit]      rawLine='# of the time stamp varies depending on the age of the
> file and your LANG '
>     [junit]      rawLine='# env setting'
>     [junit]      rawLine='412577   0 drwxr-xr-x  6 user group    204 1 Apr 10:53
> /Volumes/spare/ts'
>     [junit]      rawLine='412582   0 drwxr-xr-x 13 user group    442 1 Apr 10:18
> /Volumes/spare/ts/config'
>     [junit]      rawLine='412583  24 -rwxr-xr-x  1 user group   8318 1 Apr 11:10
> /Volumes/spare/ts/config/dc.xsd'
>     [junit]      rawLine='412584  32 -rwxr-xr-x  1 user group  12847 1 Apr 11:10
> /Volumes/spare/ts/config/dcterms.xsd'
>     [junit]      rawLine='412585   8 -rwxr-xr-x  1 user group   3156 1 Apr 11:10
> /Volumes/spare/ts/config/s-deliver.css'
>     [junit]      rawLine='412586 192 -rwxr-xr-x  1 user group  97764 1 Apr 11:10
> /Volumes/spare/ts/config/s-deliver.xsl'
>     [junit]      rawLine='412587 224 -rwxr-xr-x  1 user group 112700 1 Apr 11:10
> /Volumes/spare/ts/config/sml-delivery-2.1.xsd'
>     [junit]      rawLine='412588 208 -rwxr-xr-x  1 user group 103419 1 Apr 11:10
> /Volumes/spare/ts/config/sml-delivery-norm-2.0.dtd'
>     [junit]      rawLine='412589 248 -rwxr-xr-x  1 user group 125296 1 Apr 11:10
> /Volumes/spare/ts/config/sml-delivery-norm-2.1.dtd'
>     [junit]      rawLine='412590  72 -rwxr-xr-x  1 user group  36256 1 Apr 11:10
> /Volumes/spare/ts/config/jm.xsd'
>     [junit]      rawLine='412591   8 -rwxr-xr-x  1 user group    990 1 Apr 11:10
> /Volumes/spare/ts/config/video.gif'
>     [junit]      rawLine='412592   8 -rwxr-xr-x  1 user group   1498 1 Apr 11:10
> /Volumes/spare/ts/config/xlink.xsd'
>     [junit]      rawLine='412593   8 -rwxr-xr-x  1 user group   1155 1 Apr 11:10
> /Volumes/spare/ts/config/xml.xsd'
>     [junit]      rawLine='412594   0 drwxr-xr-x  4 user group    136 1 Apr 10:18
> /Volumes/spare/ts/acm19'
>     [junit]      rawLine='412621   0 drwxr-xr-x 57 user group   1938 1 Apr 10:18
> /Volumes/spare/ts/acm19/data'
>     [junit]      rawLine='412622  24 -rwxr-xr-x  1 user group   8894 1 Apr 11:09
> /Volumes/spare/ts/acm19/data/00000510.xml'
>     [junit]      rawLine='412623  32 -rwxr-xr-x  1 user group  14124 1 Apr 11:09
> /Volumes/spare/ts/acm19/data/00000603.xml'
>     [junit]      rawLine='412624  24 -rwxr-xr-x  1 user group  11976 1 Apr 11:09
> /Volumes/spare/ts/acm19/data/00001292.xml'
>     [junit]      rawLine='# tacked on an extra line to cause a file to be deleted.'
>     [junit]      rawLine='DELETE
> /Volumes/spare/ts/acm19/data/00001292old.xml'
>     [junit] ------------- ---------------- ---------------
>     [junit] Testsuite:
> org.apache.solr.handler.dataimport.TestNumberFormatTransformer
>     [junit] Tests run: 9, Failures: 0, Errors: 0, Time elapsed: 0.028 sec
>     [junit]
>     [junit] Testsuite:
> org.apache.solr.handler.dataimport.TestPlainTextEntityProcessor
>     [junit] Tests run: 1, Failures: 0, Errors: 0, Time elapsed: 0.021 sec
>     [junit]
>     [junit] Testsuite: org.apache.solr.handler.dataimport.TestRegexTransformer
>     [junit] Tests run: 5, Failures: 0, Errors: 0, Time elapsed: 0.015 sec
>     [junit]
>     [junit] Testsuite: org.apache.solr.handler.dataimport.TestScriptTransformer
>     [junit] Tests run: 0, Failures: 0, Errors: 0, Time elapsed: 0.011 sec
>     [junit]
>     [junit] Testsuite: org.apache.solr.handler.dataimport.TestSqlEntityProcessor
>     [junit] Tests run: 4, Failures: 0, Errors: 0, Time elapsed: 0.023 sec
>     [junit]
>     [junit]  xml response was: <?xml version="1.0" encoding="UTF-8"?>
>     [junit] <response>
>     [junit] <lst name="responseHeader"><int name="status">0</int><int
> name="QTime">3</int><lst name="params"><str name="rows">20</str><str
> name="start">0</str><str name="q">id:5</str><str
> name="qt">standard</str><str name="version">2.2</str></lst></lst><result
> name="response" numFound="0" start="0"/>
>     [junit] </response>
>     [junit]
>     [junit]  request was: rows=20&start=0&q=id:5&qt=standard&version=2.2)
>     [junit] Testsuite: org.apache.solr.handler.dataimport.TestSqlEntityProcessor2
>     [junit] Testcase:
> testLastIndexTime(org.apache.solr.handler.dataimport.TestSqlEntityProcessor2)
> :	FAILED
>     [junit] query failed XPath: //*[@numFound='1']
>     [junit]  xml response was: <?xml version="1.0" encoding="UTF-8"?>
>     [junit] <response>
>     [junit] <lst name="responseHeader"><int name="status">0</int><int
> name="QTime">3</int><lst name="params"><str name="rows">20</str><str
> name="start">0</str><str name="q">id:5</str><str
> name="qt">standard</str><str name="version">2.2</str></lst></lst><result
> name="response" numFound="0" start="0"/>
>     [junit] </response>
>     [junit]
>     [junit]  request was: rows=20&start=0&q=id:5&qt=standard&version=2.2
>     [junit] junit.framework.AssertionFailedError: query failed XPath:
> //*[@numFound='1']
>     [junit]  xml response was: <?xml version="1.0" encoding="UTF-8"?>
>     [junit] <response>
>     [junit] <lst name="responseHeader"><int name="status">0</int><int
> name="QTime">3</int><lst name="params"><str name="rows">20</str><str
> name="start">0</str><str name="q">id:5</str><str
> name="qt">standard</str><str name="version">2.2</str></lst></lst><result
> name="response" numFound="0" start="0"/>
>     [junit] </response>
>     [junit]
>     [junit]  request was: rows=20&start=0&q=id:5&qt=standard&version=2.2
>     [junit] 	at
> org.apache.lucene.util.LuceneTestCase$LuceneTestCaseRunner.runChild(Lucen
> eTestCase.java:693)
>     [junit] 	at
> org.apache.lucene.util.LuceneTestCase$LuceneTestCaseRunner.runChild(Lucen
> eTestCase.java:666)
>     [junit]  xml response was: <?xml version="1.0" encoding="UTF-8"?>
>     [junit] <response>
>     [junit] <lst name="responseHeader"><int name="status">0</int><int
> name="QTime">3</int><lst name="params"><str name="rows">20</str><str
> name="start">0</str><str name="q">id:5</str><str
> name="qt">standard</str><str name="version">2.2</str></lst></lst><result
> name="response" numFound="0" start="0"/>
>     [junit] </response>
>     [junit]
>     [junit]  request was: rows=20&start=0&q=id:5&qt=standard&version=2.2
>     [junit] 	at
> org.apache.solr.util.AbstractSolrTestCase.assertQ(AbstractSolrTestCase.java:23
> 7)
>     [junit] 	at
> org.apache.solr.util.AbstractSolrTestCase.assertQ(AbstractSolrTestCase.java:22
> 7)
>     [junit] 	at
> org.apache.solr.handler.dataimport.TestSqlEntityProcessor2.testLastIndexTime(
> TestSqlEntityProcessor2.java:218)
>     [junit]
>     [junit]
>     [junit] Tests run: 7, Failures: 1, Errors: 0, Time elapsed: 1.852 sec
>     [junit]
>     [junit] ------------- Standard Output ---------------
>     [junit] NOTE: reproduce with: ant test -Dtestcase=TestSqlEntityProcessor2 -
> Dtestmethod=testLastIndexTime -
> Dtests.seed=445224230905445182:8257404862138200036
>     [junit] NOTE: test params are: locale=en_CA, timezone=W-SU
>     [junit] ------------- ---------------- ---------------
>     [junit] TEST org.apache.solr.handler.dataimport.TestSqlEntityProcessor2
> FAILED
>     [junit] Testsuite:
> org.apache.solr.handler.dataimport.TestSqlEntityProcessorDelta
>     [junit] Tests run: 8, Failures: 0, Errors: 0, Time elapsed: 2.842 sec
>     [junit]
>     [junit] Testsuite:
> org.apache.solr.handler.dataimport.TestSqlEntityProcessorDelta2
>     [junit] Tests run: 8, Failures: 0, Errors: 0, Time elapsed: 2.51 sec
>     [junit]
>     [junit] Testsuite: org.apache.solr.handler.dataimport.TestTemplateString
>     [junit] Tests run: 1, Failures: 0, Errors: 0, Time elapsed: 0.018 sec
>     [junit]
>     [junit] Testsuite:
> org.apache.solr.handler.dataimport.TestTemplateTransformer
>     [junit] Tests run: 1, Failures: 0, Errors: 0, Time elapsed: 0.009 sec
>     [junit]
>     [junit] Testsuite: org.apache.solr.handler.dataimport.TestThreaded
>     [junit] Tests run: 1, Failures: 0, Errors: 0, Time elapsed: 0.256 sec
>     [junit]
>     [junit] Testsuite: org.apache.solr.handler.dataimport.TestURLDataSource
>     [junit] Tests run: 1, Failures: 0, Errors: 0, Time elapsed: 0.016 sec
>     [junit]
>     [junit] Testsuite: org.apache.solr.handler.dataimport.TestVariableResolver
>     [junit] Tests run: 9, Failures: 0, Errors: 0, Time elapsed: 0.022 sec
>     [junit]
>     [junit] Testsuite:
> org.apache.solr.handler.dataimport.TestXPathEntityProcessor
>     [junit] Tests run: 8, Failures: 0, Errors: 0, Time elapsed: 0.443 sec
>     [junit]
>     [junit] Testsuite: org.apache.solr.handler.dataimport.TestXPathRecordReader
>     [junit] Tests run: 21, Failures: 0, Errors: 0, Time elapsed: 0.041 sec
>     [junit]
>     [junit] Tests FAILED
> 
> BUILD FAILED
> /usr<https://hudson.apache.org/hudson/job/Solr-
> 3.x/ws/branch_3x/solr/common-build.xml>:455: The following error occurred
> while executing this line:
> /usr<https://hudson.apache.org/hudson/job/Solr-
> 3.x/ws/branch_3x/solr/common-build.xml>:316: The following error occurred
> while executing this line:
> /usr<https://hudson.apache.org/hudson/job/Solr-
> 3.x/ws/branch_3x/solr/contrib/dataimporthandler/build.xml>:171: Tests failed!
> 
> Total time: 21 minutes 41 seconds
> [TASKS] Skipping publisher since build result is FAILURE Publishing Javadoc
> Archiving artifacts Recording test results Publishing Clover coverage report...
> No Clover report will be published due to a Build Failure
> 
> 
> ---------------------------------------------------------------------
> To unsubscribe, e-mail: dev-unsubscribe@lucene.apache.org For additional
> commands, e-mail: dev-help@lucene.apache.org



---------------------------------------------------------------------
To unsubscribe, e-mail: dev-unsubscribe@lucene.apache.org
For additional commands, e-mail: dev-help@lucene.apache.org


Mime
View raw message