lucene-dev mailing list archives

Site index · List index
Message view « Date » · « Thread »
Top « Date » · « Thread »
From Apache Hudson Server <hud...@hudson.apache.org>
Subject Build failed in Hudson: Solr-trunk #1236
Date Fri, 03 Sep 2010 09:16:24 GMT
See <https://hudson.apache.org/hudson/job/Solr-trunk/1236/changes>

Changes:

[gsingers] SOLR-1665: add distributed support

------------------------------------------
[...truncated 10629 lines...]
    [junit] Testsuite: org.apache.solr.spelling.suggest.SuggesterTest
    [junit] Tests run: 2, Failures: 0, Errors: 0, Time elapsed: 2.679 sec
    [junit] 
    [junit] Testsuite: org.apache.solr.update.AutoCommitTest
    [junit] Tests run: 1, Failures: 0, Errors: 0, Time elapsed: 7.427 sec
    [junit] 
    [junit] Testsuite: org.apache.solr.update.DirectUpdateHandlerOptimizeTest
    [junit] Tests run: 1, Failures: 0, Errors: 0, Time elapsed: 4.586 sec
    [junit] 
    [junit] Testsuite: org.apache.solr.update.DirectUpdateHandlerTest
    [junit] Tests run: 7, Failures: 0, Errors: 0, Time elapsed: 7.058 sec
    [junit] 
    [junit] Testsuite: org.apache.solr.update.DocumentBuilderTest
    [junit] Tests run: 3, Failures: 0, Errors: 0, Time elapsed: 3.817 sec
    [junit] 
    [junit] Testsuite: org.apache.solr.update.TestIndexingPerformance
    [junit] Tests run: 1, Failures: 0, Errors: 0, Time elapsed: 4.798 sec
    [junit] 
    [junit] Testsuite: org.apache.solr.update.processor.SignatureUpdateProcessorFactoryTest
    [junit] Tests run: 4, Failures: 0, Errors: 0, Time elapsed: 5.818 sec
    [junit] 
    [junit] Testsuite: org.apache.solr.update.processor.UpdateRequestProcessorFactoryTest
    [junit] Tests run: 1, Failures: 0, Errors: 0, Time elapsed: 3.243 sec
    [junit] 
    [junit] Testsuite: org.apache.solr.util.DateMathParserTest
    [junit] Tests run: 7, Failures: 0, Errors: 0, Time elapsed: 4.214 sec
    [junit] 
    [junit] Testsuite: org.apache.solr.util.PrimUtilsTest
    [junit] Tests run: 1, Failures: 0, Errors: 0, Time elapsed: 0.656 sec
    [junit] 
    [junit] Testsuite: org.apache.solr.util.SolrPluginUtilsTest
    [junit] Tests run: 7, Failures: 0, Errors: 0, Time elapsed: 4.203 sec
    [junit] 
    [junit] Testsuite: org.apache.solr.util.TestNumberUtils
    [junit] Tests run: 1, Failures: 0, Errors: 0, Time elapsed: 1.442 sec
    [junit] 
    [junit] Testsuite: org.apache.solr.util.TestOpenBitSet
    [junit] Tests run: 3, Failures: 0, Errors: 0, Time elapsed: 1.688 sec
    [junit] 
    [junit] Testsuite: org.apache.solr.util.TestUtils
    [junit] Tests run: 3, Failures: 0, Errors: 0, Time elapsed: 0.678 sec
    [junit] 
    [junit] Testsuite: org.apache.solr.velocity.VelocityResponseWriterTest
    [junit] Tests run: 1, Failures: 0, Errors: 0, Time elapsed: 4.132 sec
    [junit] 

junit-parallel:

junit:

test-core:

build-contrib:

init:

init-forrest-entities:

compile-lucene:

compile-solrj:

compile:
    [javac] Compiling 3 source files to <https://hudson.apache.org/hudson/job/Solr-trunk/ws/trunk/solr/build/solr>

compileTests:

make-manifest:
    [mkdir] Created dir: <https://hudson.apache.org/hudson/job/Solr-trunk/ws/trunk/solr/build/META-INF>

compile:

build:
      [jar] Building jar: <https://hudson.apache.org/hudson/job/Solr-trunk/ws/trunk/solr/contrib/clustering/build/apache-solr-clustering-4.0-2010-09-03_08-06-03.jar>

init:

init-forrest-entities:

compile-lucene:

compile-solrj:

compile:
    [javac] Compiling 3 source files to <https://hudson.apache.org/hudson/job/Solr-trunk/ws/trunk/solr/build/solr>

compileTests:

make-manifest:

compile:

compileExtras:

build:
      [jar] Building jar: <https://hudson.apache.org/hudson/job/Solr-trunk/ws/trunk/solr/contrib/dataimporthandler/target/apache-solr-dataimporthandler-4.0-2010-09-03_08-06-03.jar>
      [jar] Building jar: <https://hudson.apache.org/hudson/job/Solr-trunk/ws/trunk/solr/contrib/dataimporthandler/target/apache-solr-dataimporthandler-extras-4.0-2010-09-03_08-06-03.jar>

init:

init-forrest-entities:

compile-lucene:

compile-solrj:

compile:
    [javac] Compiling 3 source files to <https://hudson.apache.org/hudson/job/Solr-trunk/ws/trunk/solr/build/solr>

compileTests:

make-manifest:

compile:

build:
      [jar] Building jar: <https://hudson.apache.org/hudson/job/Solr-trunk/ws/trunk/solr/contrib/extraction/build/apache-solr-cell-4.0-2010-09-03_08-06-03.jar>

test-contrib:

init:

init-forrest-entities:

compile-lucene:

compile-solrj:

compile:
    [javac] Compiling 3 source files to <https://hudson.apache.org/hudson/job/Solr-trunk/ws/trunk/solr/build/solr>

compileTests:

make-manifest:

compile:

compileTests:
    [mkdir] Created dir: <https://hudson.apache.org/hudson/job/Solr-trunk/ws/trunk/solr/contrib/clustering/build/test-classes>
    [javac] Compiling 5 source files to <https://hudson.apache.org/hudson/job/Solr-trunk/ws/trunk/solr/contrib/clustering/build/test-classes>

test:
    [junit] Running org.apache.solr.handler.clustering.ClusteringComponentTest
    [junit] Tests run: 1, Failures: 0, Errors: 0, Time elapsed: 4.625 sec
    [junit] Running org.apache.solr.handler.clustering.carrot2.CarrotClusteringEngineTest
    [junit] Tests run: 7, Failures: 0, Errors: 0, Time elapsed: 5.263 sec

init:

init-forrest-entities:

compile-lucene:

compile-solrj:

compile:
    [javac] Compiling 3 source files to <https://hudson.apache.org/hudson/job/Solr-trunk/ws/trunk/solr/build/solr>

compileTests:

make-manifest:

compile:

compileTests:
    [mkdir] Created dir: <https://hudson.apache.org/hudson/job/Solr-trunk/ws/trunk/solr/contrib/dataimporthandler/target/test-classes>
    [javac] Compiling 31 source files to <https://hudson.apache.org/hudson/job/Solr-trunk/ws/trunk/solr/contrib/dataimporthandler/target/test-classes>
    [javac] Note: Some input files use unchecked or unsafe operations.
    [javac] Note: Recompile with -Xlint:unchecked for details.

testCore:
    [junit] Running org.apache.solr.handler.dataimport.TestCachedSqlEntityProcessor
    [junit] Tests run: 5, Failures: 0, Errors: 0, Time elapsed: 0.683 sec
    [junit] Running org.apache.solr.handler.dataimport.TestClobTransformer
    [junit] Tests run: 1, Failures: 0, Errors: 0, Time elapsed: 0.68 sec
    [junit] Running org.apache.solr.handler.dataimport.TestContentStreamDataSource
    [junit] Tests run: 1, Failures: 0, Errors: 0, Time elapsed: 4.127 sec
    [junit] Running org.apache.solr.handler.dataimport.TestDataConfig
    [junit] Tests run: 1, Failures: 0, Errors: 0, Time elapsed: 3.084 sec
    [junit] Running org.apache.solr.handler.dataimport.TestDateFormatTransformer
    [junit] Tests run: 2, Failures: 0, Errors: 0, Time elapsed: 0.667 sec
    [junit] Running org.apache.solr.handler.dataimport.TestDocBuilder
    [junit] Tests run: 6, Failures: 0, Errors: 0, Time elapsed: 0.873 sec
    [junit] Running org.apache.solr.handler.dataimport.TestDocBuilder2
    [junit]  xml response was: <?xml version="1.0" encoding="UTF-8"?>
    [junit] <response>
    [junit] <lst name="responseHeader"><int name="status">0</int><int
name="QTime">4</int><lst name="params"><str name="start">0</str><str
name="q">*:*</str><str name="qt">standard</str><str name="rows">20</str><str
name="version">2.2</str></lst></lst><result name="response" numFound="0"
start="0"/>
    [junit] </response>
    [junit] 
    [junit]  request was: start=0&q=*:*&qt=standard&rows=20&version=2.2)
    [junit] Tests run: 11, Failures: 1, Errors: 0, Time elapsed: 7.691 sec
    [junit] Test org.apache.solr.handler.dataimport.TestDocBuilder2 FAILED
    [junit] Running org.apache.solr.handler.dataimport.TestEntityProcessorBase
    [junit] Tests run: 1, Failures: 0, Errors: 0, Time elapsed: 0.683 sec
    [junit] Running org.apache.solr.handler.dataimport.TestErrorHandling
    [junit] Tests run: 4, Failures: 0, Errors: 0, Time elapsed: 4.864 sec
    [junit] Running org.apache.solr.handler.dataimport.TestEvaluatorBag
    [junit] Tests run: 5, Failures: 0, Errors: 0, Time elapsed: 0.722 sec
    [junit] Running org.apache.solr.handler.dataimport.TestFieldReader
    [junit] Tests run: 1, Failures: 0, Errors: 0, Time elapsed: 0.945 sec
    [junit] Running org.apache.solr.handler.dataimport.TestFileListEntityProcessor
    [junit] Tests run: 4, Failures: 0, Errors: 0, Time elapsed: 0.735 sec
    [junit] Running org.apache.solr.handler.dataimport.TestJdbcDataSource
    [junit] Tests run: 3, Failures: 0, Errors: 0, Time elapsed: 0.784 sec
    [junit] Running org.apache.solr.handler.dataimport.TestLineEntityProcessor
    [junit] Tests run: 4, Failures: 0, Errors: 0, Time elapsed: 0.707 sec
    [junit] Running org.apache.solr.handler.dataimport.TestNumberFormatTransformer
    [junit] Tests run: 9, Failures: 0, Errors: 0, Time elapsed: 0.773 sec
    [junit] Running org.apache.solr.handler.dataimport.TestPlainTextEntityProcessor
    [junit] Tests run: 1, Failures: 0, Errors: 0, Time elapsed: 0.903 sec
    [junit] Running org.apache.solr.handler.dataimport.TestRegexTransformer
    [junit] Tests run: 5, Failures: 0, Errors: 0, Time elapsed: 0.69 sec
    [junit] Running org.apache.solr.handler.dataimport.TestScriptTransformer
    [junit] Tests run: 0, Failures: 0, Errors: 0, Time elapsed: 0.559 sec
    [junit] Running org.apache.solr.handler.dataimport.TestSqlEntityProcessor
    [junit] Tests run: 4, Failures: 0, Errors: 0, Time elapsed: 0.705 sec
    [junit] Running org.apache.solr.handler.dataimport.TestSqlEntityProcessor2
    [junit] Tests run: 7, Failures: 0, Errors: 0, Time elapsed: 6.022 sec
    [junit] Running org.apache.solr.handler.dataimport.TestSqlEntityProcessorDelta
    [junit] Tests run: 7, Failures: 0, Errors: 0, Time elapsed: 6.515 sec
    [junit] Running org.apache.solr.handler.dataimport.TestSqlEntityProcessorDelta2
    [junit] Tests run: 7, Failures: 0, Errors: 0, Time elapsed: 6.392 sec
    [junit] Running org.apache.solr.handler.dataimport.TestTemplateString
    [junit] Tests run: 1, Failures: 0, Errors: 0, Time elapsed: 0.637 sec
    [junit] Running org.apache.solr.handler.dataimport.TestTemplateTransformer
    [junit] Tests run: 1, Failures: 0, Errors: 0, Time elapsed: 0.693 sec
    [junit] Running org.apache.solr.handler.dataimport.TestThreaded
    [junit] Tests run: 1, Failures: 0, Errors: 0, Time elapsed: 3.058 sec
    [junit] Running org.apache.solr.handler.dataimport.TestURLDataSource
    [junit] Tests run: 1, Failures: 0, Errors: 0, Time elapsed: 0.659 sec
    [junit] Running org.apache.solr.handler.dataimport.TestVariableResolver
    [junit] Tests run: 9, Failures: 0, Errors: 0, Time elapsed: 0.703 sec
    [junit] Running org.apache.solr.handler.dataimport.TestXPathEntityProcessor
    [junit] Tests run: 8, Failures: 0, Errors: 0, Time elapsed: 1.357 sec
    [junit] Running org.apache.solr.handler.dataimport.TestXPathRecordReader
    [junit] Tests run: 21, Failures: 0, Errors: 0, Time elapsed: 0.803 sec

BUILD FAILED
<https://hudson.apache.org/hudson/job/Solr-trunk/ws/trunk/solr/common-build.xml>:454:
The following error occurred while executing this line:
<https://hudson.apache.org/hudson/job/Solr-trunk/ws/trunk/solr/common-build.xml>:315:
The following error occurred while executing this line:
<https://hudson.apache.org/hudson/job/Solr-trunk/ws/trunk/solr/contrib/dataimporthandler/build.xml>:190:
Tests failed!

Total time: 22 minutes 21 seconds
[TASKS] Skipping publisher since build result is FAILURE
Publishing Javadoc
Archiving artifacts
Recording test results
Publishing Clover coverage report...
No Clover report will be published due to a Build Failure


---------------------------------------------------------------------
To unsubscribe, e-mail: dev-unsubscribe@lucene.apache.org
For additional commands, e-mail: dev-help@lucene.apache.org


Mime
View raw message