lucene-dev mailing list archives

Site index · List index
Message view « Date » · « Thread »
Top « Date » · « Thread »
From Apache Hudson Server <hud...@hudson.apache.org>
Subject Build failed in Hudson: Lucene-3.x #110
Date Wed, 08 Sep 2010 23:20:23 GMT
See <https://hudson.apache.org/hudson/job/Lucene-3.x/110/changes>

Changes:

[mikemccand] add new test for IndexOutput.copyBytes

[mikemccand] mergeprops

[mikemccand] LUCENE-2634: NRT reader's isCurrent should return false if changes were just
committed in the writer

[mikemccand] LUCENE-2635: fix BQ to not provide matching explanation if a required sub-clause
has null scorer

[mikemccand] add test verbosity

------------------------------------------
[...truncated 7514 lines...]
    [junit] 
    [junit] Testsuite: org.apache.lucene.search.TestSimilarity
    [junit] Tests run: 1, Failures: 0, Errors: 0, Time elapsed: 0.006 sec
    [junit] 
    [junit] Testsuite: org.apache.lucene.search.TestSimpleExplanations
    [junit] Tests run: 53, Failures: 0, Errors: 0, Time elapsed: 2.066 sec
    [junit] 
    [junit] Testsuite: org.apache.lucene.search.TestSimpleExplanationsOfNonMatches
    [junit] Tests run: 53, Failures: 0, Errors: 0, Time elapsed: 0.13 sec
    [junit] 
    [junit] Testsuite: org.apache.lucene.search.TestSloppyPhraseQuery
    [junit] Tests run: 5, Failures: 0, Errors: 0, Time elapsed: 0.195 sec
    [junit] 
    [junit] Testsuite: org.apache.lucene.search.TestSort
    [junit] Tests run: 22, Failures: 0, Errors: 0, Time elapsed: 1.335 sec
    [junit] 
    [junit] Testsuite: org.apache.lucene.search.TestSpanQueryFilter
    [junit] Tests run: 1, Failures: 0, Errors: 0, Time elapsed: 0.013 sec
    [junit] 
    [junit] Testsuite: org.apache.lucene.search.TestTermRangeFilter
    [junit] Tests run: 7, Failures: 0, Errors: 0, Time elapsed: 3.1 sec
    [junit] 
    [junit] Testsuite: org.apache.lucene.search.TestTermRangeQuery
    [junit] Tests run: 9, Failures: 0, Errors: 0, Time elapsed: 0.028 sec
    [junit] 
    [junit] Testsuite: org.apache.lucene.search.TestTermScorer
    [junit] Tests run: 3, Failures: 0, Errors: 0, Time elapsed: 0.011 sec
    [junit] 
    [junit] Testsuite: org.apache.lucene.search.TestTermVectors
    [junit] Tests run: 8, Failures: 0, Errors: 0, Time elapsed: 0.146 sec
    [junit] 
    [junit] Testsuite: org.apache.lucene.search.TestThreadSafe
    [junit] Tests run: 1, Failures: 0, Errors: 0, Time elapsed: 1.968 sec
    [junit] 
    [junit] Testsuite: org.apache.lucene.search.TestTimeLimitingCollector
    [junit] Tests run: 6, Failures: 0, Errors: 0, Time elapsed: 1.021 sec
    [junit] 
    [junit] Testsuite: org.apache.lucene.search.TestTopDocsCollector
    [junit] Tests run: 8, Failures: 0, Errors: 0, Time elapsed: 0.013 sec
    [junit] 
    [junit] Testsuite: org.apache.lucene.search.TestTopScoreDocCollector
    [junit] Tests run: 1, Failures: 0, Errors: 0, Time elapsed: 0.004 sec
    [junit] 
    [junit] Testsuite: org.apache.lucene.search.TestWildcard
    [junit] Tests run: 7, Failures: 0, Errors: 0, Time elapsed: 0.022 sec
    [junit] 
    [junit] Testsuite: org.apache.lucene.search.function.TestCustomScoreQuery
    [junit] Tests run: 4, Failures: 0, Errors: 0, Time elapsed: 6.559 sec
    [junit] 
    [junit] Testsuite: org.apache.lucene.search.function.TestDocValues
    [junit] Tests run: 3, Failures: 0, Errors: 0, Time elapsed: 0.004 sec
    [junit] 
    [junit] Testsuite: org.apache.lucene.search.function.TestFieldScoreQuery
    [junit] Tests run: 12, Failures: 0, Errors: 0, Time elapsed: 0.167 sec
    [junit] 
    [junit] Testsuite: org.apache.lucene.search.function.TestOrdValues
    [junit] Tests run: 5, Failures: 0, Errors: 0, Time elapsed: 0.063 sec
    [junit] 
    [junit] Testsuite: org.apache.lucene.search.payloads.TestPayloadNearQuery
    [junit] Tests run: 4, Failures: 0, Errors: 0, Time elapsed: 0.275 sec
    [junit] 
    [junit] Testsuite: org.apache.lucene.search.payloads.TestPayloadTermQuery
    [junit] Tests run: 6, Failures: 0, Errors: 0, Time elapsed: 0.537 sec
    [junit] 
    [junit] Testsuite: org.apache.lucene.search.spans.TestBasics
    [junit] Tests run: 20, Failures: 0, Errors: 0, Time elapsed: 5.942 sec
    [junit] 
    [junit] Testsuite: org.apache.lucene.search.spans.TestFieldMaskingSpanQuery
    [junit] Tests run: 11, Failures: 0, Errors: 0, Time elapsed: 0.446 sec
    [junit] 
    [junit] Testsuite: org.apache.lucene.search.spans.TestNearSpansOrdered
    [junit] Tests run: 10, Failures: 0, Errors: 0, Time elapsed: 0.04 sec
    [junit] 
    [junit] Testsuite: org.apache.lucene.search.spans.TestPayloadSpans
    [junit] Tests run: 10, Failures: 0, Errors: 0, Time elapsed: 0.742 sec
    [junit] 
    [junit] ------------- Standard Output ---------------
    [junit] 
    [junit] Spans Dump --
    [junit] payloads for span:2
    [junit] doc:0 s:3 e:6 three:Noise:5
    [junit] doc:0 s:3 e:6 one:Entity:3
    [junit] 
    [junit] Spans Dump --
    [junit] payloads for span:3
    [junit] doc:0 s:0 e:3 xx:Entity:0
    [junit] doc:0 s:0 e:3 rr:Noise:1
    [junit] doc:0 s:0 e:3 yy:Noise:2
    [junit] 
    [junit] Spans Dump --
    [junit] payloads for span:3
    [junit] doc:1 s:0 e:4 rr:Noise:3
    [junit] doc:1 s:0 e:4 yy:Noise:1
    [junit] doc:1 s:0 e:4 xx:Entity:0
    [junit] 
    [junit] Spans Dump --
    [junit] payloads for span:3
    [junit] doc:0 s:0 e:3 xx:Entity:0
    [junit] doc:0 s:0 e:3 rr:Noise:1
    [junit] doc:0 s:0 e:3 yy:Noise:2
    [junit] 
    [junit] Spans Dump --
    [junit] payloads for span:3
    [junit] doc:0 s:0 e:3 rr:Noise:1
    [junit] doc:0 s:0 e:3 yy:Noise:2
    [junit] doc:0 s:0 e:3 xx:Entity:0
    [junit] 
    [junit] Spans Dump --
    [junit] payloads for span:3
    [junit] doc:1 s:0 e:4 rr:Noise:3
    [junit] doc:1 s:0 e:4 xx:Entity:0
    [junit] doc:1 s:0 e:4 yy:Noise:1
    [junit] 
    [junit] Spans Dump --
    [junit] payloads for span:3
    [junit] doc:2 s:0 e:5 ss:Noise:2
    [junit] doc:2 s:0 e:5 qq:Noise:1
    [junit] doc:2 s:0 e:5 pp:Noise:3
    [junit] 
    [junit] Spans Dump --
    [junit] payloads for span:8
    [junit] doc:3 s:0 e:11 two:Noise:1
    [junit] doc:3 s:0 e:11 three:Noise:2
    [junit] doc:3 s:0 e:11 one:Entity:0
    [junit] doc:3 s:0 e:11 six:Noise:5
    [junit] doc:3 s:0 e:11 nine:Noise:8
    [junit] doc:3 s:0 e:11 eleven:Noise:10
    [junit] doc:3 s:0 e:11 ten:Noise:9
    [junit] doc:3 s:0 e:11 five:Noise:4
    [junit] 
    [junit] Spans Dump --
    [junit] payloads for span:8
    [junit] doc:4 s:0 e:11 five:Noise:5
    [junit] doc:4 s:0 e:11 one:Entity:1
    [junit] doc:4 s:0 e:11 eleven:Noise:9
    [junit] doc:4 s:0 e:11 nine:Noise:0
    [junit] doc:4 s:0 e:11 two:Noise:2
    [junit] doc:4 s:0 e:11 six:Noise:6
    [junit] doc:4 s:0 e:11 ten:Noise:10
    [junit] doc:4 s:0 e:11 three:Noise:3
    [junit] match:a:Noise:10
    [junit] match:k:Noise:11
    [junit] Num payloads:1
    [junit] rr:Noise:1
    [junit] ------------- ---------------- ---------------
    [junit] Testsuite: org.apache.lucene.search.spans.TestSpanExplanations
    [junit] Tests run: 31, Failures: 0, Errors: 0, Time elapsed: 0.908 sec
    [junit] 
    [junit] Testsuite: org.apache.lucene.search.spans.TestSpanExplanationsOfNonMatches
    [junit] Tests run: 31, Failures: 0, Errors: 0, Time elapsed: 0.086 sec
    [junit] 
    [junit] Testsuite: org.apache.lucene.search.spans.TestSpans
    [junit] Tests run: 25, Failures: 0, Errors: 0, Time elapsed: 0.365 sec
    [junit] 
    [junit] Testsuite: org.apache.lucene.search.spans.TestSpansAdvanced
    [junit] Tests run: 1, Failures: 0, Errors: 0, Time elapsed: 0.038 sec
    [junit] 
    [junit] Testsuite: org.apache.lucene.search.spans.TestSpansAdvanced2
    [junit] Tests run: 4, Failures: 0, Errors: 0, Time elapsed: 0.096 sec
    [junit] 
    [junit] Testsuite: org.apache.lucene.store.TestBufferedIndexInput
    [junit] Tests run: 4, Failures: 0, Errors: 0, Time elapsed: 3.018 sec
    [junit] 
    [junit] Testsuite: org.apache.lucene.store.TestDirectory
    [junit] Tests run: 7, Failures: 0, Errors: 0, Time elapsed: 0.018 sec
    [junit] 
    [junit] Testsuite: org.apache.lucene.store.TestFileSwitchDirectory
    [junit] Tests run: 1, Failures: 0, Errors: 0, Time elapsed: 0.01 sec
    [junit] 
    [junit] Testsuite: org.apache.lucene.store.TestHugeRamFile
    [junit] Tests run: 1, Failures: 0, Errors: 0, Time elapsed: 3.586 sec
    [junit] 
    [junit] Testsuite: org.apache.lucene.store.TestLock
    [junit] Tests run: 1, Failures: 0, Errors: 0, Time elapsed: 0.014 sec
    [junit] 
    [junit] Testsuite: org.apache.lucene.store.TestLockFactory
    [junit] Tests run: 9, Failures: 0, Errors: 0, Time elapsed: 3.056 sec
    [junit] 
    [junit] Testsuite: org.apache.lucene.store.TestRAMDirectory
    [junit] Tests run: 4, Failures: 0, Errors: 0, Time elapsed: 0.18 sec
    [junit] 
    [junit] Testsuite: org.apache.lucene.store.TestWindowsMMap
    [junit] Tests run: 1, Failures: 0, Errors: 0, Time elapsed: 0.036 sec
    [junit] 
    [junit] Testsuite: org.apache.lucene.util.ArrayUtilTest
    [junit] Tests run: 1, Failures: 0, Errors: 0, Time elapsed: 0.003 sec
    [junit] 
    [junit] Testsuite: org.apache.lucene.util.TestAttributeSource
    [junit] Tests run: 5, Failures: 0, Errors: 0, Time elapsed: 0.006 sec
    [junit] 
    [junit] Testsuite: org.apache.lucene.util.TestBitVector
    [junit] Tests run: 7, Failures: 0, Errors: 0, Time elapsed: 1.597 sec
    [junit] 
    [junit] Testsuite: org.apache.lucene.util.TestCloseableThreadLocal
    [junit] Tests run: 3, Failures: 0, Errors: 0, Time elapsed: 0.005 sec
    [junit] 
    [junit] Testsuite: org.apache.lucene.util.TestFieldCacheSanityChecker
    [junit] Tests run: 4, Failures: 0, Errors: 0, Time elapsed: 0.312 sec
    [junit] 
    [junit] Testsuite: org.apache.lucene.util.TestIndexableBinaryStringTools
    [junit] Tests run: 5, Failures: 0, Errors: 0, Time elapsed: 0.883 sec
    [junit] 
    [junit] Testsuite: org.apache.lucene.util.TestNumericUtils
    [junit] Tests run: 8, Failures: 0, Errors: 0, Time elapsed: 0.215 sec
    [junit] 
    [junit] Testsuite: org.apache.lucene.util.TestOpenBitSet
    [junit] Tests run: 4, Failures: 0, Errors: 0, Time elapsed: 1.309 sec
    [junit] 
    [junit] Testsuite: org.apache.lucene.util.TestPriorityQueue
    [junit] Tests run: 4, Failures: 0, Errors: 0, Time elapsed: 0.023 sec
    [junit] 
    [junit] Testsuite: org.apache.lucene.util.TestRamUsageEstimator
    [junit] Tests run: 1, Failures: 0, Errors: 0, Time elapsed: 0.005 sec
    [junit] 
    [junit] ------------- Standard Output ---------------
    [junit] size:56
    [junit] size:60
    [junit] size:48
    [junit] size:202
    [junit] ------------- ---------------- ---------------
    [junit] Testsuite: org.apache.lucene.util.TestSmallFloat
    [junit] Tests run: 2, Failures: 0, Errors: 0, Time elapsed: 0.114 sec
    [junit] 
    [junit] Testsuite: org.apache.lucene.util.TestSortedVIntList
    [junit] Tests run: 18, Failures: 0, Errors: 0, Time elapsed: 0.013 sec
    [junit] 
    [junit] Testsuite: org.apache.lucene.util.TestStringHelper
    [junit] Tests run: 1, Failures: 0, Errors: 0, Time elapsed: 0.003 sec
    [junit] 
    [junit] Testsuite: org.apache.lucene.util.TestStringIntern
    [junit] Tests run: 1, Failures: 0, Errors: 0, Time elapsed: 6.616 sec
    [junit] 
    [junit] Testsuite: org.apache.lucene.util.TestVersion
    [junit] Tests run: 1, Failures: 0, Errors: 0, Time elapsed: 0.004 sec
    [junit] 
    [junit] Tests FAILED

BUILD FAILED
<https://hudson.apache.org/hudson/job/Lucene-3.x/ws/branch_3x/build.xml>:131: The following
error occurred while executing this line:
<https://hudson.apache.org/hudson/job/Lucene-3.x/ws/branch_3x/build.xml>:126: The following
error occurred while executing this line:
<https://hudson.apache.org/hudson/job/Lucene-3.x/ws/branch_3x/common-build.xml>:484:
Tests failed!

Total time: 15 minutes 0 seconds
[TASKS] Skipping publisher since build result is FAILURE
Publishing Javadoc
Archiving artifacts
Recording test results
Publishing Clover coverage report...
No Clover report will be published due to a Build Failure


---------------------------------------------------------------------
To unsubscribe, e-mail: dev-unsubscribe@lucene.apache.org
For additional commands, e-mail: dev-help@lucene.apache.org


Mime
View raw message