lucene-dev mailing list archives

Site index · List index
Message view « Date » · « Thread »
Top « Date » · « Thread »
From Apache Hudson Server <hud...@hudson.apache.org>
Subject Build failed in Hudson: Solr-3.x #111
Date Thu, 23 Sep 2010 05:32:11 GMT
See <https://hudson.apache.org/hudson/job/Solr-3.x/111/changes>

Changes:

[shaie] FileBasedQueryMaker (benchmark) would add a null Query to the list, if the query failed
to parse

[yonik] solr example: sync up schema w/ trunk

[koji] fix typo in build.xml

[mikemccand] LUCENE-2658: fix case where exception on docs w/ more than field w/ tvs could
mess up the ByteBlockPool

[mikemccand] prevent false failure from running out of file descriptors

[mikemccand] prevent false failure from running out of file descriptors

[gsingers] SOLR-1568: solr spatial: use the radius passed (including units) instead of hard-coding
to miles

------------------------------------------
[...truncated 6701 lines...]
    [junit] 	... 1 more
    [junit] 2010-sep-23 13:31:58 org.apache.solr.handler.dataimport.DocBuilder buildDocument
    [junit] ALLVARLIG: Exception while processing: node document : SolrInputDocument[{}]
    [junit] org.apache.solr.handler.dataimport.DataImportHandlerException: Parsing failed
for xml, url:test rows processed:2 last row: {$forEach=/root/node, id=2, desc=[test2]} Processing
Document # 1
    [junit] 	at org.apache.solr.handler.dataimport.DataImportHandlerException.wrapAndThrow(DataImportHandlerException.java:72)
    [junit] 	at org.apache.solr.handler.dataimport.XPathEntityProcessor.initQuery(XPathEntityProcessor.java:305)
    [junit] 	at org.apache.solr.handler.dataimport.XPathEntityProcessor.fetchNextRow(XPathEntityProcessor.java:201)
    [junit] 	at org.apache.solr.handler.dataimport.XPathEntityProcessor.nextRow(XPathEntityProcessor.java:181)
    [junit] 	at org.apache.solr.handler.dataimport.EntityProcessorWrapper.nextRow(EntityProcessorWrapper.java:233)
    [junit] 	at org.apache.solr.handler.dataimport.DocBuilder.buildDocument(DocBuilder.java:579)
    [junit] 	at org.apache.solr.handler.dataimport.DocBuilder.doFullDump(DocBuilder.java:260)
    [junit] 	at org.apache.solr.handler.dataimport.DocBuilder.execute(DocBuilder.java:184)
    [junit] 	at org.apache.solr.handler.dataimport.DataImporter.doFullImport(DataImporter.java:334)
    [junit] 	at org.apache.solr.handler.dataimport.DataImporter.runCmd(DataImporter.java:392)
    [junit] 	at org.apache.solr.handler.dataimport.DataImportHandler.handleRequestBody(DataImportHandler.java:203)
    [junit] 	at org.apache.solr.handler.RequestHandlerBase.handleRequest(RequestHandlerBase.java:131)
    [junit] 	at org.apache.solr.core.SolrCore.execute(SolrCore.java:1322)
    [junit] 	at org.apache.solr.util.TestHarness.queryAndResponse(TestHarness.java:334)
    [junit] 	at org.apache.solr.util.TestHarness.query(TestHarness.java:321)
    [junit] 	at org.apache.solr.handler.dataimport.AbstractDataImportHandlerTestCase.runFullImport(AbstractDataImportHandlerTestCase.java:76)
    [junit] 	at org.apache.solr.handler.dataimport.TestErrorHandling.testAbortOnError(TestErrorHandling.java:50)
    [junit] 	at sun.reflect.NativeMethodAccessorImpl.invoke0(Native Method)
    [junit] 	at sun.reflect.NativeMethodAccessorImpl.invoke(NativeMethodAccessorImpl.java:39)
    [junit] 	at sun.reflect.DelegatingMethodAccessorImpl.invoke(DelegatingMethodAccessorImpl.java:25)
    [junit] 	at java.lang.reflect.Method.invoke(Method.java:592)
    [junit] 	at org.junit.runners.model.FrameworkMethod$1.runReflectiveCall(FrameworkMethod.java:44)
    [junit] 	at org.junit.internal.runners.model.ReflectiveCallable.run(ReflectiveCallable.java:15)
    [junit] 	at org.junit.runners.model.FrameworkMethod.invokeExplosively(FrameworkMethod.java:41)
    [junit] 	at org.junit.internal.runners.statements.InvokeMethod.evaluate(InvokeMethod.java:20)
    [junit] 	at org.junit.rules.TestWatchman$1.evaluate(TestWatchman.java:48)
    [junit] 	at org.junit.internal.runners.statements.RunBefores.evaluate(RunBefores.java:28)
    [junit] 	at org.junit.internal.runners.statements.RunAfters.evaluate(RunAfters.java:31)
    [junit] 	at org.junit.runners.BlockJUnit4ClassRunner.runChild(BlockJUnit4ClassRunner.java:76)
    [junit] 	at org.apache.lucene.util.LuceneTestCase$LuceneTestCaseRunner.runChild(LuceneTestCase.java:704)
    [junit] 	at org.apache.lucene.util.LuceneTestCase$LuceneTestCaseRunner.runChild(LuceneTestCase.java:677)
    [junit] 	at org.junit.runners.ParentRunner$3.run(ParentRunner.java:193)
    [junit] 	at org.junit.runners.ParentRunner$1.schedule(ParentRunner.java:52)
    [junit] 	at org.junit.runners.ParentRunner.runChildren(ParentRunner.java:191)
    [junit] 	at org.junit.runners.ParentRunner.access$000(ParentRunner.java:42)
    [junit] 	at org.junit.runners.ParentRunner$2.evaluate(ParentRunner.java:184)
    [junit] 	at org.junit.internal.runners.statements.RunBefores.evaluate(RunBefores.java:28)
    [junit] 	at org.junit.internal.runners.statements.RunAfters.evaluate(RunAfters.java:31)
    [junit] 	at org.junit.runners.ParentRunner.run(ParentRunner.java:236)
    [junit] 	at junit.framework.JUnit4TestAdapter.run(JUnit4TestAdapter.java:39)
    [junit] 	at org.apache.tools.ant.taskdefs.optional.junit.JUnitTestRunner.run(JUnitTestRunner.java:421)
    [junit] 	at org.apache.tools.ant.taskdefs.optional.junit.JUnitTestRunner.launch(JUnitTestRunner.java:912)
    [junit] 	at org.apache.tools.ant.taskdefs.optional.junit.JUnitTestRunner.main(JUnitTestRunner.java:743)
    [junit] Caused by: java.lang.RuntimeException: com.ctc.wstx.exc.WstxParsingException:
Unexpected close tag </id>; expected </node>.
    [junit]  at [row,col {unknown-source}]: [11,18]
    [junit] 	at org.apache.solr.handler.dataimport.XPathRecordReader.streamRecords(XPathRecordReader.java:181)
    [junit] 	at org.apache.solr.handler.dataimport.XPathEntityProcessor.initQuery(XPathEntityProcessor.java:295)
    [junit] 	... 41 more
    [junit] Caused by: com.ctc.wstx.exc.WstxParsingException: Unexpected close tag </id>;
expected </node>.
    [junit]  at [row,col {unknown-source}]: [11,18]
    [junit] 	at com.ctc.wstx.sr.StreamScanner.constructWfcException(StreamScanner.java:630)
    [junit] 	at com.ctc.wstx.sr.StreamScanner.throwParseError(StreamScanner.java:461)
    [junit] 	at com.ctc.wstx.sr.BasicStreamReader.reportWrongEndElem(BasicStreamReader.java:3258)
    [junit] 	at com.ctc.wstx.sr.BasicStreamReader.readEndElem(BasicStreamReader.java:3200)
    [junit] 	at com.ctc.wstx.sr.BasicStreamReader.nextFromTree(BasicStreamReader.java:2832)
    [junit] 	at com.ctc.wstx.sr.BasicStreamReader.next(BasicStreamReader.java:1019)
    [junit] 	at org.apache.solr.handler.dataimport.XPathRecordReader$Node.parse(XPathRecordReader.java:275)
    [junit] 	at org.apache.solr.handler.dataimport.XPathRecordReader$Node.handleStartElement(XPathRecordReader.java:340)
    [junit] 	at org.apache.solr.handler.dataimport.XPathRecordReader$Node.parse(XPathRecordReader.java:304)
    [junit] 	at org.apache.solr.handler.dataimport.XPathRecordReader$Node.handleStartElement(XPathRecordReader.java:340)
    [junit] 	at org.apache.solr.handler.dataimport.XPathRecordReader$Node.parse(XPathRecordReader.java:304)
    [junit] 	at org.apache.solr.handler.dataimport.XPathRecordReader$Node.access$200(XPathRecordReader.java:196)
    [junit] 	at org.apache.solr.handler.dataimport.XPathRecordReader.streamRecords(XPathRecordReader.java:178)
    [junit] 	... 42 more
    [junit] 2010-sep-23 13:31:58 org.apache.solr.handler.dataimport.DataImporter doFullImport
    [junit] ALLVARLIG: Full Import failed
    [junit] org.apache.solr.handler.dataimport.DataImportHandlerException: Parsing failed
for xml, url:test rows processed:2 last row: {$forEach=/root/node, id=2, desc=[test2]} Processing
Document # 1
    [junit] 	at org.apache.solr.handler.dataimport.DataImportHandlerException.wrapAndThrow(DataImportHandlerException.java:72)
    [junit] 	at org.apache.solr.handler.dataimport.XPathEntityProcessor.initQuery(XPathEntityProcessor.java:305)
    [junit] 	at org.apache.solr.handler.dataimport.XPathEntityProcessor.fetchNextRow(XPathEntityProcessor.java:201)
    [junit] 	at org.apache.solr.handler.dataimport.XPathEntityProcessor.nextRow(XPathEntityProcessor.java:181)
    [junit] 	at org.apache.solr.handler.dataimport.EntityProcessorWrapper.nextRow(EntityProcessorWrapper.java:233)
    [junit] 	at org.apache.solr.handler.dataimport.DocBuilder.buildDocument(DocBuilder.java:579)
    [junit] 	at org.apache.solr.handler.dataimport.DocBuilder.doFullDump(DocBuilder.java:260)
    [junit] 	at org.apache.solr.handler.dataimport.DocBuilder.execute(DocBuilder.java:184)
    [junit] 	at org.apache.solr.handler.dataimport.DataImporter.doFullImport(DataImporter.java:334)
    [junit] 	at org.apache.solr.handler.dataimport.DataImporter.runCmd(DataImporter.java:392)
    [junit] 	at org.apache.solr.handler.dataimport.DataImportHandler.handleRequestBody(DataImportHandler.java:203)
    [junit] 	at org.apache.solr.handler.RequestHandlerBase.handleRequest(RequestHandlerBase.java:131)
    [junit] 	at org.apache.solr.core.SolrCore.execute(SolrCore.java:1322)
    [junit] 	at org.apache.solr.util.TestHarness.queryAndResponse(TestHarness.java:334)
    [junit] 	at org.apache.solr.util.TestHarness.query(TestHarness.java:321)
    [junit] 	at org.apache.solr.handler.dataimport.AbstractDataImportHandlerTestCase.runFullImport(AbstractDataImportHandlerTestCase.java:76)
    [junit] 	at org.apache.solr.handler.dataimport.TestErrorHandling.testAbortOnError(TestErrorHandling.java:50)
    [junit] 	at sun.reflect.NativeMethodAccessorImpl.invoke0(Native Method)
    [junit] 	at sun.reflect.NativeMethodAccessorImpl.invoke(NativeMethodAccessorImpl.java:39)
    [junit] 	at sun.reflect.DelegatingMethodAccessorImpl.invoke(DelegatingMethodAccessorImpl.java:25)
    [junit] 	at java.lang.reflect.Method.invoke(Method.java:592)
    [junit] 	at org.junit.runners.model.FrameworkMethod$1.runReflectiveCall(FrameworkMethod.java:44)
    [junit] 	at org.junit.internal.runners.model.ReflectiveCallable.run(ReflectiveCallable.java:15)
    [junit] 	at org.junit.runners.model.FrameworkMethod.invokeExplosively(FrameworkMethod.java:41)
    [junit] 	at org.junit.internal.runners.statements.InvokeMethod.evaluate(InvokeMethod.java:20)
    [junit] 	at org.junit.rules.TestWatchman$1.evaluate(TestWatchman.java:48)
    [junit] 	at org.junit.internal.runners.statements.RunBefores.evaluate(RunBefores.java:28)
    [junit] 	at org.junit.internal.runners.statements.RunAfters.evaluate(RunAfters.java:31)
    [junit] 	at org.junit.runners.BlockJUnit4ClassRunner.runChild(BlockJUnit4ClassRunner.java:76)
    [junit] 	at org.apache.lucene.util.LuceneTestCase$LuceneTestCaseRunner.runChild(LuceneTestCase.java:704)
    [junit] 	at org.apache.lucene.util.LuceneTestCase$LuceneTestCaseRunner.runChild(LuceneTestCase.java:677)
    [junit] 	at org.junit.runners.ParentRunner$3.run(ParentRunner.java:193)
    [junit] 	at org.junit.runners.ParentRunner$1.schedule(ParentRunner.java:52)
    [junit] 	at org.junit.runners.ParentRunner.runChildren(ParentRunner.java:191)
    [junit] 	at org.junit.runners.ParentRunner.access$000(ParentRunner.java:42)
    [junit] 	at org.junit.runners.ParentRunner$2.evaluate(ParentRunner.java:184)
    [junit] 	at org.junit.internal.runners.statements.RunBefores.evaluate(RunBefores.java:28)
    [junit] 	at org.junit.internal.runners.statements.RunAfters.evaluate(RunAfters.java:31)
    [junit] 	at org.junit.runners.ParentRunner.run(ParentRunner.java:236)
    [junit] 	at junit.framework.JUnit4TestAdapter.run(JUnit4TestAdapter.java:39)
    [junit] 	at org.apache.tools.ant.taskdefs.optional.junit.JUnitTestRunner.run(JUnitTestRunner.java:421)
    [junit] 	at org.apache.tools.ant.taskdefs.optional.junit.JUnitTestRunner.launch(JUnitTestRunner.java:912)
    [junit] 	at org.apache.tools.ant.taskdefs.optional.junit.JUnitTestRunner.main(JUnitTestRunner.java:743)
    [junit] Caused by: java.lang.RuntimeException: com.ctc.wstx.exc.WstxParsingException:
Unexpected close tag </id>; expected </node>.
    [junit]  at [row,col {unknown-source}]: [11,18]
    [junit] 	at org.apache.solr.handler.dataimport.XPathRecordReader.streamRecords(XPathRecordReader.java:181)
    [junit] 	at org.apache.solr.handler.dataimport.XPathEntityProcessor.initQuery(XPathEntityProcessor.java:295)
    [junit] 	... 41 more
    [junit] Caused by: com.ctc.wstx.exc.WstxParsingException: Unexpected close tag </id>;
expected </node>.
    [junit]  at [row,col {unknown-source}]: [11,18]
    [junit] 	at com.ctc.wstx.sr.StreamScanner.constructWfcException(StreamScanner.java:630)
    [junit] 	at com.ctc.wstx.sr.StreamScanner.throwParseError(StreamScanner.java:461)
    [junit] 	at com.ctc.wstx.sr.BasicStreamReader.reportWrongEndElem(BasicStreamReader.java:3258)
    [junit] 	at com.ctc.wstx.sr.BasicStreamReader.readEndElem(BasicStreamReader.java:3200)
    [junit] 	at com.ctc.wstx.sr.BasicStreamReader.nextFromTree(BasicStreamReader.java:2832)
    [junit] 	at com.ctc.wstx.sr.BasicStreamReader.next(BasicStreamReader.java:1019)
    [junit] 	at org.apache.solr.handler.dataimport.XPathRecordReader$Node.parse(XPathRecordReader.java:275)
    [junit] 	at org.apache.solr.handler.dataimport.XPathRecordReader$Node.handleStartElement(XPathRecordReader.java:340)
    [junit] 	at org.apache.solr.handler.dataimport.XPathRecordReader$Node.parse(XPathRecordReader.java:304)
    [junit] 	at org.apache.solr.handler.dataimport.XPathRecordReader$Node.handleStartElement(XPathRecordReader.java:340)
    [junit] 	at org.apache.solr.handler.dataimport.XPathRecordReader$Node.parse(XPathRecordReader.java:304)
    [junit] 	at org.apache.solr.handler.dataimport.XPathRecordReader$Node.access$200(XPathRecordReader.java:196)
    [junit] 	at org.apache.solr.handler.dataimport.XPathRecordReader.streamRecords(XPathRecordReader.java:178)
    [junit] 	... 42 more
    [junit] ------------- ---------------- ---------------
    [junit] Testsuite: org.apache.solr.handler.dataimport.TestEvaluatorBag
    [junit] Testcase: testGetDateFormatEvaluator(org.apache.solr.handler.dataimport.TestEvaluatorBag):
Caused an ERROR
    [junit] expected:<2010-09-21 [10]:31> but was:<2010-09-21 [09]:31>
    [junit] 	at org.apache.solr.handler.dataimport.TestEvaluatorBag.testGetDateFormatEvaluator(TestEvaluatorBag.java:131)
    [junit] 	at org.apache.lucene.util.LuceneTestCase$LuceneTestCaseRunner.runChild(LuceneTestCase.java:704)
    [junit] 	at org.apache.lucene.util.LuceneTestCase$LuceneTestCaseRunner.runChild(LuceneTestCase.java:677)
    [junit] 
    [junit] 
    [junit] Tests run: 5, Failures: 0, Errors: 1, Time elapsed: 0.039 sec
    [junit] 
    [junit] ------------- Standard Output ---------------
    [junit] NOTE: random locale of testcase 'testGetDateFormatEvaluator' was: fr_BE
    [junit] NOTE: random timezone of testcase 'testGetDateFormatEvaluator' was: PLT
    [junit] ------------- ---------------- ---------------
    [junit] TEST org.apache.solr.handler.dataimport.TestEvaluatorBag FAILED
    [junit] Testsuite: org.apache.solr.handler.dataimport.TestFieldReader
    [junit] Tests run: 1, Failures: 0, Errors: 0, Time elapsed: 0.019 sec
    [junit] 
    [junit] Testsuite: org.apache.solr.handler.dataimport.TestFileListEntityProcessor
    [junit] Tests run: 4, Failures: 0, Errors: 0, Time elapsed: 0.019 sec
    [junit] 
    [junit] Testsuite: org.apache.solr.handler.dataimport.TestJdbcDataSource
    [junit] Tests run: 3, Failures: 0, Errors: 0, Time elapsed: 0.079 sec
    [junit] 
    [junit] Testsuite: org.apache.solr.handler.dataimport.TestLineEntityProcessor
    [junit] Tests run: 4, Failures: 0, Errors: 0, Time elapsed: 0.016 sec
    [junit] 
    [junit] ------------- Standard Output ---------------
    [junit] 
    [junit]      rawLine=''
    [junit]      rawLine='# this is what the output from 'find . -ls; looks like, athough
the format'
    [junit]      rawLine='# of the time stamp varies depending on the age of the file and
your LANG '
    [junit]      rawLine='# env setting'
    [junit]      rawLine='412577   0 drwxr-xr-x  6 user group    204 1 Apr 10:53 /Volumes/spare/ts'
    [junit]      rawLine='412582   0 drwxr-xr-x 13 user group    442 1 Apr 10:18 /Volumes/spare/ts/config'
    [junit]      rawLine='412583  24 -rwxr-xr-x  1 user group   8318 1 Apr 11:10 /Volumes/spare/ts/config/dc.xsd'
    [junit]      rawLine='412584  32 -rwxr-xr-x  1 user group  12847 1 Apr 11:10 /Volumes/spare/ts/config/dcterms.xsd'
    [junit]      rawLine='412585   8 -rwxr-xr-x  1 user group   3156 1 Apr 11:10 /Volumes/spare/ts/config/s-deliver.css'
    [junit]      rawLine='412586 192 -rwxr-xr-x  1 user group  97764 1 Apr 11:10 /Volumes/spare/ts/config/s-deliver.xsl'
    [junit]      rawLine='412587 224 -rwxr-xr-x  1 user group 112700 1 Apr 11:10 /Volumes/spare/ts/config/sml-delivery-2.1.xsd'
    [junit]      rawLine='412588 208 -rwxr-xr-x  1 user group 103419 1 Apr 11:10 /Volumes/spare/ts/config/sml-delivery-norm-2.0.dtd'
    [junit]      rawLine='412589 248 -rwxr-xr-x  1 user group 125296 1 Apr 11:10 /Volumes/spare/ts/config/sml-delivery-norm-2.1.dtd'
    [junit]      rawLine='412590  72 -rwxr-xr-x  1 user group  36256 1 Apr 11:10 /Volumes/spare/ts/config/jm.xsd'
    [junit]      rawLine='412591   8 -rwxr-xr-x  1 user group    990 1 Apr 11:10 /Volumes/spare/ts/config/video.gif'
    [junit]      rawLine='412592   8 -rwxr-xr-x  1 user group   1498 1 Apr 11:10 /Volumes/spare/ts/config/xlink.xsd'
    [junit]      rawLine='412593   8 -rwxr-xr-x  1 user group   1155 1 Apr 11:10 /Volumes/spare/ts/config/xml.xsd'
    [junit]      rawLine='412594   0 drwxr-xr-x  4 user group    136 1 Apr 10:18 /Volumes/spare/ts/acm19'
    [junit]      rawLine='412621   0 drwxr-xr-x 57 user group   1938 1 Apr 10:18 /Volumes/spare/ts/acm19/data'
    [junit]      rawLine='412622  24 -rwxr-xr-x  1 user group   8894 1 Apr 11:09 /Volumes/spare/ts/acm19/data/00000510.xml'
    [junit]      rawLine='412623  32 -rwxr-xr-x  1 user group  14124 1 Apr 11:09 /Volumes/spare/ts/acm19/data/00000603.xml'
    [junit]      rawLine='412624  24 -rwxr-xr-x  1 user group  11976 1 Apr 11:09 /Volumes/spare/ts/acm19/data/00001292.xml'
    [junit]      rawLine='# tacked on an extra line to cause a file to be deleted.'
    [junit]      rawLine='DELETE /Volumes/spare/ts/acm19/data/00001292old.xml'
    [junit] ------------- ---------------- ---------------
    [junit] Testsuite: org.apache.solr.handler.dataimport.TestNumberFormatTransformer
    [junit] Tests run: 9, Failures: 0, Errors: 0, Time elapsed: 0.022 sec
    [junit] 
    [junit] Testsuite: org.apache.solr.handler.dataimport.TestPlainTextEntityProcessor
    [junit] Tests run: 1, Failures: 0, Errors: 0, Time elapsed: 0.019 sec
    [junit] 
    [junit] Testsuite: org.apache.solr.handler.dataimport.TestRegexTransformer
    [junit] Tests run: 5, Failures: 0, Errors: 0, Time elapsed: 0.014 sec
    [junit] 
    [junit] Testsuite: org.apache.solr.handler.dataimport.TestScriptTransformer
    [junit] Tests run: 0, Failures: 0, Errors: 0, Time elapsed: 0.009 sec
    [junit] 
    [junit] Testsuite: org.apache.solr.handler.dataimport.TestSqlEntityProcessor
    [junit] Tests run: 4, Failures: 0, Errors: 0, Time elapsed: 0.018 sec
    [junit] 
    [junit] Testsuite: org.apache.solr.handler.dataimport.TestSqlEntityProcessor2
    [junit] Tests run: 7, Failures: 0, Errors: 0, Time elapsed: 2.589 sec
    [junit] 
    [junit] Testsuite: org.apache.solr.handler.dataimport.TestSqlEntityProcessorDelta
    [junit] Tests run: 8, Failures: 0, Errors: 0, Time elapsed: 3.442 sec
    [junit] 
    [junit] Testsuite: org.apache.solr.handler.dataimport.TestSqlEntityProcessorDelta2
    [junit] Tests run: 8, Failures: 0, Errors: 0, Time elapsed: 3.181 sec
    [junit] 
    [junit] Testsuite: org.apache.solr.handler.dataimport.TestTemplateString
    [junit] Tests run: 1, Failures: 0, Errors: 0, Time elapsed: 0.006 sec
    [junit] 
    [junit] Testsuite: org.apache.solr.handler.dataimport.TestTemplateTransformer
    [junit] Tests run: 1, Failures: 0, Errors: 0, Time elapsed: 0.007 sec
    [junit] 
    [junit] Testsuite: org.apache.solr.handler.dataimport.TestThreaded
    [junit] Tests run: 1, Failures: 0, Errors: 0, Time elapsed: 0.359 sec
    [junit] 
    [junit] Testsuite: org.apache.solr.handler.dataimport.TestURLDataSource
    [junit] Tests run: 1, Failures: 0, Errors: 0, Time elapsed: 0.008 sec
    [junit] 
    [junit] Testsuite: org.apache.solr.handler.dataimport.TestVariableResolver
    [junit] Tests run: 9, Failures: 0, Errors: 0, Time elapsed: 0.04 sec
    [junit] 
    [junit] Testsuite: org.apache.solr.handler.dataimport.TestXPathEntityProcessor
    [junit] Tests run: 8, Failures: 0, Errors: 0, Time elapsed: 0.554 sec
    [junit] 
    [junit] Testsuite: org.apache.solr.handler.dataimport.TestXPathRecordReader
    [junit] Tests run: 21, Failures: 0, Errors: 0, Time elapsed: 0.044 sec
    [junit] 
    [junit] Tests FAILED

BUILD FAILED
<https://hudson.apache.org/hudson/job/Solr-3.x/ws/branch_3x/solr/common-build.xml>:455:
The following error occurred while executing this line:
<https://hudson.apache.org/hudson/job/Solr-3.x/ws/branch_3x/solr/common-build.xml>:316:
The following error occurred while executing this line:
<https://hudson.apache.org/hudson/job/Solr-3.x/ws/branch_3x/solr/contrib/dataimporthandler/build.xml>:171:
Tests failed!

Total time: 7 minutes 36 seconds
[TASKS] Skipping publisher since build result is FAILURE
Publishing Javadoc
Archiving artifacts
Recording test results
Publishing Clover coverage report...
No Clover report will be published due to a Build Failure


---------------------------------------------------------------------
To unsubscribe, e-mail: dev-unsubscribe@lucene.apache.org
For additional commands, e-mail: dev-help@lucene.apache.org


Mime
View raw message