lucene-dev mailing list archives

Site index · List index
Message view « Date » · « Thread »
Top « Date » · « Thread »
From Apache Hudson Server <hud...@hudson.apache.org>
Subject Build failed in Hudson: Solr-3.x #88
Date Mon, 30 Aug 2010 06:45:55 GMT
See <https://hudson.apache.org/hudson/job/Solr-3.x/88/>

------------------------------------------
[...truncated 6432 lines...]
build-contrib:

init:
    [mkdir] Created dir: <https://hudson.apache.org/hudson/job/Solr-3.x/ws/branch_3x/solr/contrib/clustering/build/classes>
    [mkdir] Created dir: <https://hudson.apache.org/hudson/job/Solr-3.x/ws/branch_3x/solr/build/docs/api>

init-forrest-entities:

compile-lucene:

compile-solrj:

compile:
    [javac] Compiling 1 source file to <https://hudson.apache.org/hudson/job/Solr-3.x/ws/branch_3x/solr/build/solr>

compileTests:

make-manifest:
    [mkdir] Created dir: <https://hudson.apache.org/hudson/job/Solr-3.x/ws/branch_3x/solr/build/META-INF>

compile:
    [javac] Compiling 8 source files to <https://hudson.apache.org/hudson/job/Solr-3.x/ws/branch_3x/solr/contrib/clustering/build/classes>
    [javac] Note: <https://hudson.apache.org/hudson/job/Solr-3.x/ws/branch_3x/solr/contrib/clustering/src/main/java/org/apache/solr/handler/clustering/carrot2/CarrotClusteringEngine.java>
uses or overrides a deprecated API.
    [javac] Note: Recompile with -Xlint:deprecation for details.

build:
      [jar] Building jar: <https://hudson.apache.org/hudson/job/Solr-3.x/ws/branch_3x/solr/contrib/clustering/build/apache-solr-clustering-3.1-2010-08-30_06-01-49.jar>

init:
    [mkdir] Created dir: <https://hudson.apache.org/hudson/job/Solr-3.x/ws/branch_3x/solr/contrib/dataimporthandler/target/classes>

init-forrest-entities:

compile-lucene:

compile-solrj:

compile:
    [javac] Compiling 1 source file to <https://hudson.apache.org/hudson/job/Solr-3.x/ws/branch_3x/solr/build/solr>

make-manifest:

compile:
    [javac] Compiling 48 source files to <https://hudson.apache.org/hudson/job/Solr-3.x/ws/branch_3x/solr/contrib/dataimporthandler/target/classes>
    [javac] Note: <https://hudson.apache.org/hudson/job/Solr-3.x/ws/branch_3x/solr/contrib/dataimporthandler/src/main/java/org/apache/solr/handler/dataimport/DocBuilder.java>
uses or overrides a deprecated API.
    [javac] Note: Recompile with -Xlint:deprecation for details.
    [javac] Note: Some input files use unchecked or unsafe operations.
    [javac] Note: Recompile with -Xlint:unchecked for details.

compileExtras:
    [mkdir] Created dir: <https://hudson.apache.org/hudson/job/Solr-3.x/ws/branch_3x/solr/contrib/dataimporthandler/target/extras/classes>
    [javac] Compiling 2 source files to <https://hudson.apache.org/hudson/job/Solr-3.x/ws/branch_3x/solr/contrib/dataimporthandler/target/extras/classes>
    [javac] Note: Some input files use unchecked or unsafe operations.
    [javac] Note: Recompile with -Xlint:unchecked for details.

build:
      [jar] Building jar: <https://hudson.apache.org/hudson/job/Solr-3.x/ws/branch_3x/solr/contrib/dataimporthandler/target/apache-solr-dataimporthandler-3.1-2010-08-30_06-01-49.jar>
      [jar] Building jar: <https://hudson.apache.org/hudson/job/Solr-3.x/ws/branch_3x/solr/contrib/dataimporthandler/target/apache-solr-dataimporthandler-extras-3.1-2010-08-30_06-01-49.jar>

init:
    [mkdir] Created dir: <https://hudson.apache.org/hudson/job/Solr-3.x/ws/branch_3x/solr/contrib/extraction/build/classes>

init-forrest-entities:

compile-lucene:

compile-solrj:

compile:
    [javac] Compiling 1 source file to <https://hudson.apache.org/hudson/job/Solr-3.x/ws/branch_3x/solr/build/solr>

make-manifest:

compile:
    [javac] Compiling 6 source files to <https://hudson.apache.org/hudson/job/Solr-3.x/ws/branch_3x/solr/contrib/extraction/build/classes>
    [javac] Note: <https://hudson.apache.org/hudson/job/Solr-3.x/ws/branch_3x/solr/contrib/extraction/src/main/java/org/apache/solr/handler/extraction/ExtractingDocumentLoader.java>
uses or overrides a deprecated API.
    [javac] Note: Recompile with -Xlint:deprecation for details.
    [javac] Note: Some input files use unchecked or unsafe operations.
    [javac] Note: Recompile with -Xlint:unchecked for details.

build:
      [jar] Building jar: <https://hudson.apache.org/hudson/job/Solr-3.x/ws/branch_3x/solr/contrib/extraction/build/apache-solr-cell-3.1-2010-08-30_06-01-49.jar>

test-contrib:

init:

init-forrest-entities:

compile-lucene:

compile-solrj:

compile:
    [javac] Compiling 1 source file to <https://hudson.apache.org/hudson/job/Solr-3.x/ws/branch_3x/solr/build/solr>

compileTests:

make-manifest:

compile:

compileTests:
    [mkdir] Created dir: <https://hudson.apache.org/hudson/job/Solr-3.x/ws/branch_3x/solr/contrib/clustering/build/test-classes>
    [javac] Compiling 5 source files to <https://hudson.apache.org/hudson/job/Solr-3.x/ws/branch_3x/solr/contrib/clustering/build/test-classes>

test:
    [junit] Running org.apache.solr.handler.clustering.ClusteringComponentTest
    [junit] Tests run: 1, Failures: 0, Errors: 0, Time elapsed: 7.301 sec
    [junit] Running org.apache.solr.handler.clustering.carrot2.CarrotClusteringEngineTest
    [junit] Tests run: 7, Failures: 0, Errors: 0, Time elapsed: 7.94 sec

init:

init-forrest-entities:

compile-lucene:

compile-solrj:

compile:
    [javac] Compiling 1 source file to <https://hudson.apache.org/hudson/job/Solr-3.x/ws/branch_3x/solr/build/solr>

make-manifest:

compile:

compileTests:
    [mkdir] Created dir: <https://hudson.apache.org/hudson/job/Solr-3.x/ws/branch_3x/solr/contrib/dataimporthandler/target/test-classes>
    [javac] Compiling 31 source files to <https://hudson.apache.org/hudson/job/Solr-3.x/ws/branch_3x/solr/contrib/dataimporthandler/target/test-classes>
    [javac] Note: Some input files use unchecked or unsafe operations.
    [javac] Note: Recompile with -Xlint:unchecked for details.

testCore:
    [junit] Running org.apache.solr.handler.dataimport.TestCachedSqlEntityProcessor
    [junit] Tests run: 5, Failures: 0, Errors: 0, Time elapsed: 3.535 sec
    [junit] Running org.apache.solr.handler.dataimport.TestClobTransformer
    [junit] Tests run: 1, Failures: 0, Errors: 0, Time elapsed: 3.767 sec
    [junit] Running org.apache.solr.handler.dataimport.TestContentStreamDataSource
    [junit] Tests run: 1, Failures: 0, Errors: 0, Time elapsed: 3.735 sec
    [junit] Running org.apache.solr.handler.dataimport.TestDataConfig
    [junit] Tests run: 1, Failures: 0, Errors: 0, Time elapsed: 5.605 sec
    [junit] Running org.apache.solr.handler.dataimport.TestDateFormatTransformer
    [junit] Tests run: 2, Failures: 0, Errors: 0, Time elapsed: 3.955 sec
    [junit] Running org.apache.solr.handler.dataimport.TestDocBuilder
    [junit] Tests run: 6, Failures: 0, Errors: 0, Time elapsed: 3.978 sec
    [junit] Running org.apache.solr.handler.dataimport.TestDocBuilder2
    [junit] Tests run: 11, Failures: 0, Errors: 0, Time elapsed: 11.107 sec
    [junit] Running org.apache.solr.handler.dataimport.TestEntityProcessorBase
    [junit] Tests run: 1, Failures: 0, Errors: 0, Time elapsed: 3.674 sec
    [junit] Running org.apache.solr.handler.dataimport.TestErrorHandling
    [junit] Tests run: 4, Failures: 0, Errors: 0, Time elapsed: 7.493 sec
    [junit] Running org.apache.solr.handler.dataimport.TestEvaluatorBag
    [junit] Tests run: 5, Failures: 0, Errors: 0, Time elapsed: 3.823 sec
    [junit] Running org.apache.solr.handler.dataimport.TestFieldReader
    [junit] Tests run: 1, Failures: 0, Errors: 0, Time elapsed: 3.958 sec
    [junit] Running org.apache.solr.handler.dataimport.TestFileListEntityProcessor
    [junit] Tests run: 4, Failures: 0, Errors: 0, Time elapsed: 3.811 sec
    [junit] Running org.apache.solr.handler.dataimport.TestJdbcDataSource
    [junit] Tests run: 3, Failures: 0, Errors: 0, Time elapsed: 3.717 sec
    [junit] Running org.apache.solr.handler.dataimport.TestLineEntityProcessor
    [junit] Tests run: 4, Failures: 0, Errors: 0, Time elapsed: 3.718 sec
    [junit] Running org.apache.solr.handler.dataimport.TestNumberFormatTransformer
    [junit] Tests run: 9, Failures: 0, Errors: 0, Time elapsed: 3.589 sec
    [junit] Running org.apache.solr.handler.dataimport.TestPlainTextEntityProcessor
    [junit] Tests run: 1, Failures: 0, Errors: 0, Time elapsed: 3.789 sec
    [junit] Running org.apache.solr.handler.dataimport.TestRegexTransformer
    [junit] Tests run: 5, Failures: 0, Errors: 0, Time elapsed: 3.519 sec
    [junit] Running org.apache.solr.handler.dataimport.TestScriptTransformer
    [junit] Tests run: 0, Failures: 0, Errors: 0, Time elapsed: 3.386 sec
    [junit] Running org.apache.solr.handler.dataimport.TestSqlEntityProcessor
    [junit] Tests run: 4, Failures: 0, Errors: 0, Time elapsed: 3.696 sec
    [junit] Running org.apache.solr.handler.dataimport.TestSqlEntityProcessor2
    [junit] Tests run: 7, Failures: 0, Errors: 0, Time elapsed: 9.065 sec
    [junit] Running org.apache.solr.handler.dataimport.TestSqlEntityProcessorDelta
    [junit] Tests run: 7, Failures: 0, Errors: 0, Time elapsed: 9.534 sec
    [junit] Running org.apache.solr.handler.dataimport.TestSqlEntityProcessorDelta2
    [junit] Tests run: 7, Failures: 0, Errors: 0, Time elapsed: 9.086 sec
    [junit] Running org.apache.solr.handler.dataimport.TestTemplateString
    [junit] Tests run: 1, Failures: 0, Errors: 0, Time elapsed: 3.69 sec
    [junit] Running org.apache.solr.handler.dataimport.TestTemplateTransformer
    [junit] Tests run: 1, Failures: 0, Errors: 0, Time elapsed: 3.54 sec
    [junit] Running org.apache.solr.handler.dataimport.TestThreaded
    [junit] Tests run: 1, Failures: 0, Errors: 0, Time elapsed: 5.994 sec
    [junit] Running org.apache.solr.handler.dataimport.TestURLDataSource
    [junit] Tests run: 1, Failures: 0, Errors: 0, Time elapsed: 3.761 sec
    [junit] Running org.apache.solr.handler.dataimport.TestVariableResolver
    [junit] Tests run: 9, Failures: 0, Errors: 0, Time elapsed: 3.602 sec
    [junit] Running org.apache.solr.handler.dataimport.TestXPathEntityProcessor
    [junit] Tests run: 8, Failures: 0, Errors: 0, Time elapsed: 4.27 sec
    [junit] Running org.apache.solr.handler.dataimport.TestXPathRecordReader
    [junit] Tests run: 21, Failures: 0, Errors: 0, Time elapsed: 4.044 sec

compileExtras:

compileExtrasTests:
    [mkdir] Created dir: <https://hudson.apache.org/hudson/job/Solr-3.x/ws/branch_3x/solr/contrib/dataimporthandler/target/extras/test-classes>
    [javac] Compiling 2 source files to <https://hudson.apache.org/hudson/job/Solr-3.x/ws/branch_3x/solr/contrib/dataimporthandler/target/extras/test-classes>

testExtras:
    [junit] Running org.apache.solr.handler.dataimport.TestMailEntityProcessor
    [junit] Tests run: 0, Failures: 0, Errors: 0, Time elapsed: 5.141 sec
    [junit] Running org.apache.solr.handler.dataimport.TestTikaEntityProcessor
    [junit] Tests run: 1, Failures: 0, Errors: 0, Time elapsed: 9.164 sec

test:

init:

init-forrest-entities:

compile-lucene:

compile-solrj:

compile:
    [javac] Compiling 1 source file to <https://hudson.apache.org/hudson/job/Solr-3.x/ws/branch_3x/solr/build/solr>

make-manifest:

compile:

compileTests:
    [mkdir] Created dir: <https://hudson.apache.org/hudson/job/Solr-3.x/ws/branch_3x/solr/contrib/extraction/build/test-classes>
    [javac] Compiling 1 source file to <https://hudson.apache.org/hudson/job/Solr-3.x/ws/branch_3x/solr/contrib/extraction/build/test-classes>

test:
    [junit] Running org.apache.solr.handler.ExtractingRequestHandlerTest
    [junit]  xml response was: <?xml version="1.0" encoding="UTF-8"?>
    [junit] <response>
    [junit] <lst name="responseHeader"><int name="status">0</int><int
name="QTime">8</int></lst><result name="response" numFound="0" start="0"/>
    [junit] </response>
    [junit] 
    [junit]  request was: rows=20&start=0&q=title:Welcome&qt=standard&version=2.2)
    [junit] Tests run: 8, Failures: 1, Errors: 0, Time elapsed: 10.691 sec
    [junit] Test org.apache.solr.handler.ExtractingRequestHandlerTest FAILED

BUILD FAILED
<https://hudson.apache.org/hudson/job/Solr-3.x/ws/branch_3x/solr/common-build.xml>:452:
The following error occurred while executing this line:
<https://hudson.apache.org/hudson/job/Solr-3.x/ws/branch_3x/solr/common-build.xml>:313:
The following error occurred while executing this line:
<https://hudson.apache.org/hudson/job/Solr-3.x/ws/branch_3x/solr/contrib/extraction/build.xml>:120:
Tests failed!

Total time: 32 minutes 12 seconds
[TASKS] Skipping publisher since build result is FAILURE
Publishing Javadoc
Archiving artifacts
Recording test results
Publishing Clover coverage report...
No Clover report will be published due to a Build Failure


---------------------------------------------------------------------
To unsubscribe, e-mail: dev-unsubscribe@lucene.apache.org
For additional commands, e-mail: dev-help@lucene.apache.org


Mime
View raw message