lucene-dev mailing list archives

Site index · List index
Message view « Date » · « Thread »
Top « Date » · « Thread »
From Michael McCandless <luc...@mikemccandless.com>
Subject Re: Build failed in Hudson: Solr-3.x #64
Date Fri, 16 Jul 2010 09:03:21 GMT
Looks like this was the failure for Solr's build -- Robert any ideas?

    [junit] Testsuite: org.apache.solr.client.solrj.TestLBHttpSolrServer
    [junit] Testcase:
testTwoServers(org.apache.solr.client.solrj.TestLBHttpSolrServer):	Caused
an ERROR
    [junit] No live SolrServers available to handle this request
    [junit] org.apache.solr.client.solrj.SolrServerException: No live
SolrServers available to handle this request
    [junit] 	at
org.apache.solr.client.solrj.impl.LBHttpSolrServer.request(LBHttpSolrServer.java:220)
    [junit] 	at
org.apache.solr.client.solrj.request.QueryRequest.process(QueryRequest.java:89)
    [junit] 	at
org.apache.solr.client.solrj.SolrServer.query(SolrServer.java:118)
    [junit] 	at
org.apache.solr.client.solrj.TestLBHttpSolrServer.testTwoServers(TestLBHttpSolrServer.java:130)
    [junit] Caused by:
org.apache.solr.client.solrj.SolrServerException:
java.net.SocketException: Socket closed
    [junit] 	at
org.apache.solr.client.solrj.impl.CommonsHttpSolrServer.request(CommonsHttpSolrServer.java:483)
    [junit] 	at
org.apache.solr.client.solrj.impl.CommonsHttpSolrServer.request(CommonsHttpSolrServer.java:244)
    [junit] 	at
org.apache.solr.client.solrj.impl.LBHttpSolrServer.request(LBHttpSolrServer.java:204)
    [junit] Caused by: java.net.SocketException: Socket closed
    [junit] 	at java.net.SocketInputStream.socketRead0(Native Method)
    [junit] 	at java.net.SocketInputStream.read(SocketInputStream.java:129)
    [junit] 	at java.io.BufferedInputStream.fill(BufferedInputStream.java:218)
    [junit] 	at java.io.BufferedInputStream.read(BufferedInputStream.java:235)
    [junit] 	at
org.apache.commons.httpclient.HttpParser.readRawLine(HttpParser.java:78)
    [junit] 	at
org.apache.commons.httpclient.HttpParser.readLine(HttpParser.java:106)
    [junit] 	at
org.apache.commons.httpclient.HttpConnection.readLine(HttpConnection.java:1116)
    [junit] 	at
org.apache.commons.httpclient.HttpMethodBase.readStatusLine(HttpMethodBase.java:1973)
    [junit] 	at
org.apache.commons.httpclient.HttpMethodBase.readResponse(HttpMethodBase.java:1735)
    [junit] 	at
org.apache.commons.httpclient.HttpMethodBase.execute(HttpMethodBase.java:1098)
    [junit] 	at
org.apache.commons.httpclient.HttpMethodDirector.executeWithRetry(HttpMethodDirector.java:398)
    [junit] 	at
org.apache.commons.httpclient.HttpMethodDirector.executeMethod(HttpMethodDirector.java:171)
    [junit] 	at
org.apache.commons.httpclient.HttpClient.executeMethod(HttpClient.java:397)
    [junit] 	at
org.apache.commons.httpclient.HttpClient.executeMethod(HttpClient.java:323)
    [junit] 	at
org.apache.solr.client.solrj.impl.CommonsHttpSolrServer.request(CommonsHttpSolrServer.java:427)
    [junit]
    [junit]
    [junit] Tests run: 2, Failures: 0, Errors: 1, Time elapsed: 15.357 sec
    [junit]
    [junit] Test org.apache.solr.client.solrj.TestLBHttpSolrServer FAILED

Mike

On Fri, Jul 16, 2010 at 2:09 AM, Apache Hudson Server
<hudson@hudson.zones.apache.org> wrote:
> See <http://hudson.zones.apache.org/hudson/job/Solr-3.x/64/changes>
>
> Changes:
>
> [rmuir] SOLR-2002: assert inconsistencies in setup/teardown rather than giving an awkward
IAE for maxclausecount=0
>
> [rmuir] SOLR-2003: report (throw exception) rather than replace charset errors in SolrResourceLoader.getLines
>
> ------------------------------------------
> [...truncated 6460 lines...]
>    [junit] SEVERE: Master at: http://localhost:TEST_PORT/solr/replication is not available.
Index fetch failed. Exception: Invalid uri 'http://localhost:TEST_PORT/solr/replication':
invalid port number
>    [junit] Jul 16, 2010 5:54:39 AM org.apache.solr.handler.SnapPuller fetchLatestIndex
>    [junit] SEVERE: Master at: http://localhost:TEST_PORT/solr/replication is not available.
Index fetch failed. Exception: Invalid uri 'http://localhost:TEST_PORT/solr/replication':
invalid port number
>    [junit] Jul 16, 2010 5:54:39 AM org.apache.solr.handler.SnapPuller fetchLatestIndex
>    [junit] SEVERE: Master at: http://localhost:55676/solr/replication is not available.
Index fetch failed. Exception: Connection refused
>    [junit] Jul 16, 2010 5:54:40 AM org.apache.solr.handler.SnapPuller fetchLatestIndex
>    [junit] SEVERE: Master at: http://localhost:55676/solr/replication is not available.
Index fetch failed. Exception: Connection refused
>    [junit] Jul 16, 2010 5:54:40 AM org.apache.solr.handler.SnapPuller fetchLatestIndex
>    [junit] SEVERE: Master at: http://localhost:TEST_PORT/solr/replication is not available.
Index fetch failed. Exception: Invalid uri 'http://localhost:TEST_PORT/solr/replication':
invalid port number
>    [junit] Jul 16, 2010 5:54:41 AM org.apache.solr.handler.SnapPuller fetchLatestIndex
>    [junit] SEVERE: Master at: http://localhost:55676/solr/replication is not available.
Index fetch failed. Exception: Connection refused
>    [junit] Jul 16, 2010 5:54:41 AM org.apache.solr.handler.SnapPuller fetchLatestIndex
>    [junit] SEVERE: Master at: http://localhost:TEST_PORT/solr/replication is not available.
Index fetch failed. Exception: Invalid uri 'http://localhost:TEST_PORT/solr/replication':
invalid port number
>    [junit] Jul 16, 2010 5:54:42 AM org.apache.solr.handler.SnapPuller fetchLatestIndex
>    [junit] SEVERE: Master at: http://localhost:55676/solr/replication is not available.
Index fetch failed. Exception: Connection refused
>    [junit] Jul 16, 2010 5:54:42 AM org.apache.solr.handler.SnapPuller fetchLatestIndex
>    [junit] SEVERE: Master at: http://localhost:TEST_PORT/solr/replication is not available.
Index fetch failed. Exception: Invalid uri 'http://localhost:TEST_PORT/solr/replication':
invalid port number
>    [junit] Jul 16, 2010 5:54:43 AM org.apache.solr.handler.SnapPuller fetchLatestIndex
>    [junit] SEVERE: Master at: http://localhost:55676/solr/replication is not available.
Index fetch failed. Exception: Connection refused
>    [junit] Jul 16, 2010 5:54:43 AM org.apache.solr.handler.SnapPuller fetchLatestIndex
>    [junit] SEVERE: Master at: http://localhost:TEST_PORT/solr/replication is not available.
Index fetch failed. Exception: Invalid uri 'http://localhost:TEST_PORT/solr/replication':
invalid port number
>    [junit] ------------- ---------------- ---------------
>    [junit] Testsuite: org.apache.solr.handler.XmlUpdateRequestHandlerTest
>    [junit] Tests run: 1, Failures: 0, Errors: 0, Time elapsed: 5.744 sec
>    [junit]
>    [junit] Testsuite: org.apache.solr.handler.admin.LukeRequestHandlerTest
>    [junit] Tests run: 1, Failures: 0, Errors: 0, Time elapsed: 5.004 sec
>    [junit]
>    [junit] Testsuite: org.apache.solr.handler.admin.SystemInfoHandlerTest
>    [junit] Tests run: 1, Failures: 0, Errors: 0, Time elapsed: 0.719 sec
>    [junit]
>    [junit] Testsuite: org.apache.solr.handler.component.DistributedSpellCheckComponentTest
>    [junit] Tests run: 1, Failures: 0, Errors: 0, Time elapsed: 39.938 sec
>    [junit]
>    [junit] Testsuite: org.apache.solr.handler.component.DistributedTermsComponentTest
>    [junit] Tests run: 1, Failures: 0, Errors: 0, Time elapsed: 36.163 sec
>    [junit]
>    [junit] Testsuite: org.apache.solr.handler.component.QueryElevationComponentTest
>    [junit] Tests run: 4, Failures: 0, Errors: 0, Time elapsed: 9.528 sec
>    [junit]
>    [junit] Testsuite: org.apache.solr.handler.component.SearchHandlerTest
>    [junit] Tests run: 1, Failures: 0, Errors: 0, Time elapsed: 9.16 sec
>    [junit]
>    [junit] Testsuite: org.apache.solr.handler.component.SpellCheckComponentTest
>    [junit] Tests run: 8, Failures: 0, Errors: 0, Time elapsed: 9.772 sec
>    [junit]
>    [junit] Testsuite: org.apache.solr.handler.component.StatsComponentTest
>    [junit] Tests run: 1, Failures: 0, Errors: 0, Time elapsed: 13.666 sec
>    [junit]
>    [junit] Testsuite: org.apache.solr.handler.component.TermVectorComponentTest
>    [junit] Tests run: 5, Failures: 0, Errors: 0, Time elapsed: 8.475 sec
>    [junit]
>    [junit] Testsuite: org.apache.solr.handler.component.TermsComponentTest
>    [junit] Tests run: 13, Failures: 0, Errors: 0, Time elapsed: 12.533 sec
>    [junit]
>    [junit] Testsuite: org.apache.solr.highlight.FastVectorHighlighterTest
>    [junit] Tests run: 2, Failures: 0, Errors: 0, Time elapsed: 5.896 sec
>    [junit]
>    [junit] Testsuite: org.apache.solr.highlight.HighlighterConfigTest
>    [junit] Tests run: 1, Failures: 0, Errors: 0, Time elapsed: 5.441 sec
>    [junit]
>    [junit] Testsuite: org.apache.solr.highlight.HighlighterTest
>    [junit] Tests run: 23, Failures: 0, Errors: 0, Time elapsed: 13.095 sec
>    [junit]
>    [junit] Testsuite: org.apache.solr.request.JSONWriterTest
>    [junit] Tests run: 3, Failures: 0, Errors: 0, Time elapsed: 7.797 sec
>    [junit]
>    [junit] Testsuite: org.apache.solr.request.SimpleFacetsLegacySortTest
>    [junit] Tests run: 1, Failures: 0, Errors: 0, Time elapsed: 5.212 sec
>    [junit]
>    [junit] Testsuite: org.apache.solr.request.SimpleFacetsTest
>    [junit] Tests run: 6, Failures: 0, Errors: 0, Time elapsed: 22.151 sec
>    [junit]
>    [junit] Testsuite: org.apache.solr.request.TestBinaryResponseWriter
>    [junit] Tests run: 1, Failures: 0, Errors: 0, Time elapsed: 6.77 sec
>    [junit]
>    [junit] Testsuite: org.apache.solr.request.TestFaceting
>    [junit] Tests run: 3, Failures: 0, Errors: 0, Time elapsed: 29.643 sec
>    [junit]
>    [junit] Testsuite: org.apache.solr.request.TestWriterPerf
>    [junit] Tests run: 1, Failures: 0, Errors: 0, Time elapsed: 8.526 sec
>    [junit]
>    [junit] ------------- Standard Output ---------------
>    [junit] writer xml, size=7184, encodeRate=5, decodeRate=46
>    [junit] writer json, size=4475, encodeRate=133, decodeRate=N/A
>    [junit] writer javabin, size=1991, encodeRate=142, decodeRate=400
>    [junit] ------------- ---------------- ---------------
>    [junit] Testsuite: org.apache.solr.schema.BadIndexSchemaTest
>    [junit] Tests run: 1, Failures: 0, Errors: 0, Time elapsed: 2.666 sec
>    [junit]
>    [junit] Testsuite: org.apache.solr.schema.CopyFieldTest
>    [junit] Tests run: 6, Failures: 0, Errors: 0, Time elapsed: 7.394 sec
>    [junit]
>    [junit] Testsuite: org.apache.solr.schema.DateFieldTest
>    [junit] Tests run: 6, Failures: 0, Errors: 0, Time elapsed: 1.937 sec
>    [junit]
>    [junit] Testsuite: org.apache.solr.schema.IndexSchemaTest
>    [junit] Tests run: 5, Failures: 0, Errors: 0, Time elapsed: 7.724 sec
>    [junit]
>    [junit] Testsuite: org.apache.solr.schema.LegacyDateFieldTest
>    [junit] Tests run: 4, Failures: 0, Errors: 0, Time elapsed: 1.248 sec
>    [junit]
>    [junit] Testsuite: org.apache.solr.schema.NotRequiredUniqueKeyTest
>    [junit] Tests run: 1, Failures: 0, Errors: 0, Time elapsed: 5.843 sec
>    [junit]
>    [junit] ------------- Standard Error -----------------
>    [junit] Jul 16, 2010 6:00:34 AM org.apache.solr.schema.IndexSchema readSchema
>    [junit] SEVERE: uniqueKey should not be multivalued
>    [junit] ------------- ---------------- ---------------
>    [junit] Testsuite: org.apache.solr.schema.PolyFieldTest
>    [junit] Tests run: 5, Failures: 0, Errors: 0, Time elapsed: 18.027 sec
>    [junit]
>    [junit] Testsuite: org.apache.solr.schema.RequiredFieldsTest
>    [junit] Tests run: 3, Failures: 0, Errors: 0, Time elapsed: 5.92 sec
>    [junit]
>    [junit] ------------- Standard Error -----------------
>    [junit] Jul 16, 2010 6:01:04 AM org.apache.solr.schema.IndexSchema readSchema
>    [junit] SEVERE: uniqueKey should not be multivalued
>    [junit] ------------- ---------------- ---------------
>    [junit] Testsuite: org.apache.solr.schema.TestBinaryField
>    [junit] Tests run: 1, Failures: 0, Errors: 0, Time elapsed: 9.309 sec
>    [junit]
>    [junit] Testsuite: org.apache.solr.schema.UUIDFieldTest
>    [junit] Tests run: 1, Failures: 0, Errors: 0, Time elapsed: 0.81 sec
>    [junit]
>    [junit] Testsuite: org.apache.solr.search.FunctionQParserTest
>    [junit] Tests run: 1, Failures: 0, Errors: 0, Time elapsed: 6.202 sec
>    [junit]
>    [junit] Testsuite: org.apache.solr.search.QueryParsingTest
>    [junit] Tests run: 2, Failures: 0, Errors: 0, Time elapsed: 5.378 sec
>    [junit]
>    [junit] Testsuite: org.apache.solr.search.TestDocSet
>    [junit] Tests run: 2, Failures: 0, Errors: 0, Time elapsed: 2.81 sec
>    [junit]
>    [junit] Testsuite: org.apache.solr.search.TestExtendedDismaxParser
>    [junit] Tests run: 1, Failures: 0, Errors: 0, Time elapsed: 10.836 sec
>    [junit]
>    [junit] Testsuite: org.apache.solr.search.TestFastLRUCache
>    [junit] Tests run: 2, Failures: 0, Errors: 0, Time elapsed: 0.535 sec
>    [junit]
>    [junit] Testsuite: org.apache.solr.search.TestIndexSearcher
>    [junit] Tests run: 1, Failures: 0, Errors: 0, Time elapsed: 7.021 sec
>    [junit]
>    [junit] Testsuite: org.apache.solr.search.TestQueryTypes
>    [junit] Tests run: 1, Failures: 0, Errors: 0, Time elapsed: 8.699 sec
>    [junit]
>    [junit] Testsuite: org.apache.solr.search.TestQueryUtils
>    [junit] Tests run: 1, Failures: 0, Errors: 0, Time elapsed: 12.088 sec
>    [junit]
>    [junit] Testsuite: org.apache.solr.search.TestRangeQuery
>    [junit] Tests run: 2, Failures: 0, Errors: 0, Time elapsed: 64.117 sec
>    [junit]
>    [junit] Testsuite: org.apache.solr.search.TestSearchPerf
>    [junit] Tests run: 1, Failures: 0, Errors: 0, Time elapsed: 7.422 sec
>    [junit]
>    [junit] Testsuite: org.apache.solr.search.TestSort
>    [junit] Tests run: 1, Failures: 0, Errors: 0, Time elapsed: 16.174 sec
>    [junit]
>    [junit] Testsuite: org.apache.solr.search.function.SortByFunctionTest
>    [junit] Tests run: 1, Failures: 0, Errors: 0, Time elapsed: 10.029 sec
>    [junit]
>    [junit] Testsuite: org.apache.solr.search.function.TestFunctionQuery
>    [junit] Tests run: 6, Failures: 0, Errors: 0, Time elapsed: 21.521 sec
>    [junit]
>    [junit] Testsuite: org.apache.solr.search.function.distance.DistanceFunctionTest
>    [junit] Tests run: 2, Failures: 0, Errors: 0, Time elapsed: 8.839 sec
>    [junit]
>    [junit] Testsuite: org.apache.solr.servlet.CacheHeaderTest
>    [junit] Tests run: 5, Failures: 0, Errors: 0, Time elapsed: 17.356 sec
>    [junit]
>    [junit] Testsuite: org.apache.solr.servlet.DirectSolrConnectionTest
>    [junit] Tests run: 2, Failures: 0, Errors: 0, Time elapsed: 3.019 sec
>    [junit]
>    [junit] ------------- Standard Error -----------------
>    [junit] Jul 16, 2010 6:05:02 AM org.apache.solr.schema.IndexSchema readSchema
>    [junit] SEVERE: uniqueKey should not be multivalued
>    [junit] Jul 16, 2010 6:05:04 AM org.apache.solr.schema.IndexSchema readSchema
>    [junit] SEVERE: uniqueKey should not be multivalued
>    [junit] ------------- ---------------- ---------------
>    [junit] Testsuite: org.apache.solr.servlet.NoCacheHeaderTest
>    [junit] Tests run: 3, Failures: 0, Errors: 0, Time elapsed: 15.155 sec
>    [junit]
>    [junit] Testsuite: org.apache.solr.servlet.SolrRequestParserTest
>    [junit] Tests run: 4, Failures: 0, Errors: 0, Time elapsed: 7.275 sec
>    [junit]
>    [junit] Testsuite: org.apache.solr.spelling.FileBasedSpellCheckerTest
>    [junit] Tests run: 3, Failures: 0, Errors: 0, Time elapsed: 12.452 sec
>    [junit]
>    [junit] Testsuite: org.apache.solr.spelling.IndexBasedSpellCheckerTest
>    [junit] Tests run: 4, Failures: 0, Errors: 0, Time elapsed: 4.692 sec
>    [junit]
>    [junit] Testsuite: org.apache.solr.spelling.SpellingQueryConverterTest
>    [junit] Tests run: 4, Failures: 0, Errors: 0, Time elapsed: 0.886 sec
>    [junit]
>    [junit] Testsuite: org.apache.solr.update.AutoCommitTest
>    [junit] Tests run: 1, Failures: 0, Errors: 0, Time elapsed: 7.099 sec
>    [junit]
>    [junit] Testsuite: org.apache.solr.update.DirectUpdateHandlerOptimizeTest
>    [junit] Tests run: 1, Failures: 0, Errors: 0, Time elapsed: 11.959 sec
>    [junit]
>    [junit] Testsuite: org.apache.solr.update.DirectUpdateHandlerTest
>    [junit] Tests run: 7, Failures: 0, Errors: 0, Time elapsed: 27.99 sec
>    [junit]
>    [junit] Testsuite: org.apache.solr.update.DocumentBuilderTest
>    [junit] Tests run: 3, Failures: 0, Errors: 0, Time elapsed: 10.849 sec
>    [junit]
>    [junit] Testsuite: org.apache.solr.update.TestIndexingPerformance
>    [junit] Tests run: 1, Failures: 0, Errors: 0, Time elapsed: 23.584 sec
>    [junit]
>    [junit] ------------- Standard Output ---------------
>    [junit] includeDoc=true doc=[text, simple, text, test, text, how now brown cow,
text, what's that?, text, radical!, text, what's all this about, anyway?, text, just how fast
is this text indexing?]
>    [junit] iter=1000 time=6439 throughput=155
>    [junit] ------------- ---------------- ---------------
>    [junit] Testsuite: org.apache.solr.update.processor.SignatureUpdateProcessorFactoryTest
>    [junit] Tests run: 2, Failures: 0, Errors: 0, Time elapsed: 17.207 sec
>    [junit]
>    [junit] Testsuite: org.apache.solr.update.processor.UpdateRequestProcessorFactoryTest
>    [junit] Tests run: 1, Failures: 0, Errors: 0, Time elapsed: 8.822 sec
>    [junit]
>    [junit] Testsuite: org.apache.solr.util.ArraysUtilsTest
>    [junit] Tests run: 1, Failures: 0, Errors: 0, Time elapsed: 0.776 sec
>    [junit]
>    [junit] Testsuite: org.apache.solr.util.DateMathParserTest
>    [junit] Tests run: 7, Failures: 0, Errors: 0, Time elapsed: 2.818 sec
>    [junit]
>    [junit] Testsuite: org.apache.solr.util.SolrPluginUtilsTest
>    [junit] Tests run: 7, Failures: 0, Errors: 0, Time elapsed: 6.773 sec
>    [junit]
>    [junit] Testsuite: org.apache.solr.util.TestNumberUtils
>    [junit] Tests run: 1, Failures: 0, Errors: 0, Time elapsed: 3.136 sec
>    [junit]
>    [junit] Testsuite: org.apache.solr.util.TestOpenBitSet
>    [junit] Tests run: 3, Failures: 0, Errors: 0, Time elapsed: 13.039 sec
>    [junit]
>    [junit] Testsuite: org.apache.solr.util.TestUtils
>    [junit] Tests run: 3, Failures: 0, Errors: 0, Time elapsed: 1.176 sec
>    [junit]
>
> BUILD FAILED
> <http://hudson.zones.apache.org/hudson/job/Solr-3.x/ws/branch_3x/solr/build.xml>:390:
The following error occurred while executing this line:
> <http://hudson.zones.apache.org/hudson/job/Solr-3.x/ws/branch_3x/solr/build.xml>:477:
Tests failed!
>
> Total time: 30 minutes 5 seconds
> [TASKS] Skipping publisher since build result is FAILURE
> Publishing Javadoc
> Archiving artifacts
> Recording test results
> Publishing Clover coverage report...
> No Clover report will be published due to a Build Failure
>
>
> ---------------------------------------------------------------------
> To unsubscribe, e-mail: dev-unsubscribe@lucene.apache.org
> For additional commands, e-mail: dev-help@lucene.apache.org
>
>

---------------------------------------------------------------------
To unsubscribe, e-mail: dev-unsubscribe@lucene.apache.org
For additional commands, e-mail: dev-help@lucene.apache.org


Mime
View raw message