lucene-dev mailing list archives

Site index · List index
Message view « Date » · « Thread »
Top « Date » · « Thread »
From Simon Willnauer <simon.willna...@googlemail.com>
Subject Re: Build failed in Hudson: Lucene-trunk #1213
Date Fri, 11 Jun 2010 06:35:42 GMT
That seems to be caused by very high load on the hudson box - at least
what this tickes is telling:
http://issues.hudson-ci.org/browse/HUDSON-6531

simon

On Fri, Jun 11, 2010 at 5:31 AM, Apache Hudson Server
<hudson@hudson.zones.apache.org> wrote:
> See <http://hudson.zones.apache.org/hudson/job/Lucene-trunk/1213/changes>
>
> Changes:
>
> [simonw] LUCENE-2494: use CompletionService in ParallelMultiSearcher instead of simple
polling
>
> ------------------------------------------
> [...truncated 11233 lines...]
>    [junit] Testsuite: org.apache.lucene.search.TestPhrasePrefixQuery
>    [junit] Tests run: 1, Failures: 0, Errors: 0, Time elapsed: 0.011 sec
>    [junit]
>    [junit] Testsuite: org.apache.lucene.search.TestPhraseQuery
>    [junit] Tests run: 16, Failures: 0, Errors: 0, Time elapsed: 2.033 sec
>    [junit]
>    [junit] Testsuite: org.apache.lucene.search.TestPositionIncrement
>    [junit] Tests run: 2, Failures: 0, Errors: 0, Time elapsed: 0.151 sec
>    [junit]
>    [junit] Testsuite: org.apache.lucene.search.TestPositiveScoresOnlyCollector
>    [junit] Tests run: 1, Failures: 0, Errors: 0, Time elapsed: 0.032 sec
>    [junit]
>    [junit] Testsuite: org.apache.lucene.search.TestPrefixFilter
>    [junit] Tests run: 1, Failures: 0, Errors: 0, Time elapsed: 0.039 sec
>    [junit]
>    [junit] Testsuite: org.apache.lucene.search.TestPrefixInBooleanQuery
>    [junit] Tests run: 4, Failures: 0, Errors: 0, Time elapsed: 1.878 sec
>    [junit]
>    [junit] Testsuite: org.apache.lucene.search.TestPrefixQuery
>    [junit] Tests run: 2, Failures: 0, Errors: 0, Time elapsed: 0.024 sec
>    [junit]
>    [junit] Testsuite: org.apache.lucene.search.TestQueryTermVector
>    [junit] Tests run: 1, Failures: 0, Errors: 0, Time elapsed: 0.022 sec
>    [junit]
>    [junit] Testsuite: org.apache.lucene.search.TestQueryWrapperFilter
>    [junit] Tests run: 1, Failures: 0, Errors: 0, Time elapsed: 0.092 sec
>    [junit]
>    [junit] Testsuite: org.apache.lucene.search.TestRegexpQuery
>    [junit] Tests run: 8, Failures: 0, Errors: 0, Time elapsed: 0.205 sec
>    [junit]
>    [junit] Testsuite: org.apache.lucene.search.TestRegexpRandom
>    [junit] Tests run: 1, Failures: 0, Errors: 0, Time elapsed: 49.188 sec
>    [junit]
>    [junit] Testsuite: org.apache.lucene.search.TestRegexpRandom2
>    [junit] Tests run: 1, Failures: 0, Errors: 0, Time elapsed: 101.927 sec
>    [junit]
>    [junit] Testsuite: org.apache.lucene.search.TestScoreCachingWrappingScorer
>    [junit] Tests run: 1, Failures: 0, Errors: 0, Time elapsed: 0.048 sec
>    [junit]
>    [junit] Testsuite: org.apache.lucene.search.TestScorerPerf
>    [junit] Tests run: 1, Failures: 0, Errors: 0, Time elapsed: 16.547 sec
>    [junit]
>    [junit] Testsuite: org.apache.lucene.search.TestSetNorm
>    [junit] Tests run: 1, Failures: 0, Errors: 0, Time elapsed: 0.011 sec
>    [junit]
>    [junit] Testsuite: org.apache.lucene.search.TestSimilarity
>    [junit] Tests run: 1, Failures: 0, Errors: 0, Time elapsed: 0.15 sec
>    [junit]
>    [junit] Testsuite: org.apache.lucene.search.TestSimpleExplanations
>    [junit] Tests run: 53, Failures: 0, Errors: 0, Time elapsed: 5.492 sec
>    [junit]
>    [junit] Testsuite: org.apache.lucene.search.TestSimpleExplanationsOfNonMatches
>    [junit] Tests run: 53, Failures: 0, Errors: 0, Time elapsed: 0.438 sec
>    [junit]
>    [junit] Testsuite: org.apache.lucene.search.TestSloppyPhraseQuery
>    [junit] Tests run: 5, Failures: 0, Errors: 0, Time elapsed: 0.941 sec
>    [junit]
>    [junit] Testsuite: org.apache.lucene.search.TestSort
>    [junit] Tests run: 23, Failures: 0, Errors: 0, Time elapsed: 16.573 sec
>    [junit]
>    [junit] Testsuite: org.apache.lucene.search.TestSpanQueryFilter
>    [junit] Tests run: 1, Failures: 0, Errors: 0, Time elapsed: 0.065 sec
>    [junit]
>    [junit] Testsuite: org.apache.lucene.search.TestTermRangeFilter
>    [junit] Tests run: 7, Failures: 0, Errors: 0, Time elapsed: 8.307 sec
>    [junit]
>    [junit] Testsuite: org.apache.lucene.search.TestTermRangeQuery
>    [junit] Tests run: 12, Failures: 0, Errors: 0, Time elapsed: 0.16 sec
>    [junit]
>    [junit] Testsuite: org.apache.lucene.search.TestTermScorer
>    [junit] Tests run: 3, Failures: 0, Errors: 0, Time elapsed: 0.028 sec
>    [junit]
>    [junit] Testsuite: org.apache.lucene.search.TestTermVectors
>    [junit] Tests run: 8, Failures: 0, Errors: 0, Time elapsed: 1.174 sec
>    [junit]
>    [junit] Testsuite: org.apache.lucene.search.TestThreadSafe
>    [junit] Tests run: 1, Failures: 0, Errors: 0, Time elapsed: 12.837 sec
>    [junit]
>    [junit] Testsuite: org.apache.lucene.search.TestTimeLimitingCollector
>    [junit] Tests run: 6, Failures: 0, Errors: 0, Time elapsed: 4.126 sec
>    [junit]
>    [junit] Testsuite: org.apache.lucene.search.TestTopDocsCollector
>    [junit] Tests run: 8, Failures: 0, Errors: 0, Time elapsed: 0.19 sec
>    [junit]
>    [junit] Testsuite: org.apache.lucene.search.TestTopScoreDocCollector
>    [junit] Tests run: 1, Failures: 0, Errors: 0, Time elapsed: 0.008 sec
>    [junit]
>    [junit] Testsuite: org.apache.lucene.search.TestWildcard
>    [junit] Tests run: 9, Failures: 0, Errors: 0, Time elapsed: 0.566 sec
>    [junit]
>    [junit] Testsuite: org.apache.lucene.search.TestWildcardRandom
>    [junit] Tests run: 1, Failures: 0, Errors: 0, Time elapsed: 44.322 sec
>    [junit]
>    [junit] Testsuite: org.apache.lucene.search.function.TestCustomScoreQuery
>    [junit] Tests run: 6, Failures: 0, Errors: 0, Time elapsed: 16.269 sec
>    [junit]
>    [junit] Testsuite: org.apache.lucene.search.function.TestDocValues
>    [junit] Tests run: 3, Failures: 0, Errors: 0, Time elapsed: 0.037 sec
>    [junit]
>    [junit] Testsuite: org.apache.lucene.search.function.TestFieldScoreQuery
>    [junit] Tests run: 12, Failures: 0, Errors: 0, Time elapsed: 0.656 sec
>    [junit]
>    [junit] Testsuite: org.apache.lucene.search.function.TestOrdValues
>    [junit] Tests run: 6, Failures: 0, Errors: 0, Time elapsed: 0.612 sec
>    [junit]
>    [junit] Testsuite: org.apache.lucene.search.function.TestValueSource
>    [junit] Tests run: 1, Failures: 0, Errors: 0, Time elapsed: 0.061 sec
>    [junit]
>    [junit] Testsuite: org.apache.lucene.search.payloads.TestPayloadNearQuery
>    [junit] Tests run: 4, Failures: 0, Errors: 0, Time elapsed: 1.449 sec
>    [junit]
>    [junit] Testsuite: org.apache.lucene.search.payloads.TestPayloadTermQuery
>    [junit] Tests run: 6, Failures: 0, Errors: 0, Time elapsed: 3.283 sec
>    [junit]
>    [junit] Testsuite: org.apache.lucene.search.spans.TestBasics
>    [junit] Tests run: 20, Failures: 0, Errors: 0, Time elapsed: 48.491 sec
>    [junit]
>    [junit] Testsuite: org.apache.lucene.search.spans.TestFieldMaskingSpanQuery
>    [junit] Tests run: 11, Failures: 0, Errors: 0, Time elapsed: 1.633 sec
>    [junit]
>    [junit] Testsuite: org.apache.lucene.search.spans.TestNearSpansOrdered
>    [junit] Tests run: 10, Failures: 0, Errors: 0, Time elapsed: 0.152 sec
>    [junit]
>    [junit] Testsuite: org.apache.lucene.search.spans.TestPayloadSpans
>    [junit] Tests run: 10, Failures: 0, Errors: 0, Time elapsed: 5.181 sec
>    [junit]
>    [junit] Testsuite: org.apache.lucene.search.spans.TestSpanExplanations
>    [junit] Tests run: 31, Failures: 0, Errors: 0, Time elapsed: 2.749 sec
>    [junit]
>    [junit] Testsuite: org.apache.lucene.search.spans.TestSpanExplanationsOfNonMatches
>    [junit] Tests run: 31, Failures: 0, Errors: 0, Time elapsed: 0.275 sec
>    [junit]
>    [junit] Testsuite: org.apache.lucene.search.spans.TestSpans
>    [junit] Tests run: 25, Failures: 0, Errors: 0, Time elapsed: 1.033 sec
>    [junit]
>    [junit] Testsuite: org.apache.lucene.search.spans.TestSpansAdvanced
>    [junit] Tests run: 1, Failures: 0, Errors: 0, Time elapsed: 0.099 sec
>    [junit]
>    [junit] Testsuite: org.apache.lucene.search.spans.TestSpansAdvanced2
>    [junit] Tests run: 4, Failures: 0, Errors: 0, Time elapsed: 0.278 sec
>    [junit]
>    [junit] Testsuite: org.apache.lucene.store.TestBufferedIndexInput
>    [junit] Tests run: 4, Failures: 0, Errors: 0, Time elapsed: 10.431 sec
>    [junit]
>    [junit] Testsuite: org.apache.lucene.store.TestDirectory
>    [junit] Tests run: 7, Failures: 0, Errors: 0, Time elapsed: 1.178 sec
>    [junit]
>    [junit] Testsuite: org.apache.lucene.store.TestFileSwitchDirectory
>    [junit] Tests run: 1, Failures: 0, Errors: 0, Time elapsed: 0.165 sec
>    [junit]
>    [junit] Testsuite: org.apache.lucene.store.TestHugeRamFile
>    [junit] Tests run: 1, Failures: 0, Errors: 0, Time elapsed: 17.565 sec
>    [junit]
>    [junit] Testsuite: org.apache.lucene.store.TestLock
>    [junit] Tests run: 1, Failures: 0, Errors: 0, Time elapsed: 0.081 sec
>    [junit]
>    [junit] Testsuite: org.apache.lucene.store.TestLockFactory
>    [junit] Tests run: 11, Failures: 0, Errors: 0, Time elapsed: 5.7 sec
>    [junit]
>    [junit] Testsuite: org.apache.lucene.store.TestRAMDirectory
>    [junit] Tests run: 4, Failures: 0, Errors: 0, Time elapsed: 0.34 sec
>    [junit]
>    [junit] Testsuite: org.apache.lucene.store.TestWindowsMMap
>    [junit] Tests run: 1, Failures: 0, Errors: 0, Time elapsed: 0.501 sec
>    [junit]
>    [junit] Testsuite: org.apache.lucene.util.TestArrayUtil
>    [junit] Tests run: 5, Failures: 0, Errors: 0, Time elapsed: 0.504 sec
>    [junit]
>    [junit] Testsuite: org.apache.lucene.util.TestAttributeSource
>    [junit] Tests run: 5, Failures: 0, Errors: 0, Time elapsed: 4.174 sec
>    [junit]
>    [junit] Testsuite: org.apache.lucene.util.TestBitVector
>    [junit] Tests run: 7, Failures: 0, Errors: 0, Time elapsed: 17.905 sec
>    [junit]
>    [junit] Testsuite: org.apache.lucene.util.TestCharacterUtils
>    [junit] Tests run: 7, Failures: 0, Errors: 0, Time elapsed: 0.137 sec
>    [junit]
>    [junit] Testsuite: org.apache.lucene.util.TestCloseableThreadLocal
>    [junit] Tests run: 3, Failures: 0, Errors: 0, Time elapsed: 0.078 sec
>    [junit]
>    [junit] Testsuite: org.apache.lucene.util.TestDoubleBarrelLRUCache
>    [junit] Tests run: 2, Failures: 0, Errors: 0, Time elapsed: 1.262 sec
>    [junit]
>    [junit] Testsuite: org.apache.lucene.util.TestFieldCacheSanityChecker
>    [junit] Tests run: 4, Failures: 0, Errors: 0, Time elapsed: 1.224 sec
>    [junit]
> FATAL: command execution failed
> hudson.util.IOException2: Failed to join the process
>        at hudson.Proc$RemoteProc.join(Proc.java:312)
>        at hudson.Launcher$ProcStarter.join(Launcher.java:275)
>        at hudson.tasks.CommandInterpreter.perform(CommandInterpreter.java:83)
>        at hudson.tasks.CommandInterpreter.perform(CommandInterpreter.java:58)
>        at hudson.tasks.BuildStepMonitor$1.perform(BuildStepMonitor.java:19)
>        at hudson.model.AbstractBuild$AbstractRunner.perform(AbstractBuild.java:582)
>        at hudson.model.Build$RunnerImpl.build(Build.java:165)
>        at hudson.model.Build$RunnerImpl.doRun(Build.java:132)
>        at hudson.model.AbstractBuild$AbstractRunner.run(AbstractBuild.java:416)
>        at hudson.model.Run.run(Run.java:1243)
>        at hudson.model.FreeStyleBuild.run(FreeStyleBuild.java:46)
>        at hudson.model.ResourceController.execute(ResourceController.java:88)
>        at hudson.model.Executor.run(Executor.java:122)
> Caused by: java.util.concurrent.ExecutionException: hudson.remoting.RequestAbortedException:
java.io.EOFException
>        at hudson.remoting.Request$1.get(Request.java:218)
>        at hudson.remoting.Request$1.get(Request.java:172)
>        at hudson.remoting.FutureAdapter.get(FutureAdapter.java:55)
>        at hudson.Proc$RemoteProc.join(Proc.java:304)
>        ... 12 more
> Caused by: hudson.remoting.RequestAbortedException: java.io.EOFException
>        at hudson.remoting.Request.abort(Request.java:257)
>        at hudson.remoting.Channel.terminate(Channel.java:598)
>        at hudson.remoting.Channel$ReaderThread.run(Channel.java:876)
> Caused by: java.io.EOFException
>        at java.io.ObjectInputStream$BlockDataInputStream.peekByte(ObjectInputStream.java:2554)
>        at java.io.ObjectInputStream.readObject0(ObjectInputStream.java:1297)
>        at java.io.ObjectInputStream.readObject(ObjectInputStream.java:351)
>        at hudson.remoting.Channel$ReaderThread.run(Channel.java:856)
> FATAL: Unable to delete script file /var/tmp/hudson5856237721998656512.sh
> hudson.util.IOException2: remote file operation failed: /var/tmp/hudson5856237721998656512.sh
at hudson.remoting.Channel@1c33fa0:lucene.zones.apache.org (Solaris 10)
>        at hudson.FilePath.act(FilePath.java:743)
>        at hudson.FilePath.act(FilePath.java:729)
>        at hudson.FilePath.delete(FilePath.java:984)
>        at hudson.tasks.CommandInterpreter.perform(CommandInterpreter.java:93)
>        at hudson.tasks.CommandInterpreter.perform(CommandInterpreter.java:58)
>        at hudson.tasks.BuildStepMonitor$1.perform(BuildStepMonitor.java:19)
>        at hudson.model.AbstractBuild$AbstractRunner.perform(AbstractBuild.java:582)
>        at hudson.model.Build$RunnerImpl.build(Build.java:165)
>        at hudson.model.Build$RunnerImpl.doRun(Build.java:132)
>        at hudson.model.AbstractBuild$AbstractRunner.run(AbstractBuild.java:416)
>        at hudson.model.Run.run(Run.java:1243)
>        at hudson.model.FreeStyleBuild.run(FreeStyleBuild.java:46)
>        at hudson.model.ResourceController.execute(ResourceController.java:88)
>        at hudson.model.Executor.run(Executor.java:122)
> Caused by: hudson.remoting.ChannelClosedException: channel is already closed
>        at hudson.remoting.Channel.send(Channel.java:412)
>        at hudson.remoting.Request.call(Request.java:105)
>        at hudson.remoting.Channel.call(Channel.java:551)
>        at hudson.FilePath.act(FilePath.java:736)
>        ... 13 more
> FATAL: channel is already closed
> hudson.remoting.ChannelClosedException: channel is already closed
>        at hudson.remoting.Channel.send(Channel.java:412)
>        at hudson.remoting.Request.call(Request.java:105)
>        at hudson.remoting.Channel.call(Channel.java:551)
>        at hudson.Launcher$RemoteLauncher.kill(Launcher.java:735)
>        at hudson.model.AbstractBuild$AbstractRunner.run(AbstractBuild.java:421)
>        at hudson.model.Run.run(Run.java:1243)
>        at hudson.model.FreeStyleBuild.run(FreeStyleBuild.java:46)
>        at hudson.model.ResourceController.execute(ResourceController.java:88)
>        at hudson.model.Executor.run(Executor.java:122)
>
>
> ---------------------------------------------------------------------
> To unsubscribe, e-mail: dev-unsubscribe@lucene.apache.org
> For additional commands, e-mail: dev-help@lucene.apache.org
>
>

---------------------------------------------------------------------
To unsubscribe, e-mail: dev-unsubscribe@lucene.apache.org
For additional commands, e-mail: dev-help@lucene.apache.org


Mime
View raw message