lucene-dev mailing list archives

Site index · List index
Message view « Date » · « Thread »
Top « Date » · « Thread »
From Michael McCandless <luc...@mikemccandless.com>
Subject Re: Build failed in Hudson: Lucene-trunk #1218
Date Thu, 17 Jun 2010 10:55:56 GMT
OK I committed a fix -- it was a false failure (bug in the test).  Phew :)

Mike

On Thu, Jun 17, 2010 at 5:03 AM, Michael McCandless
<lucene@mikemccandless.com> wrote:
> This failure looks real!  Looks to be a thread safety issue in
> TestPayloads... I'll hunt it.
>
> Mike
>
> On Wed, Jun 16, 2010 at 10:13 PM, Apache Hudson Server
> <hudson@hudson.zones.apache.org> wrote:
>> See <http://hudson.zones.apache.org/hudson/job/Lucene-trunk/1218/changes>
>>
>> Changes:
>>
>> [mikemccand] LUCENE-2380: hard cutover of all preflex APIs to flex
>>
>> [mikemccand] LUCENE-2380: hard cutover of all preflex APIs to flex
>>
>> [rmuir] LUCENE-2413: directory and package fixes
>>
>> [rmuir] LUCENE-2413: directory and package fixes
>>
>> [rmuir] correct eol-style
>>
>> ------------------------------------------
>> [...truncated 3346 lines...]
>>    [junit] Tests run: 2, Failures: 0, Errors: 0, Time elapsed: 0.02 sec
>>    [junit]
>>    [junit] Testsuite: org.apache.lucene.search.TestPositiveScoresOnlyCollector
>>    [junit] Tests run: 1, Failures: 0, Errors: 0, Time elapsed: 0.004 sec
>>    [junit]
>>    [junit] Testsuite: org.apache.lucene.search.TestPrefixFilter
>>    [junit] Tests run: 1, Failures: 0, Errors: 0, Time elapsed: 0.006 sec
>>    [junit]
>>    [junit] Testsuite: org.apache.lucene.search.TestPrefixInBooleanQuery
>>    [junit] Tests run: 4, Failures: 0, Errors: 0, Time elapsed: 0.187 sec
>>    [junit]
>>    [junit] Testsuite: org.apache.lucene.search.TestPrefixQuery
>>    [junit] Tests run: 1, Failures: 0, Errors: 0, Time elapsed: 0.005 sec
>>    [junit]
>>    [junit] Testsuite: org.apache.lucene.search.TestQueryTermVector
>>    [junit] Tests run: 1, Failures: 0, Errors: 0, Time elapsed: 0.006 sec
>>    [junit]
>>    [junit] Testsuite: org.apache.lucene.search.TestQueryWrapperFilter
>>    [junit] Tests run: 1, Failures: 0, Errors: 0, Time elapsed: 0.008 sec
>>    [junit]
>>    [junit] Testsuite: org.apache.lucene.search.TestRegexpQuery
>>    [junit] Tests run: 7, Failures: 0, Errors: 0, Time elapsed: 0.028 sec
>>    [junit]
>>    [junit] Testsuite: org.apache.lucene.search.TestRegexpRandom
>>    [junit] Tests run: 1, Failures: 0, Errors: 0, Time elapsed: 9.067 sec
>>    [junit]
>>    [junit] Testsuite: org.apache.lucene.search.TestRegexpRandom2
>>    [junit] Tests run: 1, Failures: 0, Errors: 0, Time elapsed: 10.734 sec
>>    [junit]
>>    [junit] Testsuite: org.apache.lucene.search.TestScoreCachingWrappingScorer
>>    [junit] Tests run: 1, Failures: 0, Errors: 0, Time elapsed: 0.004 sec
>>    [junit]
>>    [junit] Testsuite: org.apache.lucene.search.TestScorerPerf
>>    [junit] Tests run: 1, Failures: 0, Errors: 0, Time elapsed: 1.619 sec
>>    [junit]
>>    [junit] Testsuite: org.apache.lucene.search.TestSetNorm
>>    [junit] Tests run: 1, Failures: 0, Errors: 0, Time elapsed: 0.005 sec
>>    [junit]
>>    [junit] Testsuite: org.apache.lucene.search.TestSimilarity
>>    [junit] Tests run: 1, Failures: 0, Errors: 0, Time elapsed: 0.006 sec
>>    [junit]
>>    [junit] Testsuite: org.apache.lucene.search.TestSimpleExplanations
>>    [junit] Tests run: 53, Failures: 0, Errors: 0, Time elapsed: 2.156 sec
>>    [junit]
>>    [junit] Testsuite: org.apache.lucene.search.TestSimpleExplanationsOfNonMatches
>>    [junit] Tests run: 53, Failures: 0, Errors: 0, Time elapsed: 0.12 sec
>>    [junit]
>>    [junit] Testsuite: org.apache.lucene.search.TestSloppyPhraseQuery
>>    [junit] Tests run: 5, Failures: 0, Errors: 0, Time elapsed: 0.212 sec
>>    [junit]
>>    [junit] Testsuite: org.apache.lucene.search.TestSort
>>    [junit] Tests run: 23, Failures: 0, Errors: 0, Time elapsed: 4.351 sec
>>    [junit]
>>    [junit] Testsuite: org.apache.lucene.search.TestSpanQueryFilter
>>    [junit] Tests run: 1, Failures: 0, Errors: 0, Time elapsed: 0.01 sec
>>    [junit]
>>    [junit] Testsuite: org.apache.lucene.search.TestTermRangeFilter
>>    [junit] Tests run: 7, Failures: 0, Errors: 0, Time elapsed: 4.126 sec
>>    [junit]
>>    [junit] Testsuite: org.apache.lucene.search.TestTermRangeQuery
>>    [junit] Tests run: 11, Failures: 0, Errors: 0, Time elapsed: 0.035 sec
>>    [junit]
>>    [junit] Testsuite: org.apache.lucene.search.TestTermScorer
>>    [junit] Tests run: 3, Failures: 0, Errors: 0, Time elapsed: 0.009 sec
>>    [junit]
>>    [junit] Testsuite: org.apache.lucene.search.TestTermVectors
>>    [junit] Tests run: 8, Failures: 0, Errors: 0, Time elapsed: 0.173 sec
>>    [junit]
>>    [junit] Testsuite: org.apache.lucene.search.TestThreadSafe
>>    [junit] Tests run: 1, Failures: 0, Errors: 0, Time elapsed: 5.533 sec
>>    [junit]
>>    [junit] Testsuite: org.apache.lucene.search.TestTimeLimitingCollector
>>    [junit] Tests run: 6, Failures: 0, Errors: 0, Time elapsed: 1.046 sec
>>    [junit]
>>    [junit] Testsuite: org.apache.lucene.search.TestTopDocsCollector
>>    [junit] Tests run: 8, Failures: 0, Errors: 0, Time elapsed: 0.013 sec
>>    [junit]
>>    [junit] Testsuite: org.apache.lucene.search.TestTopScoreDocCollector
>>    [junit] Tests run: 1, Failures: 0, Errors: 0, Time elapsed: 0.004 sec
>>    [junit]
>>    [junit] Testsuite: org.apache.lucene.search.TestWildcard
>>    [junit] Tests run: 7, Failures: 0, Errors: 0, Time elapsed: 0.037 sec
>>    [junit]
>>    [junit] Testsuite: org.apache.lucene.search.TestWildcardRandom
>>    [junit] Tests run: 1, Failures: 0, Errors: 0, Time elapsed: 7.7 sec
>>    [junit]
>>    [junit] Testsuite: org.apache.lucene.search.function.TestCustomScoreQuery
>>    [junit] Tests run: 6, Failures: 0, Errors: 0, Time elapsed: 7.116 sec
>>    [junit]
>>    [junit] Testsuite: org.apache.lucene.search.function.TestDocValues
>>    [junit] Tests run: 3, Failures: 0, Errors: 0, Time elapsed: 0.006 sec
>>    [junit]
>>    [junit] Testsuite: org.apache.lucene.search.function.TestFieldScoreQuery
>>    [junit] Tests run: 12, Failures: 0, Errors: 0, Time elapsed: 0.309 sec
>>    [junit]
>>    [junit] Testsuite: org.apache.lucene.search.function.TestOrdValues
>>    [junit] Tests run: 6, Failures: 0, Errors: 0, Time elapsed: 0.126 sec
>>    [junit]
>>    [junit] Testsuite: org.apache.lucene.search.function.TestValueSource
>>    [junit] Tests run: 1, Failures: 0, Errors: 0, Time elapsed: 0.031 sec
>>    [junit]
>>    [junit] Testsuite: org.apache.lucene.search.payloads.TestPayloadNearQuery
>>    [junit] Tests run: 4, Failures: 0, Errors: 0, Time elapsed: 0.746 sec
>>    [junit]
>>    [junit] Testsuite: org.apache.lucene.search.payloads.TestPayloadTermQuery
>>    [junit] Tests run: 6, Failures: 0, Errors: 0, Time elapsed: 0.739 sec
>>    [junit]
>>    [junit] Testsuite: org.apache.lucene.search.spans.TestBasics
>>    [junit] Tests run: 20, Failures: 0, Errors: 0, Time elapsed: 5.714 sec
>>    [junit]
>>    [junit] Testsuite: org.apache.lucene.search.spans.TestFieldMaskingSpanQuery
>>    [junit] Tests run: 11, Failures: 0, Errors: 0, Time elapsed: 0.44 sec
>>    [junit]
>>    [junit] Testsuite: org.apache.lucene.search.spans.TestNearSpansOrdered
>>    [junit] Tests run: 10, Failures: 0, Errors: 0, Time elapsed: 0.042 sec
>>    [junit]
>>    [junit] Testsuite: org.apache.lucene.search.spans.TestPayloadSpans
>>    [junit] Tests run: 10, Failures: 0, Errors: 0, Time elapsed: 0.88 sec
>>    [junit]
>>    [junit] Testsuite: org.apache.lucene.search.spans.TestSpanExplanations
>>    [junit] Tests run: 31, Failures: 0, Errors: 0, Time elapsed: 0.923 sec
>>    [junit]
>>    [junit] Testsuite: org.apache.lucene.search.spans.TestSpanExplanationsOfNonMatches
>>    [junit] Tests run: 31, Failures: 0, Errors: 0, Time elapsed: 0.06 sec
>>    [junit]
>>    [junit] Testsuite: org.apache.lucene.search.spans.TestSpans
>>    [junit] Tests run: 25, Failures: 0, Errors: 0, Time elapsed: 0.365 sec
>>    [junit]
>>    [junit] Testsuite: org.apache.lucene.search.spans.TestSpansAdvanced
>>    [junit] Tests run: 1, Failures: 0, Errors: 0, Time elapsed: 0.047 sec
>>    [junit]
>>    [junit] Testsuite: org.apache.lucene.search.spans.TestSpansAdvanced2
>>    [junit] Tests run: 4, Failures: 0, Errors: 0, Time elapsed: 0.095 sec
>>    [junit]
>>    [junit] Testsuite: org.apache.lucene.store.TestBufferedIndexInput
>>    [junit] Tests run: 4, Failures: 0, Errors: 0, Time elapsed: 3.016 sec
>>    [junit]
>>    [junit] Testsuite: org.apache.lucene.store.TestDirectory
>>    [junit] Tests run: 7, Failures: 0, Errors: 0, Time elapsed: 0.018 sec
>>    [junit]
>>    [junit] Testsuite: org.apache.lucene.store.TestFileSwitchDirectory
>>    [junit] Tests run: 1, Failures: 0, Errors: 0, Time elapsed: 0.01 sec
>>    [junit]
>>    [junit] Testsuite: org.apache.lucene.store.TestHugeRamFile
>>    [junit] Tests run: 1, Failures: 0, Errors: 0, Time elapsed: 3.553 sec
>>    [junit]
>>    [junit] Testsuite: org.apache.lucene.store.TestLock
>>    [junit] Tests run: 1, Failures: 0, Errors: 0, Time elapsed: 0.014 sec
>>    [junit]
>>    [junit] Testsuite: org.apache.lucene.store.TestLockFactory
>>    [junit] Tests run: 11, Failures: 0, Errors: 0, Time elapsed: 3.06 sec
>>    [junit]
>>    [junit] Testsuite: org.apache.lucene.store.TestRAMDirectory
>>    [junit] Tests run: 4, Failures: 0, Errors: 0, Time elapsed: 0.068 sec
>>    [junit]
>>    [junit] Testsuite: org.apache.lucene.store.TestWindowsMMap
>>    [junit] Tests run: 1, Failures: 0, Errors: 0, Time elapsed: 0.068 sec
>>    [junit]
>>    [junit] Testsuite: org.apache.lucene.util.TestArrayUtil
>>    [junit] Tests run: 5, Failures: 0, Errors: 0, Time elapsed: 0.031 sec
>>    [junit]
>>    [junit] Testsuite: org.apache.lucene.util.TestAttributeSource
>>    [junit] Tests run: 5, Failures: 0, Errors: 0, Time elapsed: 0.007 sec
>>    [junit]
>>    [junit] Testsuite: org.apache.lucene.util.TestBitVector
>>    [junit] Tests run: 7, Failures: 0, Errors: 0, Time elapsed: 1.577 sec
>>    [junit]
>>    [junit] Testsuite: org.apache.lucene.util.TestCharacterUtils
>>    [junit] Tests run: 7, Failures: 0, Errors: 0, Time elapsed: 0.007 sec
>>    [junit]
>>    [junit] Testsuite: org.apache.lucene.util.TestCloseableThreadLocal
>>    [junit] Tests run: 3, Failures: 0, Errors: 0, Time elapsed: 0.004 sec
>>    [junit]
>>    [junit] Testsuite: org.apache.lucene.util.TestDoubleBarrelLRUCache
>>    [junit] Tests run: 2, Failures: 0, Errors: 0, Time elapsed: 1.017 sec
>>    [junit]
>>    [junit] Testsuite: org.apache.lucene.util.TestFieldCacheSanityChecker
>>    [junit] Tests run: 4, Failures: 0, Errors: 0, Time elapsed: 0.265 sec
>>    [junit]
>>    [junit] Testsuite: org.apache.lucene.util.TestIndexableBinaryStringTools
>>    [junit] Tests run: 10, Failures: 0, Errors: 0, Time elapsed: 13.272 sec
>>    [junit]
>>    [junit] Testsuite: org.apache.lucene.util.TestNumericUtils
>>    [junit] Tests run: 8, Failures: 0, Errors: 0, Time elapsed: 0.499 sec
>>    [junit]
>>    [junit] Testsuite: org.apache.lucene.util.TestOpenBitSet
>>    [junit] Tests run: 5, Failures: 0, Errors: 0, Time elapsed: 6.277 sec
>>    [junit]
>>    [junit] Testsuite: org.apache.lucene.util.TestPriorityQueue
>>    [junit] Tests run: 4, Failures: 0, Errors: 0, Time elapsed: 0.052 sec
>>    [junit]
>>    [junit] Testsuite: org.apache.lucene.util.TestRamUsageEstimator
>>    [junit] Tests run: 1, Failures: 0, Errors: 0, Time elapsed: 0.004 sec
>>    [junit]
>>    [junit] Testsuite: org.apache.lucene.util.TestSetOnce
>>    [junit] Tests run: 4, Failures: 0, Errors: 0, Time elapsed: 0.046 sec
>>    [junit]
>>    [junit] Testsuite: org.apache.lucene.util.TestSmallFloat
>>    [junit] Tests run: 2, Failures: 0, Errors: 0, Time elapsed: 0.141 sec
>>    [junit]
>>    [junit] Testsuite: org.apache.lucene.util.TestSortedVIntList
>>    [junit] Tests run: 19, Failures: 0, Errors: 0, Time elapsed: 0.025 sec
>>    [junit]
>>    [junit] Testsuite: org.apache.lucene.util.TestStringHelper
>>    [junit] Tests run: 1, Failures: 0, Errors: 0, Time elapsed: 0.003 sec
>>    [junit]
>>    [junit] Testsuite: org.apache.lucene.util.TestStringIntern
>>    [junit] Tests run: 1, Failures: 0, Errors: 0, Time elapsed: 26.731 sec
>>    [junit]
>>    [junit] Testsuite: org.apache.lucene.util.TestUnicodeUtil
>>    [junit] Tests run: 4, Failures: 0, Errors: 0, Time elapsed: 0.606 sec
>>    [junit]
>>    [junit] Testsuite: org.apache.lucene.util.TestVersion
>>    [junit] Tests run: 1, Failures: 0, Errors: 0, Time elapsed: 0.003 sec
>>    [junit]
>>    [junit] Testsuite: org.apache.lucene.util.TestVirtualMethod
>>    [junit] Tests run: 2, Failures: 0, Errors: 0, Time elapsed: 0.006 sec
>>    [junit]
>>    [junit] Testsuite: org.apache.lucene.util.automaton.TestBasicOperations
>>    [junit] Tests run: 6, Failures: 0, Errors: 0, Time elapsed: 0.339 sec
>>    [junit]
>>    [junit] Testsuite: org.apache.lucene.util.automaton.TestDeterminism
>>    [junit] Tests run: 1, Failures: 0, Errors: 0, Time elapsed: 0.621 sec
>>    [junit]
>>    [junit] Testsuite: org.apache.lucene.util.automaton.TestDeterminizeLexicon
>>    [junit] Tests run: 1, Failures: 0, Errors: 0, Time elapsed: 15.883 sec
>>    [junit]
>>    [junit] Testsuite: org.apache.lucene.util.automaton.TestLevenshteinAutomata
>>    [junit] Tests run: 3, Failures: 0, Errors: 0, Time elapsed: 0.829 sec
>>    [junit]
>>    [junit] Testsuite: org.apache.lucene.util.automaton.TestUTF32ToUTF8
>>    [junit] Tests run: 5, Failures: 0, Errors: 0, Time elapsed: 4.589 sec
>>    [junit]
>>    [junit] Testsuite: org.apache.lucene.util.packed.TestPackedInts
>>    [junit] Tests run: 7, Failures: 0, Errors: 0, Time elapsed: 3.838 sec
>>    [junit]
>>    [junit] Tests FAILED
>>
>> BUILD FAILED
>> <http://hudson.zones.apache.org/hudson/job/Lucene-trunk/ws/lucene/common-build.xml>:485:
The following error occurred while executing this line:
>> <http://hudson.zones.apache.org/hudson/job/Lucene-trunk/ws/lucene/common-build.xml>:474:
Tests failed!
>>
>> Total time: 7 minutes 56 seconds
>> [TASKS] Skipping publisher since build result is FAILURE
>> Publishing Javadoc
>> Archiving artifacts
>> Recording test results
>> Publishing Clover coverage report...
>> No Clover report will be published due to a Build Failure
>>
>>
>> ---------------------------------------------------------------------
>> To unsubscribe, e-mail: dev-unsubscribe@lucene.apache.org
>> For additional commands, e-mail: dev-help@lucene.apache.org
>>
>>
>

---------------------------------------------------------------------
To unsubscribe, e-mail: dev-unsubscribe@lucene.apache.org
For additional commands, e-mail: dev-help@lucene.apache.org


Mime
View raw message