lucene-dev mailing list archives

Site index · List index
Message view « Date » · « Thread »
Top « Date » · « Thread »
From Apache Hudson Server <hud...@hudson.zones.apache.org>
Subject Build failed in Hudson: Lucene-3.x #51
Date Thu, 24 Jun 2010 23:27:05 GMT
See <http://hudson.zones.apache.org/hudson/job/Lucene-3.x/51/>

------------------------------------------
Started by timer
Building remotely on lucene.zones.apache.org (Solaris 10)
Checking out http://svn.apache.org/repos/asf/lucene/dev/branches/branch_3x/lucene
ERROR: Failed to check out http://svn.apache.org/repos/asf/lucene/dev/branches/branch_3x/lucene
org.tmatesoft.svn.core.SVNException: svn: Invalid argument
svn: OPTIONS request failed on '/repos/asf/lucene/dev/branches/branch_3x/lucene'
	at org.tmatesoft.svn.core.internal.wc.SVNErrorManager.error(SVNErrorManager.java:103)
	at org.tmatesoft.svn.core.internal.wc.SVNErrorManager.error(SVNErrorManager.java:87)
	at org.tmatesoft.svn.core.internal.io.dav.http.HTTPConnection.request(HTTPConnection.java:616)
	at org.tmatesoft.svn.core.internal.io.dav.http.HTTPConnection.request(HTTPConnection.java:273)
	at org.tmatesoft.svn.core.internal.io.dav.http.HTTPConnection.request(HTTPConnection.java:261)
	at org.tmatesoft.svn.core.internal.io.dav.DAVConnection.exchangeCapabilities(DAVConnection.java:516)
	at org.tmatesoft.svn.core.internal.io.dav.DAVConnection.open(DAVConnection.java:98)
	at org.tmatesoft.svn.core.internal.io.dav.DAVRepository.openConnection(DAVRepository.java:1001)
	at org.tmatesoft.svn.core.internal.io.dav.DAVRepository.getLatestRevision(DAVRepository.java:178)
	at org.tmatesoft.svn.core.wc.SVNBasicClient.getRevisionNumber(SVNBasicClient.java:482)
	at org.tmatesoft.svn.core.wc.SVNBasicClient.getLocations(SVNBasicClient.java:851)
	at org.tmatesoft.svn.core.wc.SVNBasicClient.createRepository(SVNBasicClient.java:534)
	at org.tmatesoft.svn.core.wc.SVNUpdateClient.doCheckout(SVNUpdateClient.java:893)
	at hudson.scm.SubversionSCM$CheckOutTask.invoke(SubversionSCM.java:740)
	at hudson.scm.SubversionSCM$CheckOutTask.invoke(SubversionSCM.java:660)
	at hudson.FilePath$FileCallableWrapper.call(FilePath.java:2018)
	at hudson.remoting.UserRequest.perform(UserRequest.java:114)
	at hudson.remoting.UserRequest.perform(UserRequest.java:48)
	at hudson.remoting.Request$2.run(Request.java:270)
	at java.util.concurrent.Executors$RunnableAdapter.call(Executors.java:441)
	at java.util.concurrent.FutureTask$Sync.innerRun(FutureTask.java:303)
	at java.util.concurrent.FutureTask.run(FutureTask.java:138)
	at java.util.concurrent.ThreadPoolExecutor$Worker.runTask(ThreadPoolExecutor.java:886)
	at java.util.concurrent.ThreadPoolExecutor$Worker.run(ThreadPoolExecutor.java:908)
	at java.lang.Thread.run(Thread.java:619)
Caused by: java.net.SocketException: Invalid argument
	at java.net.PlainSocketImpl.socketSetOption(Native Method)
	at java.net.PlainSocketImpl.setOption(PlainSocketImpl.java:264)
	at java.net.Socket.setReuseAddress(Socket.java:1307)
	at org.tmatesoft.svn.core.internal.util.SVNSocketFactory.createPlainSocket(SVNSocketFactory.java:58)
	at org.tmatesoft.svn.core.internal.io.dav.http.HTTPConnection.connect(HTTPConnection.java:183)
	at org.tmatesoft.svn.core.internal.io.dav.http.HTTPConnection.request(HTTPConnection.java:323)
	... 22 more
[TASKS] Skipping publisher since build result is FAILURE
Publishing Javadoc
Archiving artifacts
Recording test results
Publishing Clover coverage report...
No Clover report will be published due to a Build Failure


---------------------------------------------------------------------
To unsubscribe, e-mail: dev-unsubscribe@lucene.apache.org
For additional commands, e-mail: dev-help@lucene.apache.org


Mime
View raw message