lucene-dev mailing list archives

Site index · List index
Message view « Date » · « Thread »
Top « Date » · « Thread »
From Michael McCandless <luc...@mikemccandless.com>
Subject Re: Build failed in Hudson: Lucene-trunk #1181
Date Sat, 08 May 2010 07:28:49 GMT
This test failure is caused by a known bug in Java:

http://bugs.sun.com/bugdatabase/view_bug.do?bug_id=6588260

We are working around it (avoiding this Java API) in the pending fix
on https://issues.apache.org/jira/browse/LUCENE-2449...

Mike

On Fri, May 7, 2010 at 10:17 PM, Apache Hudson Server
<hudson@hudson.zones.apache.org> wrote:
> See <http://hudson.zones.apache.org/hudson/job/Lucene-trunk/1181/changes>
>
> Changes:
>
> [rmuir] fix the compile target... this never worked for contrib/analyzers before either
>
> [rmuir] LUCENE-2437: Indonesian Analyzer
>
> [rmuir] LUCENE-2437: Indonesian Analyzer
>
> [mikemccand] LUCENE-2451: remove dead code in oal.util.cache; keep only DBLRUCache
>
> ------------------------------------------
> [...truncated 3382 lines...]
>    [junit]
>    [junit] Testsuite: org.apache.lucene.search.TestQueryTermVector
>    [junit] Tests run: 1, Failures: 0, Errors: 0, Time elapsed: 0.006 sec
>    [junit]
>    [junit] Testsuite: org.apache.lucene.search.TestQueryWrapperFilter
>    [junit] Tests run: 1, Failures: 0, Errors: 0, Time elapsed: 0.011 sec
>    [junit]
>    [junit] Testsuite: org.apache.lucene.search.TestRegexpQuery
>    [junit] Tests run: 8, Failures: 0, Errors: 0, Time elapsed: 0.068 sec
>    [junit]
>    [junit] Testsuite: org.apache.lucene.search.TestRegexpRandom
>    [junit] Tests run: 1, Failures: 0, Errors: 0, Time elapsed: 2.345 sec
>    [junit]
>    [junit] Testsuite: org.apache.lucene.search.TestRegexpRandom2
>    [junit] Tests run: 1, Failures: 0, Errors: 0, Time elapsed: 4.907 sec
>    [junit]
>    [junit] Testsuite: org.apache.lucene.search.TestScoreCachingWrappingScorer
>    [junit] Tests run: 1, Failures: 0, Errors: 0, Time elapsed: 0.009 sec
>    [junit]
>    [junit] Testsuite: org.apache.lucene.search.TestScorerPerf
>    [junit] Tests run: 1, Failures: 0, Errors: 0, Time elapsed: 1.427 sec
>    [junit]
>    [junit] Testsuite: org.apache.lucene.search.TestSetNorm
>    [junit] Tests run: 1, Failures: 0, Errors: 0, Time elapsed: 0.006 sec
>    [junit]
>    [junit] Testsuite: org.apache.lucene.search.TestSimilarity
>    [junit] Tests run: 1, Failures: 0, Errors: 0, Time elapsed: 0.008 sec
>    [junit]
>    [junit] Testsuite: org.apache.lucene.search.TestSimpleExplanations
>    [junit] Tests run: 53, Failures: 0, Errors: 0, Time elapsed: 4.46 sec
>    [junit]
>    [junit] Testsuite: org.apache.lucene.search.TestSimpleExplanationsOfNonMatches
>    [junit] Tests run: 53, Failures: 0, Errors: 0, Time elapsed: 0.125 sec
>    [junit]
>    [junit] Testsuite: org.apache.lucene.search.TestSloppyPhraseQuery
>    [junit] Tests run: 5, Failures: 0, Errors: 0, Time elapsed: 0.334 sec
>    [junit]
>    [junit] Testsuite: org.apache.lucene.search.TestSort
>    [junit] Tests run: 22, Failures: 0, Errors: 0, Time elapsed: 2.536 sec
>    [junit]
>    [junit] Testsuite: org.apache.lucene.search.TestSpanQueryFilter
>    [junit] Tests run: 1, Failures: 0, Errors: 0, Time elapsed: 0.021 sec
>    [junit]
>    [junit] Testsuite: org.apache.lucene.search.TestTermRangeFilter
>    [junit] Tests run: 7, Failures: 0, Errors: 0, Time elapsed: 3.724 sec
>    [junit]
>    [junit] Testsuite: org.apache.lucene.search.TestTermRangeQuery
>    [junit] Tests run: 12, Failures: 0, Errors: 0, Time elapsed: 0.042 sec
>    [junit]
>    [junit] Testsuite: org.apache.lucene.search.TestTermScorer
>    [junit] Tests run: 3, Failures: 0, Errors: 0, Time elapsed: 0.01 sec
>    [junit]
>    [junit] Testsuite: org.apache.lucene.search.TestTermVectors
>    [junit] Tests run: 8, Failures: 0, Errors: 0, Time elapsed: 0.186 sec
>    [junit]
>    [junit] Testsuite: org.apache.lucene.search.TestThreadSafe
>    [junit] Tests run: 1, Failures: 0, Errors: 0, Time elapsed: 20.934 sec
>    [junit]
>    [junit] Testsuite: org.apache.lucene.search.TestTimeLimitingCollector
>    [junit] Tests run: 6, Failures: 0, Errors: 0, Time elapsed: 1.299 sec
>    [junit]
>    [junit] Testsuite: org.apache.lucene.search.TestTopDocsCollector
>    [junit] Tests run: 8, Failures: 0, Errors: 0, Time elapsed: 0.012 sec
>    [junit]
>    [junit] Testsuite: org.apache.lucene.search.TestTopScoreDocCollector
>    [junit] Tests run: 1, Failures: 0, Errors: 0, Time elapsed: 0.005 sec
>    [junit]
>    [junit] Testsuite: org.apache.lucene.search.TestWildcard
>    [junit] Tests run: 9, Failures: 0, Errors: 0, Time elapsed: 0.042 sec
>    [junit]
>    [junit] Testsuite: org.apache.lucene.search.TestWildcardRandom
>    [junit] Tests run: 1, Failures: 0, Errors: 0, Time elapsed: 1.512 sec
>    [junit]
>    [junit] Testsuite: org.apache.lucene.search.function.TestCustomScoreQuery
>    [junit] Tests run: 6, Failures: 0, Errors: 0, Time elapsed: 16.189 sec
>    [junit]
>    [junit] Testsuite: org.apache.lucene.search.function.TestDocValues
>    [junit] Tests run: 3, Failures: 0, Errors: 0, Time elapsed: 0.007 sec
>    [junit]
>    [junit] Testsuite: org.apache.lucene.search.function.TestFieldScoreQuery
>    [junit] Tests run: 12, Failures: 0, Errors: 0, Time elapsed: 0.287 sec
>    [junit]
>    [junit] Testsuite: org.apache.lucene.search.function.TestOrdValues
>    [junit] Tests run: 6, Failures: 0, Errors: 0, Time elapsed: 0.352 sec
>    [junit]
>    [junit] Testsuite: org.apache.lucene.search.function.TestValueSource
>    [junit] Tests run: 1, Failures: 0, Errors: 0, Time elapsed: 0.317 sec
>    [junit]
>    [junit] Testsuite: org.apache.lucene.search.payloads.TestPayloadNearQuery
>    [junit] Tests run: 4, Failures: 0, Errors: 0, Time elapsed: 1.105 sec
>    [junit]
>    [junit] Testsuite: org.apache.lucene.search.payloads.TestPayloadTermQuery
>    [junit] Tests run: 6, Failures: 0, Errors: 0, Time elapsed: 3.397 sec
>    [junit]
>    [junit] Testsuite: org.apache.lucene.search.spans.TestBasics
>    [junit] Tests run: 20, Failures: 0, Errors: 0, Time elapsed: 14.718 sec
>    [junit]
>    [junit] Testsuite: org.apache.lucene.search.spans.TestFieldMaskingSpanQuery
>    [junit] Tests run: 11, Failures: 0, Errors: 0, Time elapsed: 0.795 sec
>    [junit]
>    [junit] Testsuite: org.apache.lucene.search.spans.TestNearSpansOrdered
>    [junit] Tests run: 10, Failures: 0, Errors: 0, Time elapsed: 0.053 sec
>    [junit]
>    [junit] Testsuite: org.apache.lucene.search.spans.TestPayloadSpans
>    [junit] Tests run: 10, Failures: 0, Errors: 0, Time elapsed: 1.393 sec
>    [junit]
>    [junit] Testsuite: org.apache.lucene.search.spans.TestSpanExplanations
>    [junit] Tests run: 31, Failures: 0, Errors: 0, Time elapsed: 2.255 sec
>    [junit]
>    [junit] Testsuite: org.apache.lucene.search.spans.TestSpanExplanationsOfNonMatches
>    [junit] Tests run: 31, Failures: 0, Errors: 0, Time elapsed: 0.106 sec
>    [junit]
>    [junit] Testsuite: org.apache.lucene.search.spans.TestSpans
>    [junit] Tests run: 25, Failures: 0, Errors: 0, Time elapsed: 0.534 sec
>    [junit]
>    [junit] Testsuite: org.apache.lucene.search.spans.TestSpansAdvanced
>    [junit] Tests run: 1, Failures: 0, Errors: 0, Time elapsed: 0.053 sec
>    [junit]
>    [junit] Testsuite: org.apache.lucene.search.spans.TestSpansAdvanced2
>    [junit] Tests run: 4, Failures: 0, Errors: 0, Time elapsed: 0.133 sec
>    [junit]
>    [junit] Testsuite: org.apache.lucene.store.TestBufferedIndexInput
>    [junit] Tests run: 4, Failures: 0, Errors: 0, Time elapsed: 7.118 sec
>    [junit]
>    [junit] Testsuite: org.apache.lucene.store.TestDirectory
>    [junit] Tests run: 7, Failures: 0, Errors: 0, Time elapsed: 0.34 sec
>    [junit]
>    [junit] Testsuite: org.apache.lucene.store.TestFileSwitchDirectory
>    [junit] Tests run: 1, Failures: 0, Errors: 0, Time elapsed: 0.042 sec
>    [junit]
>    [junit] Testsuite: org.apache.lucene.store.TestHugeRamFile
>    [junit] Tests run: 1, Failures: 0, Errors: 0, Time elapsed: 4.494 sec
>    [junit]
>    [junit] Testsuite: org.apache.lucene.store.TestLock
>    [junit] Tests run: 1, Failures: 0, Errors: 0, Time elapsed: 0.014 sec
>    [junit]
>    [junit] Testsuite: org.apache.lucene.store.TestLockFactory
>    [junit] Tests run: 11, Failures: 0, Errors: 0, Time elapsed: 3.565 sec
>    [junit]
>    [junit] Testsuite: org.apache.lucene.store.TestRAMDirectory
>    [junit] Tests run: 4, Failures: 0, Errors: 0, Time elapsed: 0.093 sec
>    [junit]
>    [junit] Testsuite: org.apache.lucene.store.TestWindowsMMap
>    [junit] Tests run: 1, Failures: 0, Errors: 0, Time elapsed: 0.048 sec
>    [junit]
>    [junit] Testsuite: org.apache.lucene.util.TestArrayUtil
>    [junit] Tests run: 5, Failures: 0, Errors: 0, Time elapsed: 0.014 sec
>    [junit]
>    [junit] Testsuite: org.apache.lucene.util.TestAttributeSource
>    [junit] Tests run: 5, Failures: 0, Errors: 0, Time elapsed: 0.03 sec
>    [junit]
>    [junit] Testsuite: org.apache.lucene.util.TestBitVector
>    [junit] Tests run: 7, Failures: 0, Errors: 0, Time elapsed: 2.196 sec
>    [junit]
>    [junit] Testsuite: org.apache.lucene.util.TestCharacterUtils
>    [junit] Tests run: 7, Failures: 0, Errors: 0, Time elapsed: 0.009 sec
>    [junit]
>    [junit] Testsuite: org.apache.lucene.util.TestCloseableThreadLocal
>    [junit] Tests run: 3, Failures: 0, Errors: 0, Time elapsed: 0.018 sec
>    [junit]
>    [junit] Testsuite: org.apache.lucene.util.TestFieldCacheSanityChecker
>    [junit] Tests run: 4, Failures: 0, Errors: 0, Time elapsed: 0.257 sec
>    [junit]
>    [junit] Testsuite: org.apache.lucene.util.TestIndexableBinaryStringTools
>    [junit] Tests run: 10, Failures: 0, Errors: 0, Time elapsed: 2.691 sec
>    [junit]
>    [junit] Testsuite: org.apache.lucene.util.TestNumericUtils
>    [junit] Tests run: 8, Failures: 0, Errors: 0, Time elapsed: 1.434 sec
>    [junit]
>    [junit] Testsuite: org.apache.lucene.util.TestOpenBitSet
>    [junit] Tests run: 5, Failures: 0, Errors: 0, Time elapsed: 5.654 sec
>    [junit]
>    [junit] Testsuite: org.apache.lucene.util.TestPriorityQueue
>    [junit] Tests run: 4, Failures: 0, Errors: 0, Time elapsed: 0.052 sec
>    [junit]
>    [junit] Testsuite: org.apache.lucene.util.TestRamUsageEstimator
>    [junit] Tests run: 1, Failures: 0, Errors: 0, Time elapsed: 0.023 sec
>    [junit]
>    [junit] Testsuite: org.apache.lucene.util.TestSetOnce
>    [junit] Tests run: 4, Failures: 0, Errors: 0, Time elapsed: 0.277 sec
>    [junit]
>    [junit] Testsuite: org.apache.lucene.util.TestSmallFloat
>    [junit] Tests run: 2, Failures: 0, Errors: 0, Time elapsed: 0.065 sec
>    [junit]
>    [junit] Testsuite: org.apache.lucene.util.TestSortedVIntList
>    [junit] Tests run: 19, Failures: 0, Errors: 0, Time elapsed: 0.026 sec
>    [junit]
>    [junit] Testsuite: org.apache.lucene.util.TestStringHelper
>    [junit] Tests run: 1, Failures: 0, Errors: 0, Time elapsed: 0.003 sec
>    [junit]
>    [junit] Testsuite: org.apache.lucene.util.TestStringIntern
>    [junit] Tests run: 1, Failures: 0, Errors: 0, Time elapsed: 29.499 sec
>    [junit]
>    [junit] Testsuite: org.apache.lucene.util.TestUnicodeUtil
>    [junit] Tests run: 3, Failures: 0, Errors: 0, Time elapsed: 0.332 sec
>    [junit]
>    [junit] Testsuite: org.apache.lucene.util.TestVersion
>    [junit] Tests run: 1, Failures: 0, Errors: 0, Time elapsed: 0.004 sec
>    [junit]
>    [junit] Testsuite: org.apache.lucene.util.TestVirtualMethod
>    [junit] Tests run: 2, Failures: 0, Errors: 0, Time elapsed: 0.009 sec
>    [junit]
>    [junit] Testsuite: org.apache.lucene.util.automaton.TestBasicOperations
>    [junit] Tests run: 6, Failures: 0, Errors: 0, Time elapsed: 0.143 sec
>    [junit]
>    [junit] Testsuite: org.apache.lucene.util.automaton.TestDeterminism
>    [junit] Tests run: 1, Failures: 0, Errors: 0, Time elapsed: 0.667 sec
>    [junit]
>    [junit] Testsuite: org.apache.lucene.util.automaton.TestDeterminizeLexicon
>    [junit] Tests run: 1, Failures: 0, Errors: 0, Time elapsed: 9.05 sec
>    [junit]
>    [junit] Testsuite: org.apache.lucene.util.automaton.TestLevenshteinAutomata
>    [junit] Tests run: 3, Failures: 0, Errors: 0, Time elapsed: 1.48 sec
>    [junit]
>    [junit] Testsuite: org.apache.lucene.util.automaton.TestUTF32ToUTF8
>    [junit] Testcase: testRandomRegexes(org.apache.lucene.util.automaton.TestUTF32ToUTF8):
     Caused an ERROR
>    [junit] 3001
>    [junit] java.lang.ArrayIndexOutOfBoundsException: 3001
>    [junit]     at java.lang.Character.toSurrogates(Character.java:2596)
>    [junit]     at java.lang.String.<init>(String.java:275)
>    [junit]     at org.apache.lucene.util.automaton.TestUTF32ToUTF8.assertAutomaton(TestUTF32ToUTF8.java:186)
>    [junit]     at org.apache.lucene.util.automaton.TestUTF32ToUTF8.testRandomRegexes(TestUTF32ToUTF8.java:170)
>    [junit]     at org.apache.lucene.util.LuceneTestCase.runBare(LuceneTestCase.java:276)
>    [junit]
>    [junit]
>    [junit] Tests run: 5, Failures: 0, Errors: 1, Time elapsed: 0.815 sec
>    [junit]
>    [junit] ------------- Standard Output ---------------
>    [junit] NOTE: random seed of testcase 'testRandomRegexes' was: 7110545739962103487
>    [junit] ------------- ---------------- ---------------
>    [junit] TEST org.apache.lucene.util.automaton.TestUTF32ToUTF8 FAILED
>    [junit] Testsuite: org.apache.lucene.util.cache.TestDoubleBarrelLRUCache
>    [junit] Tests run: 2, Failures: 0, Errors: 0, Time elapsed: 1.088 sec
>    [junit]
>    [junit] Testsuite: org.apache.lucene.util.packed.TestPackedInts
>    [junit] Tests run: 7, Failures: 0, Errors: 0, Time elapsed: 8.129 sec
>    [junit]
>    [junit] Tests FAILED
>
> BUILD FAILED
> <http://hudson.zones.apache.org/hudson/job/Lucene-trunk/ws/lucene/common-build.xml>:487:
The following error occurred while executing this line:
> <http://hudson.zones.apache.org/hudson/job/Lucene-trunk/ws/lucene/common-build.xml>:476:
Tests failed!
>
> Total time: 10 minutes 54 seconds
> Publishing Javadoc
> Archiving artifacts
> Recording test results
> Publishing Clover coverage report...
> No Clover report will be published due to a Build Failure
>
>
> ---------------------------------------------------------------------
> To unsubscribe, e-mail: dev-unsubscribe@lucene.apache.org
> For additional commands, e-mail: dev-help@lucene.apache.org
>
>

---------------------------------------------------------------------
To unsubscribe, e-mail: dev-unsubscribe@lucene.apache.org
For additional commands, e-mail: dev-help@lucene.apache.org


Mime
View raw message