lucene-dev mailing list archives

Site index · List index
Message view « Date » · « Thread »
Top « Date » · « Thread »
From Apache Hudson Server <hud...@hudson.zones.apache.org>
Subject Build failed in Hudson: Solr-trunk #1144
Date Sat, 08 May 2010 08:26:16 GMT
See <http://hudson.zones.apache.org/hudson/job/Solr-trunk/1144/changes>

Changes:

[hossman] SOLR-1843: new rootName attribute for <jmx /> configuration ... allows users
to override the top level name for MBeans when exposed via JMX.

[rmuir] SOLR-1865: ignore BOMs in SolrResourceLoader.getLines

[rmuir] fix the compile target... this never worked for contrib/analyzers before either

[rmuir] LUCENE-2437: Indonesian Analyzer

[hossman] adding news blurb about Apache Lucene Eurocon 2010

[mikemccand] LUCENE-2451: remove dead code in oal.util.cache; keep only DBLRUCache

------------------------------------------
[...truncated 6037 lines...]
    [junit] Tests run: 4, Failures: 0, Errors: 0, Time elapsed: 6.04 sec
    [junit] 
    [junit] Testsuite: org.apache.solr.handler.TestReplicationHandler
    [junit] Tests run: 7, Failures: 0, Errors: 0, Time elapsed: 76.433 sec
    [junit] 
    [junit] ------------- Standard Error -----------------
    [junit] May 8, 2010 8:19:06 AM org.apache.solr.handler.SnapPuller fetchLatestIndex
    [junit] SEVERE: Master at: http://localhost:40320/solr/replication is not available. Index
fetch failed. Exception: Connection refused
    [junit] May 8, 2010 8:19:07 AM org.apache.solr.handler.SnapPuller fetchLatestIndex
    [junit] SEVERE: Master at: http://localhost:40331/solr/replication is not available. Index
fetch failed. Exception: Connection refused
    [junit] May 8, 2010 8:19:08 AM org.apache.solr.handler.SnapPuller fetchLatestIndex
    [junit] SEVERE: Master at: http://localhost:40331/solr/replication is not available. Index
fetch failed. Exception: Connection refused
    [junit] May 8, 2010 8:19:09 AM org.apache.solr.handler.SnapPuller fetchLatestIndex
    [junit] SEVERE: Master at: http://localhost:40331/solr/replication is not available. Index
fetch failed. Exception: Connection refused
    [junit] May 8, 2010 8:19:10 AM org.apache.solr.handler.SnapPuller fetchLatestIndex
    [junit] SEVERE: Master at: http://localhost:40331/solr/replication is not available. Index
fetch failed. Exception: Connection refused
    [junit] May 8, 2010 8:19:11 AM org.apache.solr.handler.SnapPuller fetchLatestIndex
    [junit] SEVERE: Master at: http://localhost:40331/solr/replication is not available. Index
fetch failed. Exception: Connection refused
    [junit] May 8, 2010 8:19:12 AM org.apache.solr.handler.SnapPuller fetchLatestIndex
    [junit] SEVERE: Master at: http://localhost:40331/solr/replication is not available. Index
fetch failed. Exception: Connection refused
    [junit] May 8, 2010 8:19:13 AM org.apache.solr.handler.SnapPuller fetchLatestIndex
    [junit] SEVERE: Master at: http://localhost:40331/solr/replication is not available. Index
fetch failed. Exception: Connection refused
    [junit] ------------- ---------------- ---------------
    [junit] Testsuite: org.apache.solr.handler.XmlUpdateRequestHandlerTest
    [junit] Tests run: 1, Failures: 0, Errors: 0, Time elapsed: 3.122 sec
    [junit] 
    [junit] Testsuite: org.apache.solr.handler.admin.LukeRequestHandlerTest
    [junit] Tests run: 1, Failures: 0, Errors: 0, Time elapsed: 3.694 sec
    [junit] 
    [junit] Testsuite: org.apache.solr.handler.admin.SystemInfoHandlerTest
    [junit] Tests run: 1, Failures: 0, Errors: 0, Time elapsed: 0.472 sec
    [junit] 
    [junit] Testsuite: org.apache.solr.handler.component.DistributedSpellCheckComponentTest
    [junit] Tests run: 1, Failures: 0, Errors: 0, Time elapsed: 20.68 sec
    [junit] 
    [junit] Testsuite: org.apache.solr.handler.component.DistributedTermsComponentTest
    [junit] Tests run: 1, Failures: 0, Errors: 0, Time elapsed: 18.205 sec
    [junit] 
    [junit] Testsuite: org.apache.solr.handler.component.QueryElevationComponentTest
    [junit] Tests run: 4, Failures: 0, Errors: 0, Time elapsed: 3.343 sec
    [junit] 
    [junit] Testsuite: org.apache.solr.handler.component.SearchHandlerTest
    [junit] Tests run: 1, Failures: 0, Errors: 0, Time elapsed: 2.91 sec
    [junit] 
    [junit] Testsuite: org.apache.solr.handler.component.SpellCheckComponentTest
    [junit] Tests run: 8, Failures: 0, Errors: 0, Time elapsed: 5.258 sec
    [junit] 
    [junit] Testsuite: org.apache.solr.handler.component.StatsComponentTest
    [junit] Tests run: 1, Failures: 0, Errors: 0, Time elapsed: 7.676 sec
    [junit] 
    [junit] Testsuite: org.apache.solr.handler.component.TermVectorComponentTest
    [junit] Tests run: 4, Failures: 0, Errors: 0, Time elapsed: 3.706 sec
    [junit] 
    [junit] Testsuite: org.apache.solr.handler.component.TermsComponentTest
    [junit] Tests run: 13, Failures: 0, Errors: 0, Time elapsed: 3.488 sec
    [junit] 
    [junit] Testsuite: org.apache.solr.highlight.FastVectorHighlighterTest
    [junit] Tests run: 2, Failures: 0, Errors: 0, Time elapsed: 5.279 sec
    [junit] 
    [junit] Testsuite: org.apache.solr.highlight.HighlighterConfigTest
    [junit] Tests run: 1, Failures: 0, Errors: 0, Time elapsed: 3.232 sec
    [junit] 
    [junit] Testsuite: org.apache.solr.highlight.HighlighterTest
    [junit] Tests run: 23, Failures: 0, Errors: 0, Time elapsed: 6.362 sec
    [junit] 
    [junit] Testsuite: org.apache.solr.request.JSONWriterTest
    [junit] Tests run: 3, Failures: 0, Errors: 0, Time elapsed: 3.018 sec
    [junit] 
    [junit] Testsuite: org.apache.solr.request.SimpleFacetsLegacySortTest
    [junit] Tests run: 1, Failures: 0, Errors: 0, Time elapsed: 3.639 sec
    [junit] 
    [junit] Testsuite: org.apache.solr.request.SimpleFacetsTest
    [junit] Tests run: 8, Failures: 0, Errors: 0, Time elapsed: 11.115 sec
    [junit] 
    [junit] Testsuite: org.apache.solr.request.TestBinaryResponseWriter
    [junit] Tests run: 1, Failures: 0, Errors: 0, Time elapsed: 3.82 sec
    [junit] 
    [junit] Testsuite: org.apache.solr.request.TestFaceting
    [junit] Tests run: 3, Failures: 0, Errors: 0, Time elapsed: 15.299 sec
    [junit] 
    [junit] Testsuite: org.apache.solr.request.TestWriterPerf
    [junit] Tests run: 1, Failures: 0, Errors: 0, Time elapsed: 4.052 sec
    [junit] 
    [junit] ------------- Standard Output ---------------
    [junit] writer xml, size=6513, encodeRate=27, decodeRate=26
    [junit] writer json, size=3394, encodeRate=86, decodeRate=N/A
    [junit] writer javabin, size=1991, encodeRate=166, decodeRate=500
    [junit] ------------- ---------------- ---------------
    [junit] Testsuite: org.apache.solr.schema.BadIndexSchemaTest
    [junit] Tests run: 1, Failures: 0, Errors: 0, Time elapsed: 1.984 sec
    [junit] 
    [junit] Testsuite: org.apache.solr.schema.CopyFieldTest
    [junit] Tests run: 6, Failures: 0, Errors: 0, Time elapsed: 4.964 sec
    [junit] 
    [junit] Testsuite: org.apache.solr.schema.DateFieldTest
    [junit] Tests run: 6, Failures: 0, Errors: 0, Time elapsed: 0.524 sec
    [junit] 
    [junit] Testsuite: org.apache.solr.schema.IndexSchemaTest
    [junit] Tests run: 5, Failures: 0, Errors: 0, Time elapsed: 3.729 sec
    [junit] 
    [junit] Testsuite: org.apache.solr.schema.LegacyDateFieldTest
    [junit] Tests run: 4, Failures: 0, Errors: 0, Time elapsed: 0.499 sec
    [junit] 
    [junit] Testsuite: org.apache.solr.schema.NotRequiredUniqueKeyTest
    [junit] Tests run: 1, Failures: 0, Errors: 0, Time elapsed: 2.974 sec
    [junit] 
    [junit] ------------- Standard Error -----------------
    [junit] May 8, 2010 8:22:37 AM org.apache.solr.schema.IndexSchema readSchema
    [junit] SEVERE: uniqueKey should not be multivalued
    [junit] ------------- ---------------- ---------------
    [junit] Testsuite: org.apache.solr.schema.PolyFieldTest
    [junit] Tests run: 5, Failures: 0, Errors: 0, Time elapsed: 4.309 sec
    [junit] 
    [junit] Testsuite: org.apache.solr.schema.RequiredFieldsTest
    [junit] Tests run: 3, Failures: 0, Errors: 0, Time elapsed: 3.685 sec
    [junit] 
    [junit] ------------- Standard Error -----------------
    [junit] May 8, 2010 8:22:45 AM org.apache.solr.schema.IndexSchema readSchema
    [junit] SEVERE: uniqueKey should not be multivalued
    [junit] ------------- ---------------- ---------------
    [junit] Testsuite: org.apache.solr.schema.TestBinaryField
    [junit] Tests run: 1, Failures: 0, Errors: 0, Time elapsed: 3.518 sec
    [junit] 
    [junit] Testsuite: org.apache.solr.schema.UUIDFieldTest
    [junit] Tests run: 1, Failures: 0, Errors: 0, Time elapsed: 0.764 sec
    [junit] 
    [junit] Testsuite: org.apache.solr.search.FunctionQParserTest
    [junit] Tests run: 1, Failures: 0, Errors: 0, Time elapsed: 2.768 sec
    [junit] 
    [junit] Testsuite: org.apache.solr.search.QueryParsingTest
    [junit] Tests run: 2, Failures: 0, Errors: 0, Time elapsed: 3.774 sec
    [junit] 
    [junit] Testsuite: org.apache.solr.search.TestDocSet
    [junit] Tests run: 2, Failures: 0, Errors: 0, Time elapsed: 1.521 sec
    [junit] 
    [junit] Testsuite: org.apache.solr.search.TestExtendedDismaxParser
    [junit] Tests run: 1, Failures: 0, Errors: 0, Time elapsed: 3.547 sec
    [junit] 
    [junit] Testsuite: org.apache.solr.search.TestFastLRUCache
    [junit] Tests run: 6, Failures: 0, Errors: 0, Time elapsed: 0.537 sec
    [junit] 
    [junit] Testsuite: org.apache.solr.search.TestIndexSearcher
    [junit] Tests run: 1, Failures: 0, Errors: 0, Time elapsed: 2.614 sec
    [junit] 
    [junit] Testsuite: org.apache.solr.search.TestLRUCache
    [junit] Tests run: 3, Failures: 0, Errors: 0, Time elapsed: 0.478 sec
    [junit] 
    [junit] Testsuite: org.apache.solr.search.TestQueryTypes
    [junit] Tests run: 1, Failures: 0, Errors: 0, Time elapsed: 5.293 sec
    [junit] 
    [junit] Testsuite: org.apache.solr.search.TestQueryUtils
    [junit] Tests run: 1, Failures: 0, Errors: 0, Time elapsed: 5.014 sec
    [junit] 
    [junit] Testsuite: org.apache.solr.search.TestRangeQuery
    [junit] Tests run: 2, Failures: 0, Errors: 0, Time elapsed: 36.114 sec
    [junit] 
    [junit] Testsuite: org.apache.solr.search.TestSearchPerf
    [junit] Tests run: 1, Failures: 0, Errors: 0, Time elapsed: 3.06 sec
    [junit] 
    [junit] Testsuite: org.apache.solr.search.TestSort
    [junit] Tests run: 1, Failures: 0, Errors: 0, Time elapsed: 8.032 sec
    [junit] 
    [junit] Testsuite: org.apache.solr.search.function.SortByFunctionTest
    [junit] Tests run: 1, Failures: 0, Errors: 0, Time elapsed: 4.733 sec
    [junit] 
    [junit] Testsuite: org.apache.solr.search.function.TestFunctionQuery
    [junit] Tests run: 4, Failures: 0, Errors: 0, Time elapsed: 9.864 sec
    [junit] 
    [junit] Testsuite: org.apache.solr.search.function.distance.DistanceFunctionTest
    [junit] Tests run: 2, Failures: 0, Errors: 0, Time elapsed: 4.113 sec
    [junit] 
    [junit] Testsuite: org.apache.solr.servlet.CacheHeaderTest
    [junit] Tests run: 5, Failures: 0, Errors: 0, Time elapsed: 4.537 sec
    [junit] 
    [junit] Testsuite: org.apache.solr.servlet.DirectSolrConnectionTest
    [junit] Tests run: 2, Failures: 0, Errors: 0, Time elapsed: 2.893 sec
    [junit] 
    [junit] ------------- Standard Error -----------------
    [junit] May 8, 2010 8:24:46 AM org.apache.solr.schema.IndexSchema readSchema
    [junit] SEVERE: uniqueKey should not be multivalued
    [junit] May 8, 2010 8:24:48 AM org.apache.solr.schema.IndexSchema readSchema
    [junit] SEVERE: uniqueKey should not be multivalued
    [junit] ------------- ---------------- ---------------
    [junit] Testsuite: org.apache.solr.servlet.NoCacheHeaderTest
    [junit] Tests run: 3, Failures: 0, Errors: 0, Time elapsed: 5.016 sec
    [junit] 
    [junit] Testsuite: org.apache.solr.servlet.SolrRequestParserTest
    [junit] Tests run: 4, Failures: 0, Errors: 0, Time elapsed: 3.862 sec
    [junit] 
    [junit] Testsuite: org.apache.solr.spelling.FileBasedSpellCheckerTest
    [junit] Tests run: 3, Failures: 0, Errors: 0, Time elapsed: 3.237 sec
    [junit] 
    [junit] Testsuite: org.apache.solr.spelling.IndexBasedSpellCheckerTest
    [junit] Tests run: 4, Failures: 0, Errors: 0, Time elapsed: 4.167 sec
    [junit] 
    [junit] Testsuite: org.apache.solr.spelling.SpellingQueryConverterTest
    [junit] Tests run: 4, Failures: 0, Errors: 0, Time elapsed: 0.503 sec
    [junit] 
    [junit] Testsuite: org.apache.solr.update.AutoCommitTest
    [junit] Tests run: 1, Failures: 0, Errors: 0, Time elapsed: 6.304 sec
    [junit] 
    [junit] Testsuite: org.apache.solr.update.DirectUpdateHandlerOptimizeTest
    [junit] Tests run: 1, Failures: 0, Errors: 0, Time elapsed: 4.686 sec
    [junit] 
    [junit] Testsuite: org.apache.solr.update.DirectUpdateHandlerTest
    [junit] Tests run: 7, Failures: 0, Errors: 0, Time elapsed: 10.371 sec
    [junit] 
    [junit] Testsuite: org.apache.solr.update.DocumentBuilderTest
    [junit] Tests run: 3, Failures: 0, Errors: 0, Time elapsed: 5.452 sec
    [junit] 
    [junit] Testsuite: org.apache.solr.update.TestIndexingPerformance
    [junit] Tests run: 1, Failures: 0, Errors: 0, Time elapsed: 4.9 sec
    [junit] 
    [junit] ------------- Standard Output ---------------
    [junit] includeDoc=true doc=[text, simple, text, test, text, how now brown cow, text,
what's that?, text, radical!, text, what's all this about, anyway?, text, just how fast is
this text indexing?]
    [junit] iter=1000 time=1125 throughput=888
    [junit] ------------- ---------------- ---------------
    [junit] Testsuite: org.apache.solr.update.processor.SignatureUpdateProcessorFactoryTest
    [junit] Tests run: 2, Failures: 0, Errors: 0, Time elapsed: 7.106 sec
    [junit] 
    [junit] Testsuite: org.apache.solr.update.processor.UpdateRequestProcessorFactoryTest
    [junit] Tests run: 1, Failures: 0, Errors: 0, Time elapsed: 3.004 sec
    [junit] 
    [junit] Testsuite: org.apache.solr.util.DateMathParserTest
    [junit] Tests run: 7, Failures: 0, Errors: 0, Time elapsed: 0.511 sec
    [junit] 
    [junit] Testsuite: org.apache.solr.util.SolrPluginUtilsTest
    [junit] Tests run: 7, Failures: 0, Errors: 0, Time elapsed: 3.33 sec
    [junit] 
    [junit] Testsuite: org.apache.solr.util.TestNumberUtils
    [junit] Tests run: 1, Failures: 0, Errors: 0, Time elapsed: 1.53 sec
    [junit] 
    [junit] Testsuite: org.apache.solr.util.TestOpenBitSet
    [junit] Tests run: 3, Failures: 0, Errors: 0, Time elapsed: 1.578 sec
    [junit] 
    [junit] Testsuite: org.apache.solr.util.TestUtils
    [junit] Tests run: 3, Failures: 0, Errors: 0, Time elapsed: 0.472 sec
    [junit] 

BUILD FAILED
<http://hudson.zones.apache.org/hudson/job/Solr-trunk/ws/trunk/solr/build.xml>:390:
The following error occurred while executing this line:
<http://hudson.zones.apache.org/hudson/job/Solr-trunk/ws/trunk/solr/build.xml>:477:
Tests failed!

Total time: 19 minutes 5 seconds
Publishing Javadoc
Archiving artifacts
Recording test results
Publishing Clover coverage report...
No Clover report will be published due to a Build Failure


---------------------------------------------------------------------
To unsubscribe, e-mail: dev-unsubscribe@lucene.apache.org
For additional commands, e-mail: dev-help@lucene.apache.org


Mime
View raw message