lucene-dev mailing list archives

Site index · List index
Message view « Date » · « Thread »
Top « Date » · « Thread »
From Apache Hudson Server <hud...@hudson.zones.apache.org>
Subject Build failed in Hudson: Lucene-trunk #995
Date Sun, 01 Nov 2009 02:07:57 GMT
See <http://hudson.zones.apache.org/hudson/job/Lucene-trunk/995/>

------------------------------------------
[...truncated 3260 lines...]
javacc-notice:

jflex-uptodate-check:

jflex-notice:

common.init:

build-lucene:

build-lucene-tests:

init:

clover.setup:

clover.info:

clover:

common.compile-core:

compile-core:

compile:

check-files:

init:

clover.setup:

clover.info:

clover:

compile-core:

common.compile-test:
    [mkdir] Created dir: <http://hudson.zones.apache.org/hudson/job/Lucene-trunk/ws/trunk/build/contrib/benchmark/classes/test>
    [javac] Compiling 12 source files to <http://hudson.zones.apache.org/hudson/job/Lucene-trunk/ws/trunk/build/contrib/benchmark/classes/test>
     [copy] Copying 2 files to <http://hudson.zones.apache.org/hudson/job/Lucene-trunk/ws/trunk/build/contrib/benchmark/classes/test>

build-artifacts-and-tests:
     [echo] Building collation...

javacc-uptodate-check:

javacc-notice:

jflex-uptodate-check:

jflex-notice:

common.init:

compile-misc:
     [echo] Building misc...

javacc-uptodate-check:

javacc-notice:

jflex-uptodate-check:

jflex-notice:

common.init:

build-lucene:

build-lucene-tests:

init:

clover.setup:

clover.info:

clover:

compile-core:
    [mkdir] Created dir: <http://hudson.zones.apache.org/hudson/job/Lucene-trunk/ws/trunk/build/contrib/misc/classes/java>
    [javac] Compiling 20 source files to <http://hudson.zones.apache.org/hudson/job/Lucene-trunk/ws/trunk/build/contrib/misc/classes/java>
    [javac] Note: <http://hudson.zones.apache.org/hudson/job/Lucene-trunk/ws/trunk/contrib/misc/src/java/org/apache/lucene/queryParser/precedence/FastCharStream.java>
uses or overrides a deprecated API.
    [javac] Note: Recompile with -Xlint:deprecation for details.

compile:

init:

clover.setup:

clover.info:

clover:

compile-core:
    [mkdir] Created dir: <http://hudson.zones.apache.org/hudson/job/Lucene-trunk/ws/trunk/build/contrib/collation/classes/java>
    [javac] Compiling 4 source files to <http://hudson.zones.apache.org/hudson/job/Lucene-trunk/ws/trunk/build/contrib/collation/classes/java>

jar-core:
      [jar] Building jar: <http://hudson.zones.apache.org/hudson/job/Lucene-trunk/ws/trunk/build/contrib/collation/lucene-collation-3.0-SNAPSHOT.jar>

jar:

compile-test:
     [echo] Building collation...

javacc-uptodate-check:

javacc-notice:

jflex-uptodate-check:

jflex-notice:

common.init:

compile-misc:
     [echo] Building misc...

javacc-uptodate-check:

javacc-notice:

jflex-uptodate-check:

jflex-notice:

common.init:

build-lucene:

build-lucene-tests:

init:

clover.setup:

clover.info:

clover:

compile-core:

compile:

init:

clover.setup:

clover.info:

clover:

compile-core:

common.compile-test:
    [mkdir] Created dir: <http://hudson.zones.apache.org/hudson/job/Lucene-trunk/ws/trunk/build/contrib/collation/classes/test>
    [javac] Compiling 5 source files to <http://hudson.zones.apache.org/hudson/job/Lucene-trunk/ws/trunk/build/contrib/collation/classes/test>

build-artifacts-and-tests:

bdb:
     [echo] Building bdb...

javacc-uptodate-check:

javacc-notice:

jflex-uptodate-check:

jflex-notice:

common.init:

build-lucene:

build-lucene-tests:

contrib-build.init:

get-db-jar:
    [mkdir] Created dir: <http://hudson.zones.apache.org/hudson/job/Lucene-trunk/ws/trunk/contrib/db/bdb/lib>
      [get] Getting: http://downloads.osafoundation.org/db/db-4.7.25.jar
      [get] To: <http://hudson.zones.apache.org/hudson/job/Lucene-trunk/ws/trunk/contrib/db/bdb/lib/db-4.7.25.jar>

check-and-get-db-jar:

init:

clover.setup:

clover.info:

clover:

compile-core:
    [mkdir] Created dir: <http://hudson.zones.apache.org/hudson/job/Lucene-trunk/ws/trunk/build/contrib/db/bdb/classes/java>
    [javac] Compiling 7 source files to <http://hudson.zones.apache.org/hudson/job/Lucene-trunk/ws/trunk/build/contrib/db/bdb/classes/java>
    [javac] Note: Some input files use unchecked or unsafe operations.
    [javac] Note: Recompile with -Xlint:unchecked for details.

jar-core:
      [jar] Building jar: <http://hudson.zones.apache.org/hudson/job/Lucene-trunk/ws/trunk/build/contrib/db/bdb/lucene-bdb-3.0-SNAPSHOT.jar>

default:

bdb-je:
     [echo] Building bdb-je...

javacc-uptodate-check:

javacc-notice:

jflex-uptodate-check:

jflex-notice:

common.init:

build-lucene:

build-lucene-tests:

contrib-build.init:

get-je-jar:
    [mkdir] Created dir: <http://hudson.zones.apache.org/hudson/job/Lucene-trunk/ws/trunk/contrib/db/bdb-je/lib>
      [get] Getting: http://download.oracle.com/berkeley-db/je-3.3.69.zip
      [get] To: <http://hudson.zones.apache.org/hudson/job/Lucene-trunk/ws/trunk/contrib/db/bdb-je/lib/je-3.3.69.zip>
      [get] Error opening connection java.io.FileNotFoundException: http://www.oracle.com/errors/404.html
      [get] Error opening connection java.io.FileNotFoundException: http://www.oracle.com/errors/404.html
      [get] Error opening connection java.io.FileNotFoundException: http://www.oracle.com/errors/404.html
      [get] Can't get http://download.oracle.com/berkeley-db/je-3.3.69.zip to <http://hudson.zones.apache.org/hudson/job/Lucene-trunk/ws/trunk/contrib/db/bdb-je/lib/je-3.3.69.zip>

BUILD FAILED
<http://hudson.zones.apache.org/hudson/job/Lucene-trunk/ws/trunk/build.xml>:665: The
following error occurred while executing this line:
<http://hudson.zones.apache.org/hudson/job/Lucene-trunk/ws/trunk/build.xml>:655: The
following error occurred while executing this line:
<http://hudson.zones.apache.org/hudson/job/Lucene-trunk/ws/trunk/contrib/db/build.xml>:33:
The following error occurred while executing this line:
<http://hudson.zones.apache.org/hudson/job/Lucene-trunk/ws/trunk/contrib/db/bdb-je/build.xml>:52:
Can't get http://download.oracle.com/berkeley-db/je-3.3.69.zip to <http://hudson.zones.apache.org/hudson/job/Lucene-trunk/ws/trunk/contrib/db/bdb-je/lib/je-3.3.69.zip>

Total time: 1 minute 25 seconds
Publishing Javadoc
Archiving artifacts
Recording test results
Publishing Clover coverage report...
No Clover report will be published due to a Build Failure


---------------------------------------------------------------------
To unsubscribe, e-mail: java-dev-unsubscribe@lucene.apache.org
For additional commands, e-mail: java-dev-help@lucene.apache.org


Mime
View raw message