lucene-dev mailing list archives

Site index · List index
Message view « Date » · « Thread »
Top « Date » · « Thread »
From "Uwe Schindler" <...@thetaphi.de>
Subject RE: Build failed in Hudson: Lucene-trunk #986
Date Thu, 22 Oct 2009 05:51:21 GMT
I'll fix, my version comparison did'nt seem to work on hudson.

-----
Uwe Schindler
H.-H.-Meier-Allee 63, D-28213 Bremen
http://www.thetaphi.de
eMail: uwe@thetaphi.de

> From: Apache Hudson Server [mailto:hudson@hudson.zones.apache.org]
> Sent: Thursday, October 22, 2009 5:15 AM
> To: java-dev@lucene.apache.org
> Subject: Build failed in Hudson: Lucene-trunk #986
> 
> See <http://hudson.zones.apache.org/hudson/job/Lucene-trunk/986/changes>
> 
> Changes:
> 
> [uschindler] remove unneeded import
> 
> [uschindler] LUCENE-1998: Parameter -> Java 5 enum transition
> 
> [rmuir] LUCENE-2001: Fix parsing bug in wordnet contrib
> 
> [uschindler] Add varargs to MultiSearcher
> 
> [uschindler] Fix test failure because of wrong cast. Hard stuff :( Could
> be implemented better, the hq is used for 2 different types
> 
> [uschindler] LUCENE-1257: Remove the rest of unchecked warnings and some
> unneeded casts. I added a TODO, where I do not understand the code and not
> for sure know, whats inside the collections. This could be fixed some time
> later. But the core code now compiles without any unchecked warning.
> 
> [uschindler] LUCENE-1987: Remove rest of analysis deprecations
> (StandardAnalyzer, StopAnalyzer)
> 
> ------------------------------------------
> [...truncated 16035 lines...]
>     [junit] Tests run: 5, Failures: 0, Errors: 0, Time elapsed: 2.643 sec
>     [junit]
>     [junit] Testsuite: org.apache.lucene.search.TestSort
>     [junit] Tests run: 22, Failures: 0, Errors: 0, Time elapsed: 9.88 sec
>     [junit]
>     [junit] Testsuite: org.apache.lucene.search.TestSpanQueryFilter
>     [junit] Tests run: 1, Failures: 0, Errors: 0, Time elapsed: 0.66 sec
>     [junit]
>     [junit] Testsuite: org.apache.lucene.search.TestStressSort
>     [junit] Tests run: 1, Failures: 0, Errors: 0, Time elapsed: 9.973 sec
>     [junit]
>     [junit] Testsuite: org.apache.lucene.search.TestTermRangeFilter
>     [junit] Tests run: 7, Failures: 0, Errors: 0, Time elapsed: 6.51 sec
>     [junit]
>     [junit] Testsuite: org.apache.lucene.search.TestTermRangeQuery
>     [junit] Tests run: 9, Failures: 0, Errors: 0, Time elapsed: 0.968 sec
>     [junit]
>     [junit] Testsuite: org.apache.lucene.search.TestTermScorer
>     [junit] Tests run: 4, Failures: 0, Errors: 0, Time elapsed: 0.761 sec
>     [junit]
>     [junit] Testsuite: org.apache.lucene.search.TestTermVectors
>     [junit] Tests run: 8, Failures: 0, Errors: 0, Time elapsed: 3.004 sec
>     [junit]
>     [junit] Testsuite: org.apache.lucene.search.TestThreadSafe
>     [junit] Tests run: 1, Failures: 0, Errors: 0, Time elapsed: 7.951 sec
>     [junit]
>     [junit] Testsuite: org.apache.lucene.search.TestTimeLimitingCollector
>     [junit] Tests run: 6, Failures: 0, Errors: 0, Time elapsed: 8.635 sec
>     [junit]
>     [junit] Testsuite: org.apache.lucene.search.TestTopDocsCollector
>     [junit] Tests run: 8, Failures: 0, Errors: 0, Time elapsed: 0.565 sec
>     [junit]
>     [junit] Testsuite: org.apache.lucene.search.TestTopScoreDocCollector
>     [junit] Tests run: 1, Failures: 0, Errors: 0, Time elapsed: 0.637 sec
>     [junit]
>     [junit] Testsuite: org.apache.lucene.search.TestWildcard
>     [junit] Tests run: 5, Failures: 0, Errors: 0, Time elapsed: 0.751 sec
>     [junit]
>     [junit] Testsuite:
> org.apache.lucene.search.function.TestCustomScoreQuery
>     [junit] Tests run: 4, Failures: 0, Errors: 0, Time elapsed: 146.423
> sec
>     [junit]
>     [junit] Testsuite: org.apache.lucene.search.function.TestDocValues
>     [junit] Tests run: 3, Failures: 0, Errors: 0, Time elapsed: 0.309 sec
>     [junit]
>     [junit] Testsuite:
> org.apache.lucene.search.function.TestFieldScoreQuery
>     [junit] Tests run: 12, Failures: 0, Errors: 0, Time elapsed: 3.117 sec
>     [junit]
>     [junit] Testsuite: org.apache.lucene.search.function.TestOrdValues
>     [junit] Tests run: 5, Failures: 0, Errors: 0, Time elapsed: 1.529 sec
>     [junit]
>     [junit] Testsuite: org.apache.lucene.search.function.TestValueSource
>     [junit] Tests run: 1, Failures: 0, Errors: 0, Time elapsed: 2.542 sec
>     [junit]
>     [junit] Testsuite:
> org.apache.lucene.search.payloads.TestPayloadNearQuery
>     [junit] Tests run: 3, Failures: 0, Errors: 0, Time elapsed: 2.331 sec
>     [junit]
>     [junit] Testsuite:
> org.apache.lucene.search.payloads.TestPayloadTermQuery
>     [junit] Tests run: 6, Failures: 0, Errors: 0, Time elapsed: 7.347 sec
>     [junit]
>     [junit] Testsuite: org.apache.lucene.search.spans.TestBasics
>     [junit] Tests run: 20, Failures: 0, Errors: 0, Time elapsed: 38.507
> sec
>     [junit]
>     [junit] Testsuite:
> org.apache.lucene.search.spans.TestFieldMaskingSpanQuery
>     [junit] Tests run: 11, Failures: 0, Errors: 0, Time elapsed: 7.041 sec
>     [junit]
>     [junit] Testsuite: org.apache.lucene.search.spans.TestNearSpansOrdered
>     [junit] Tests run: 10, Failures: 0, Errors: 0, Time elapsed: 1.397 sec
>     [junit]
>     [junit] Testsuite: org.apache.lucene.search.spans.TestPayloadSpans
>     [junit] Tests run: 10, Failures: 0, Errors: 0, Time elapsed: 4.653 sec
>     [junit]
>     [junit] ------------- Standard Output ---------------
>     [junit]
>     [junit] Spans Dump --
>     [junit] payloads for span:2
>     [junit] doc:0 s:3 e:6 three:Noise:5
>     [junit] doc:0 s:3 e:6 one:Entity:3
>     [junit]
>     [junit] Spans Dump --
>     [junit] payloads for span:3
>     [junit] doc:0 s:0 e:3 xx:Entity:0
>     [junit] doc:0 s:0 e:3 rr:Noise:1
>     [junit] doc:0 s:0 e:3 yy:Noise:2
>     [junit]
>     [junit] Spans Dump --
>     [junit] payloads for span:3
>     [junit] doc:1 s:0 e:4 rr:Noise:3
>     [junit] doc:1 s:0 e:4 yy:Noise:1
>     [junit] doc:1 s:0 e:4 xx:Entity:0
>     [junit]
>     [junit] Spans Dump --
>     [junit] payloads for span:3
>     [junit] doc:0 s:0 e:3 yy:Noise:2
>     [junit] doc:0 s:0 e:3 xx:Entity:0
>     [junit] doc:0 s:0 e:3 rr:Noise:1
>     [junit]
>     [junit] Spans Dump --
>     [junit] payloads for span:3
>     [junit] doc:0 s:0 e:3 rr:Noise:1
>     [junit] doc:0 s:0 e:3 xx:Entity:0
>     [junit] doc:0 s:0 e:3 yy:Noise:2
>     [junit]
>     [junit] Spans Dump --
>     [junit] payloads for span:3
>     [junit] doc:1 s:0 e:4 rr:Noise:3
>     [junit] doc:1 s:0 e:4 yy:Noise:1
>     [junit] doc:1 s:0 e:4 xx:Entity:0
>     [junit]
>     [junit] Spans Dump --
>     [junit] payloads for span:3
>     [junit] doc:2 s:0 e:5 ss:Noise:2
>     [junit] doc:2 s:0 e:5 qq:Noise:1
>     [junit] doc:2 s:0 e:5 pp:Noise:3
>     [junit]
>     [junit] Spans Dump --
>     [junit] payloads for span:8
>     [junit] doc:3 s:0 e:11 five:Noise:4
>     [junit] doc:3 s:0 e:11 nine:Noise:8
>     [junit] doc:3 s:0 e:11 ten:Noise:9
>     [junit] doc:3 s:0 e:11 three:Noise:2
>     [junit] doc:3 s:0 e:11 eleven:Noise:10
>     [junit] doc:3 s:0 e:11 two:Noise:1
>     [junit] doc:3 s:0 e:11 one:Entity:0
>     [junit] doc:3 s:0 e:11 six:Noise:5
>     [junit]
>     [junit] Spans Dump --
>     [junit] payloads for span:8
>     [junit] doc:4 s:0 e:11 nine:Noise:0
>     [junit] doc:4 s:0 e:11 two:Noise:2
>     [junit] doc:4 s:0 e:11 five:Noise:5
>     [junit] doc:4 s:0 e:11 one:Entity:1
>     [junit] doc:4 s:0 e:11 ten:Noise:10
>     [junit] doc:4 s:0 e:11 three:Noise:3
>     [junit] doc:4 s:0 e:11 six:Noise:6
>     [junit] doc:4 s:0 e:11 eleven:Noise:9
>     [junit] match:a:Noise:10
>     [junit] match:k:Noise:11
>     [junit] Num payloads:1
>     [junit] rr:Noise:1
>     [junit] ------------- ---------------- ---------------
>     [junit] Testsuite: org.apache.lucene.search.spans.TestSpanExplanations
>     [junit] Tests run: 31, Failures: 0, Errors: 0, Time elapsed: 8.689 sec
>     [junit]
>     [junit] Testsuite:
> org.apache.lucene.search.spans.TestSpanExplanationsOfNonMatches
>     [junit] Tests run: 31, Failures: 0, Errors: 0, Time elapsed: 0.996 sec
>     [junit]
>     [junit] Testsuite: org.apache.lucene.search.spans.TestSpans
>     [junit] Tests run: 25, Failures: 0, Errors: 0, Time elapsed: 6.708 sec
>     [junit]
>     [junit] Testsuite: org.apache.lucene.search.spans.TestSpansAdvanced
>     [junit] Tests run: 1, Failures: 0, Errors: 0, Time elapsed: 1.527 sec
>     [junit]
>     [junit] Testsuite: org.apache.lucene.search.spans.TestSpansAdvanced2
>     [junit] Tests run: 4, Failures: 0, Errors: 0, Time elapsed: 3.26 sec
>     [junit]
>     [junit] Testsuite: org.apache.lucene.store.TestBufferedIndexInput
>     [junit] Tests run: 3, Failures: 0, Errors: 0, Time elapsed: 36.804 sec
>     [junit]
>     [junit] Testsuite: org.apache.lucene.store.TestDirectory
>     [junit] Tests run: 7, Failures: 0, Errors: 0, Time elapsed: 0.694 sec
>     [junit]
>     [junit] Testsuite: org.apache.lucene.store.TestFileSwitchDirectory
>     [junit] Tests run: 1, Failures: 0, Errors: 0, Time elapsed: 1.231 sec
>     [junit]
>     [junit] Testsuite: org.apache.lucene.store.TestHugeRamFile
>     [junit] Tests run: 1, Failures: 0, Errors: 0, Time elapsed: 4.139 sec
>     [junit]
>     [junit] Testsuite: org.apache.lucene.store.TestLock
>     [junit] Tests run: 1, Failures: 0, Errors: 0, Time elapsed: 1.144 sec
>     [junit]
>     [junit] Testsuite: org.apache.lucene.store.TestLockFactory
>     [junit] Tests run: 9, Failures: 0, Errors: 0, Time elapsed: 9.325 sec
>     [junit]
>     [junit] Testsuite: org.apache.lucene.store.TestRAMDirectory
>     [junit] Tests run: 4, Failures: 0, Errors: 0, Time elapsed: 2.352 sec
>     [junit]
>     [junit] Testsuite: org.apache.lucene.store.TestWindowsMMap
>     [junit] Tests run: 1, Failures: 0, Errors: 0, Time elapsed: 1.276 sec
>     [junit]
>     [junit] Testsuite: org.apache.lucene.util.TestAttributeSource
>     [junit] Tests run: 3, Failures: 0, Errors: 0, Time elapsed: 0.319 sec
>     [junit]
>     [junit] Testsuite: org.apache.lucene.util.TestBitVector
>     [junit] Tests run: 7, Failures: 0, Errors: 0, Time elapsed: 1.396 sec
>     [junit]
>     [junit] Testsuite: org.apache.lucene.util.TestCloseableThreadLocal
>     [junit] Tests run: 3, Failures: 0, Errors: 0, Time elapsed: 0.304 sec
>     [junit]
>     [junit] Testsuite: org.apache.lucene.util.TestFieldCacheSanityChecker
>     [junit] Tests run: 4, Failures: 0, Errors: 0, Time elapsed: 3.651 sec
>     [junit]
>     [junit] Testsuite:
> org.apache.lucene.util.TestIndexableBinaryStringTools
>     [junit] Tests run: 5, Failures: 0, Errors: 0, Time elapsed: 8.815 sec
>     [junit]
>     [junit] Testsuite: org.apache.lucene.util.TestNumericUtils
>     [junit] Tests run: 8, Failures: 0, Errors: 0, Time elapsed: 1.313 sec
>     [junit]
>     [junit] Testsuite: org.apache.lucene.util.TestOpenBitSet
>     [junit] Tests run: 4, Failures: 0, Errors: 0, Time elapsed: 1.64 sec
>     [junit]
>     [junit] Testsuite: org.apache.lucene.util.TestParameterToEnumBW
>     [junit] Tests run: 1, Failures: 1, Errors: 0, Time elapsed: 0.581 sec
>     [junit]
>     [junit] Testcase: test(org.apache.lucene.util.TestParameterToEnumBW):
> 	FAILED
>     [junit] expected:<[org.apache.lucene.util.Parameter]> but
> was:<[java.lang.Enum]>
>     [junit] junit.framework.ComparisonFailure:
> expected:<[org.apache.lucene.util.Parameter]> but was:<[java.lang.Enum]>
>     [junit] 	at
> org.apache.lucene.util.TestParameterToEnumBW.test(TestParameterToEnumBW.ja
> va:34)
>     [junit] 	at
> org.apache.lucene.util.LuceneTestCase.runBare(LuceneTestCase.java:206)
>     [junit]
>     [junit]
>     [junit] Test org.apache.lucene.util.TestParameterToEnumBW FAILED
>     [junit] Testsuite: org.apache.lucene.util.TestPriorityQueue
>     [junit] Tests run: 4, Failures: 0, Errors: 0, Time elapsed: 0.408 sec
>     [junit]
>     [junit] Testsuite: org.apache.lucene.util.TestRamUsageEstimator
>     [junit] Tests run: 1, Failures: 0, Errors: 0, Time elapsed: 0.424 sec
>     [junit]
>     [junit] ------------- Standard Output ---------------
>     [junit] size:56
>     [junit] size:60
>     [junit] size:48
>     [junit] size:202
>     [junit] ------------- ---------------- ---------------
>     [junit] Testsuite: org.apache.lucene.util.TestSmallFloat
>     [junit] Tests run: 2, Failures: 0, Errors: 0, Time elapsed: 0.458 sec
>     [junit]
>     [junit] Testsuite: org.apache.lucene.util.TestSortedVIntList
>     [junit] Tests run: 18, Failures: 0, Errors: 0, Time elapsed: 0.321 sec
>     [junit]
>     [junit] Testsuite: org.apache.lucene.util.TestStringHelper
>     [junit] Tests run: 1, Failures: 0, Errors: 0, Time elapsed: 0.306 sec
>     [junit]
>     [junit] Testsuite: org.apache.lucene.util.TestStringIntern
>     [junit] Tests run: 1, Failures: 0, Errors: 0, Time elapsed: 23.066 sec
>     [junit]
>     [junit] Testsuite: org.apache.lucene.util.cache.TestSimpleLRUCache
>     [junit] Tests run: 1, Failures: 0, Errors: 0, Time elapsed: 0.73 sec
>     [junit]
> 
> BUILD FAILED
> <http://hudson.zones.apache.org/hudson/job/Lucene-
> trunk/ws/trunk/build.xml>:140: The following error occurred while
> executing this line:
> <http://hudson.zones.apache.org/hudson/job/Lucene-trunk/ws/trunk/common-
> build.xml>:435: Tests failed!
> 
> Total time: 54 minutes 57 seconds
> Publishing Javadoc
> Archiving artifacts
> Recording test results
> Publishing Clover coverage report...
> No Clover report will be published due to a Build Failure
> 
> 
> ---------------------------------------------------------------------
> To unsubscribe, e-mail: java-dev-unsubscribe@lucene.apache.org
> For additional commands, e-mail: java-dev-help@lucene.apache.org



---------------------------------------------------------------------
To unsubscribe, e-mail: java-dev-unsubscribe@lucene.apache.org
For additional commands, e-mail: java-dev-help@lucene.apache.org


Mime
View raw message