lucene-dev mailing list archives

Site index · List index
Message view « Date » · « Thread »
Top « Date » · « Thread »
From Michael McCandless <luc...@mikemccandless.com>
Subject Re: Build failed in Hudson: Lucene-trunk #801
Date Sun, 19 Apr 2009 09:37:50 GMT
This was the test that failed -- it's a false failure from
LUCENE-1573.  I'll fix...

    [junit] ------------- Standard Output ---------------
    [junit] FAILED; unexpected exception during close
    [junit] java.lang.RuntimeException: java.lang.InterruptedException
    [junit] 	at
org.apache.lucene.index.IndexWriter.doWait(IndexWriter.java:5085)
    [junit] 	at
org.apache.lucene.index.IndexWriter.finishMerges(IndexWriter.java:3274)
    [junit] 	at
org.apache.lucene.index.IndexWriter.closeInternal(IndexWriter.java:2055)
    [junit] 	at org.apache.lucene.index.IndexWriter.close(IndexWriter.java:2010)
    [junit] 	at org.apache.lucene.index.IndexWriter.close(IndexWriter.java:1974)
    [junit] 	at
org.apache.lucene.index.TestIndexWriter$IndexerThreadInterrupt.run(TestIndexWriter.java:4309)
    [junit] Caused by: java.lang.InterruptedException
    [junit] 	at java.lang.Object.wait(Native Method)
    [junit] 	at
org.apache.lucene.index.IndexWriter.doWait(IndexWriter.java:5080)
    [junit] 	... 5 more
    [junit] ------------- ---------------- ---------------
    [junit] Testcase:
testThreadInterruptDeadlock(org.apache.lucene.index.TestIndexWriter):	FAILED
    [junit] null
    [junit] junit.framework.AssertionFailedError
    [junit] 	at
org.apache.lucene.index.TestIndexWriter.testThreadInterruptDeadlock(TestIndexWriter.java:4355)
    [junit] 	at
org.apache.lucene.util.LuceneTestCase.runTest(LuceneTestCase.java:88)

Mike

On Sat, Apr 18, 2009 at 11:10 PM, Apache Hudson Server
<hudson@hudson.zones.apache.org> wrote:
> See http://hudson.zones.apache.org/hudson/job/Lucene-trunk/801/changes
>
> Changes:
>
> [mikemccand] Java 1.4 build of Xerces JAR
>
> ------------------------------------------
> [...truncated 18511 lines...]
>    [junit] Testsuite: org.apache.lucene.search.TestComplexExplanations
>    [junit] Tests run: 22, Failures: 0, Errors: 0, Time elapsed: 2.547 sec
>    [junit]
>    [junit] Testsuite: org.apache.lucene.search.TestComplexExplanationsOfNonMatches
>    [junit] Tests run: 22, Failures: 0, Errors: 0, Time elapsed: 1.16 sec
>    [junit]
>    [junit] Testsuite: org.apache.lucene.search.TestCustomSearcherSort
>    [junit] Tests run: 3, Failures: 0, Errors: 0, Time elapsed: 2.508 sec
>    [junit]
>    [junit] Testsuite: org.apache.lucene.search.TestDateFilter
>    [junit] Tests run: 2, Failures: 0, Errors: 0, Time elapsed: 0.986 sec
>    [junit]
>    [junit] Testsuite: org.apache.lucene.search.TestDateSort
>    [junit] Tests run: 1, Failures: 0, Errors: 0, Time elapsed: 1.04 sec
>    [junit]
>    [junit] Testsuite: org.apache.lucene.search.TestDisjunctionMaxQuery
>    [junit] Tests run: 10, Failures: 0, Errors: 0, Time elapsed: 1.572 sec
>    [junit]
>    [junit] Testsuite: org.apache.lucene.search.TestDocBoost
>    [junit] Tests run: 1, Failures: 0, Errors: 0, Time elapsed: 0.899 sec
>    [junit]
>    [junit] Testsuite: org.apache.lucene.search.TestDocIdSet
>    [junit] Tests run: 1, Failures: 0, Errors: 0, Time elapsed: 0.392 sec
>    [junit]
>    [junit] Testsuite: org.apache.lucene.search.TestExplanations
>    [junit] Tests run: 1, Failures: 0, Errors: 0, Time elapsed: 0.819 sec
>    [junit]
>    [junit] Testsuite: org.apache.lucene.search.TestExtendedFieldCache
>    [junit] Tests run: 1, Failures: 0, Errors: 0, Time elapsed: 1.812 sec
>    [junit]
>    [junit] Testsuite: org.apache.lucene.search.TestFieldCacheRangeFilter
>    [junit] Tests run: 3, Failures: 0, Errors: 0, Time elapsed: 1.504 sec
>    [junit]
>    [junit] Testsuite: org.apache.lucene.search.TestFieldCacheTermsFilter
>    [junit] Tests run: 1, Failures: 0, Errors: 0, Time elapsed: 0.959 sec
>    [junit]
>    [junit] Testsuite: org.apache.lucene.search.TestFilteredQuery
>    [junit] Tests run: 3, Failures: 0, Errors: 0, Time elapsed: 1.342 sec
>    [junit]
>    [junit] Testsuite: org.apache.lucene.search.TestFilteredSearch
>    [junit] Tests run: 1, Failures: 0, Errors: 0, Time elapsed: 0.914 sec
>    [junit]
>    [junit] Testsuite: org.apache.lucene.search.TestFuzzyQuery
>    [junit] Tests run: 3, Failures: 0, Errors: 0, Time elapsed: 0.973 sec
>    [junit]
>    [junit] Testsuite: org.apache.lucene.search.TestMatchAllDocsQuery
>    [junit] Tests run: 2, Failures: 0, Errors: 0, Time elapsed: 0.942 sec
>    [junit]
>    [junit] Testsuite: org.apache.lucene.search.TestMultiPhraseQuery
>    [junit] Tests run: 4, Failures: 0, Errors: 0, Time elapsed: 0.988 sec
>    [junit]
>    [junit] Testsuite: org.apache.lucene.search.TestMultiSearcher
>    [junit] Tests run: 4, Failures: 0, Errors: 0, Time elapsed: 1.127 sec
>    [junit]
>    [junit] Testsuite: org.apache.lucene.search.TestMultiSearcherRanking
>    [junit] Tests run: 7, Failures: 0, Errors: 0, Time elapsed: 1.31 sec
>    [junit]
>    [junit] Testsuite: org.apache.lucene.search.TestMultiTermConstantScore
>    [junit] Tests run: 12, Failures: 0, Errors: 0, Time elapsed: 5.832 sec
>    [junit]
>    [junit] Testsuite: org.apache.lucene.search.TestMultiThreadTermVectors
>    [junit] Tests run: 1, Failures: 0, Errors: 0, Time elapsed: 2.471 sec
>    [junit]
>    [junit] Testsuite: org.apache.lucene.search.TestNot
>    [junit] Tests run: 1, Failures: 0, Errors: 0, Time elapsed: 0.96 sec
>    [junit]
>    [junit] Testsuite: org.apache.lucene.search.TestParallelMultiSearcher
>    [junit] Tests run: 4, Failures: 0, Errors: 0, Time elapsed: 1.154 sec
>    [junit]
>    [junit] Testsuite: org.apache.lucene.search.TestPhrasePrefixQuery
>    [junit] Tests run: 1, Failures: 0, Errors: 0, Time elapsed: 0.908 sec
>    [junit]
>    [junit] Testsuite: org.apache.lucene.search.TestPhraseQuery
>    [junit] Tests run: 15, Failures: 0, Errors: 0, Time elapsed: 1.708 sec
>    [junit]
>    [junit] Testsuite: org.apache.lucene.search.TestPositionIncrement
>    [junit] Tests run: 1, Failures: 0, Errors: 0, Time elapsed: 0.996 sec
>    [junit]
>    [junit] Testsuite: org.apache.lucene.search.TestPositiveScoresOnlyCollector
>    [junit] Tests run: 1, Failures: 0, Errors: 0, Time elapsed: 0.365 sec
>    [junit]
>    [junit] Testsuite: org.apache.lucene.search.TestPrefixFilter
>    [junit] Tests run: 1, Failures: 0, Errors: 0, Time elapsed: 0.92 sec
>    [junit]
>    [junit] Testsuite: org.apache.lucene.search.TestPrefixQuery
>    [junit] Tests run: 1, Failures: 0, Errors: 0, Time elapsed: 0.92 sec
>    [junit]
>    [junit] Testsuite: org.apache.lucene.search.TestQueryTermVector
>    [junit] Tests run: 1, Failures: 0, Errors: 0, Time elapsed: 0.375 sec
>    [junit]
>    [junit] Testsuite: org.apache.lucene.search.TestRangeFilter
>    [junit] Tests run: 7, Failures: 0, Errors: 0, Time elapsed: 5.81 sec
>    [junit]
>    [junit] Testsuite: org.apache.lucene.search.TestRangeQuery
>    [junit] Tests run: 10, Failures: 0, Errors: 0, Time elapsed: 1.288 sec
>    [junit]
>    [junit] Testsuite: org.apache.lucene.search.TestRemoteCachingWrapperFilter
>    [junit] Tests run: 1, Failures: 0, Errors: 0, Time elapsed: 1.463 sec
>    [junit]
>    [junit] Testsuite: org.apache.lucene.search.TestRemoteSearchable
>    [junit] Tests run: 5, Failures: 0, Errors: 0, Time elapsed: 1.467 sec
>    [junit]
>    [junit] Testsuite: org.apache.lucene.search.TestScoreCachingWrappingScorer
>    [junit] Tests run: 1, Failures: 0, Errors: 0, Time elapsed: 0.36 sec
>    [junit]
>    [junit] Testsuite: org.apache.lucene.search.TestScorerPerf
>    [junit] Tests run: 1, Failures: 0, Errors: 0, Time elapsed: 1.582 sec
>    [junit]
>    [junit] ------------- Standard Output ---------------
>    [junit] Average number of matches=0
>    [junit] ------------- ---------------- ---------------
>    [junit] Testsuite: org.apache.lucene.search.TestSearchHitsWithDeletions
>    [junit] Tests run: 9, Failures: 0, Errors: 0, Time elapsed: 9.672 sec
>    [junit]
>    [junit] Testsuite: org.apache.lucene.search.TestSetNorm
>    [junit] Tests run: 1, Failures: 0, Errors: 0, Time elapsed: 0.895 sec
>    [junit]
>    [junit] Testsuite: org.apache.lucene.search.TestSimilarity
>    [junit] Tests run: 1, Failures: 0, Errors: 0, Time elapsed: 0.936 sec
>    [junit]
>    [junit] Testsuite: org.apache.lucene.search.TestSimpleExplanations
>    [junit] Tests run: 52, Failures: 0, Errors: 0, Time elapsed: 2.425 sec
>    [junit]
>    [junit] Testsuite: org.apache.lucene.search.TestSimpleExplanationsOfNonMatches
>    [junit] Tests run: 52, Failures: 0, Errors: 0, Time elapsed: 1.338 sec
>    [junit]
>    [junit] Testsuite: org.apache.lucene.search.TestSloppyPhraseQuery
>    [junit] Tests run: 5, Failures: 0, Errors: 0, Time elapsed: 2.458 sec
>    [junit]
>    [junit] Testsuite: org.apache.lucene.search.TestSort
>    [junit] Tests run: 25, Failures: 0, Errors: 0, Time elapsed: 8.447 sec
>    [junit]
>    [junit] Testsuite: org.apache.lucene.search.TestSpanQueryFilter
>    [junit] Tests run: 1, Failures: 0, Errors: 0, Time elapsed: 1.101 sec
>    [junit]
>    [junit] Testsuite: org.apache.lucene.search.TestStressSort
>    [junit] Tests run: 1, Failures: 0, Errors: 0, Time elapsed: 54.138 sec
>    [junit]
>    [junit] Testsuite: org.apache.lucene.search.TestTermScorer
>    [junit] Tests run: 4, Failures: 0, Errors: 0, Time elapsed: 0.905 sec
>    [junit]
>    [junit] Testsuite: org.apache.lucene.search.TestTermVectors
>    [junit] Tests run: 8, Failures: 0, Errors: 0, Time elapsed: 3.007 sec
>    [junit]
>    [junit] Testsuite: org.apache.lucene.search.TestThreadSafe
>    [junit] Tests run: 1, Failures: 0, Errors: 0, Time elapsed: 5.283 sec
>    [junit]
>    [junit] Testsuite: org.apache.lucene.search.TestTimeLimitedCollector
>    [junit] Tests run: 6, Failures: 0, Errors: 0, Time elapsed: 13.403 sec
>    [junit]
>    [junit] Testsuite: org.apache.lucene.search.TestTimeLimitingCollector
>    [junit] Tests run: 6, Failures: 0, Errors: 0, Time elapsed: 13.383 sec
>    [junit]
>    [junit] Testsuite: org.apache.lucene.search.TestTopDocsCollector
>    [junit] Tests run: 8, Failures: 0, Errors: 0, Time elapsed: 0.818 sec
>    [junit]
>    [junit] Testsuite: org.apache.lucene.search.TestWildcard
>    [junit] Tests run: 5, Failures: 0, Errors: 0, Time elapsed: 1.039 sec
>    [junit]
>    [junit] Testsuite: org.apache.lucene.search.function.TestCustomScoreQuery
>    [junit] Tests run: 4, Failures: 0, Errors: 0, Time elapsed: 20.15 sec
>    [junit]
>    [junit] Testsuite: org.apache.lucene.search.function.TestFieldScoreQuery
>    [junit] Tests run: 12, Failures: 0, Errors: 0, Time elapsed: 1.821 sec
>    [junit]
>    [junit] Testsuite: org.apache.lucene.search.function.TestOrdValues
>    [junit] Tests run: 5, Failures: 0, Errors: 0, Time elapsed: 1.451 sec
>    [junit]
>    [junit] Testsuite: org.apache.lucene.search.payloads.TestBoostingTermQuery
>    [junit] Tests run: 4, Failures: 0, Errors: 0, Time elapsed: 3.679 sec
>    [junit]
>    [junit] Testsuite: org.apache.lucene.search.spans.TestBasics
>    [junit] Tests run: 20, Failures: 0, Errors: 0, Time elapsed: 10.163 sec
>    [junit]
>    [junit] Testsuite: org.apache.lucene.search.spans.TestNearSpansOrdered
>    [junit] Tests run: 10, Failures: 0, Errors: 0, Time elapsed: 1.226 sec
>    [junit]
>    [junit] Testsuite: org.apache.lucene.search.spans.TestPayloadSpans
>    [junit] Tests run: 9, Failures: 0, Errors: 0, Time elapsed: 4.234 sec
>    [junit]
>    [junit] Testsuite: org.apache.lucene.search.spans.TestSpanExplanations
>    [junit] Tests run: 31, Failures: 0, Errors: 0, Time elapsed: 1.665 sec
>    [junit]
>    [junit] Testsuite: org.apache.lucene.search.spans.TestSpanExplanationsOfNonMatches
>    [junit] Tests run: 31, Failures: 0, Errors: 0, Time elapsed: 1.158 sec
>    [junit]
>    [junit] Testsuite: org.apache.lucene.search.spans.TestSpans
>    [junit] Tests run: 24, Failures: 0, Errors: 0, Time elapsed: 1.931 sec
>    [junit]
>    [junit] Testsuite: org.apache.lucene.search.spans.TestSpansAdvanced
>    [junit] Tests run: 1, Failures: 0, Errors: 0, Time elapsed: 1.252 sec
>    [junit]
>    [junit] Testsuite: org.apache.lucene.search.spans.TestSpansAdvanced2
>    [junit] Tests run: 4, Failures: 0, Errors: 0, Time elapsed: 1.383 sec
>    [junit]
>    [junit] Testsuite: org.apache.lucene.store.TestBufferedIndexInput
>    [junit] Tests run: 4, Failures: 0, Errors: 0, Time elapsed: 2.2 sec
>    [junit]
>    [junit] Testsuite: org.apache.lucene.store.TestDirectory
>    [junit] Tests run: 7, Failures: 0, Errors: 0, Time elapsed: 0.783 sec
>    [junit]
>    [junit] Testsuite: org.apache.lucene.store.TestHugeRamFile
>    [junit] Tests run: 1, Failures: 0, Errors: 0, Time elapsed: 4.66 sec
>    [junit]
>    [junit] Testsuite: org.apache.lucene.store.TestLock
>    [junit] Tests run: 1, Failures: 0, Errors: 0, Time elapsed: 0.379 sec
>    [junit]
>    [junit] Testsuite: org.apache.lucene.store.TestLockFactory
>    [junit] Tests run: 13, Failures: 0, Errors: 0, Time elapsed: 7.209 sec
>    [junit]
>    [junit] Testsuite: org.apache.lucene.store.TestMMapDirectory
>    [junit] Tests run: 1, Failures: 0, Errors: 0, Time elapsed: 0.654 sec
>    [junit]
>    [junit] Testsuite: org.apache.lucene.store.TestWindowsMMap
>    [junit] Tests run: 1, Failures: 0, Errors: 0, Time elapsed: 1.574 sec
>    [junit]
>    [junit] Testsuite: org.apache.lucene.util.TestBitVector
>    [junit] Tests run: 7, Failures: 0, Errors: 0, Time elapsed: 3.572 sec
>    [junit]
>    [junit] Testsuite: org.apache.lucene.util.TestIndexableBinaryStringTools
>    [junit] Tests run: 5, Failures: 0, Errors: 0, Time elapsed: 7.126 sec
>    [junit]
>    [junit] Testsuite: org.apache.lucene.util.TestOpenBitSet
>    [junit] Tests run: 4, Failures: 0, Errors: 0, Time elapsed: 1.773 sec
>    [junit]
>    [junit] Testsuite: org.apache.lucene.util.TestPriorityQueue
>    [junit] Tests run: 4, Failures: 0, Errors: 0, Time elapsed: 0.448 sec
>    [junit]
>    [junit] Testsuite: org.apache.lucene.util.TestSmallFloat
>    [junit] Tests run: 2, Failures: 0, Errors: 0, Time elapsed: 0.481 sec
>    [junit]
>    [junit] Testsuite: org.apache.lucene.util.TestSortedVIntList
>    [junit] Tests run: 19, Failures: 0, Errors: 0, Time elapsed: 0.357 sec
>    [junit]
>    [junit] Testsuite: org.apache.lucene.util.TestStringHelper
>    [junit] Tests run: 1, Failures: 0, Errors: 0, Time elapsed: 0.348 sec
>    [junit]
>    [junit] Testsuite: org.apache.lucene.util.cache.TestSimpleLRUCache
>    [junit] Tests run: 1, Failures: 0, Errors: 0, Time elapsed: 0.356 sec
>    [junit]
>
> BUILD FAILED
> http://hudson.zones.apache.org/hudson/job/Lucene-trunk/ws/trunk/common-build.xml :406:
The following error occurred while executing this line:
> http://hudson.zones.apache.org/hudson/job/Lucene-trunk/ws/trunk/common-build.xml :399:
Tests failed!
>
> Total time: 14 minutes 23 seconds
> Publishing Javadoc
> Recording test results
> Publishing Clover coverage report...
>
>
> ---------------------------------------------------------------------
> To unsubscribe, e-mail: java-dev-unsubscribe@lucene.apache.org
> For additional commands, e-mail: java-dev-help@lucene.apache.org
>
>

---------------------------------------------------------------------
To unsubscribe, e-mail: java-dev-unsubscribe@lucene.apache.org
For additional commands, e-mail: java-dev-help@lucene.apache.org


Mime
View raw message