lucene-dev mailing list archives

Site index · List index
Message view « Date » · « Thread »
Top « Date » · « Thread »
From Apache Hudson Server <hud...@hudson.zones.apache.org>
Subject Build failed in Hudson: Lucene-trunk #651
Date Thu, 20 Nov 2008 04:06:57 GMT
See http://hudson.zones.apache.org/hudson/job/Lucene-trunk/651/changes

------------------------------------------
[...truncated 146 lines...]
AU        src/test/org/apache/lucene/index/TestPositionBasedTermVectorMapper.java
AU        src/test/org/apache/lucene/index/index.22.cfs.zip
AU        src/test/org/apache/lucene/index/TestCompoundFile.java
AU        src/test/org/apache/lucene/index/index.23.cfs.zip
AU        src/test/org/apache/lucene/index/TestIndexInput.java
AU        src/test/org/apache/lucene/index/TestIndexWriterDelete.java
AU        src/test/org/apache/lucene/index/TestFieldsReader.java
AU        src/test/org/apache/lucene/index/TestIndexReader.java
AU        src/test/org/apache/lucene/index/TestStressIndexing2.java
AU        src/test/org/apache/lucene/index/TestCloseableThreadLocal.java
AU        src/test/org/apache/lucene/index/TestWordlistLoader.java
AU        src/test/org/apache/lucene/index/TestTransactionRollback.java
AU        src/test/org/apache/lucene/index/TestFilterIndexReader.java
AU        src/test/org/apache/lucene/index/TestMultiSegmentReader.java
AU        src/test/org/apache/lucene/index/TestTermVectorsReader.java
AU        src/test/org/apache/lucene/index/MockIndexInput.java
AU        src/test/org/apache/lucene/index/TestIndexReaderReopen.java
AU        src/test/org/apache/lucene/index/TestSegmentTermDocs.java
AU        src/test/org/apache/lucene/index/TestIndexWriter.java
AU        src/test/org/apache/lucene/index/TestSegmentMerger.java
AU        src/test/org/apache/lucene/index/TestMultiLevelSkipList.java
AU        src/test/org/apache/lucene/index/TestCheckIndex.java
AU        src/test/org/apache/lucene/index/TestIndexWriterExceptions.java
AU        src/test/org/apache/lucene/index/TestTerm.java
AU        src/test/org/apache/lucene/index/TestTransactions.java
AU        src/test/org/apache/lucene/index/TestStressIndexing.java
AU        src/test/org/apache/lucene/index/TestTermdocPerf.java
AU        src/test/org/apache/lucene/index/TestDocumentWriter.java
AU        src/test/org/apache/lucene/index/TestIndexFileDeleter.java
AU        src/test/org/apache/lucene/index/TestPayloads.java
A         src/test/org/apache/lucene/index/store
AU        src/test/org/apache/lucene/index/store/TestRAMDirectory.java
AU        src/test/org/apache/lucene/index/TestLazyBug.java
AU        src/test/org/apache/lucene/index/TestIndexWriterMerging.java
AU        src/test/org/apache/lucene/index/TestIndexWriterLockRelease.java
AU        src/test/org/apache/lucene/index/TestParallelReader.java
AU        src/test/org/apache/lucene/index/TestDeletionPolicy.java
AU        src/test/org/apache/lucene/index/TestSegmentReader.java
AU        src/test/org/apache/lucene/index/TestIndexModifier.java
AU        src/test/org/apache/lucene/index/TestAddIndexesNoOptimize.java
AU        src/test/org/apache/lucene/index/index.19.nocfs.zip
AU        src/test/org/apache/lucene/index/index.19.cfs.zip
AU        src/test/org/apache/lucene/index/TestBackwardsCompatibility.java
AU        src/test/org/apache/lucene/index/TestLazyProxSkipping.java
AU        src/test/org/apache/lucene/index/TestNorms.java
AU        src/test/org/apache/lucene/SearchTestForDuplicates.java
AU        src/test/org/apache/lucene/TestSearchForDuplicates.java
AU        src/test/org/apache/lucene/StoreTest.java
A         src/test/org/apache/lucene/util
AU        src/test/org/apache/lucene/util/TestBitVector.java
A         src/test/org/apache/lucene/util/cache
AU        src/test/org/apache/lucene/util/cache/TestSimpleLRUCache.java
AU        src/test/org/apache/lucene/util/TestPriorityQueue.java
AU        src/test/org/apache/lucene/util/TestStringHelper.java
AU        src/test/org/apache/lucene/util/LuceneTestCase.java
AU        src/test/org/apache/lucene/util/English.java
AU        src/test/org/apache/lucene/util/TestOpenBitSet.java
AU        src/test/org/apache/lucene/util/_TestUtil.java
AU        src/test/org/apache/lucene/util/TestSortedVIntList.java
AU        src/test/org/apache/lucene/util/TestSmallFloat.java
A         src/test/org/apache/lucene/document
AU        src/test/org/apache/lucene/document/TestBinaryDocument.java
AU        src/test/org/apache/lucene/document/TestNumberTools.java
AU        src/test/org/apache/lucene/document/TestDateTools.java
AU        src/test/org/apache/lucene/document/TestDocument.java
AU        src/test/org/apache/lucene/TestHitIterator.java
A         src/java
A         src/java/org
A         src/java/org/apache
A         src/java/org/apache/lucene
A         src/java/org/apache/lucene/queryParser
AU        src/java/org/apache/lucene/queryParser/QueryParserConstants.java
AU        src/java/org/apache/lucene/queryParser/Token.java
AU        src/java/org/apache/lucene/queryParser/TokenMgrError.java
AU        src/java/org/apache/lucene/queryParser/MultiFieldQueryParser.java
AU        src/java/org/apache/lucene/queryParser/QueryParser.java
AU        src/java/org/apache/lucene/queryParser/QueryParser.jj
AU        src/java/org/apache/lucene/queryParser/FastCharStream.java
AU        src/java/org/apache/lucene/queryParser/CharStream.java
AU        src/java/org/apache/lucene/queryParser/ParseException.java
AU        src/java/org/apache/lucene/queryParser/QueryParserTokenManager.java
AU        src/java/org/apache/lucene/queryParser/package.html
A         src/java/org/apache/lucene/analysis
AU        src/java/org/apache/lucene/analysis/SimpleAnalyzer.java
AU        src/java/org/apache/lucene/analysis/SinkTokenizer.java
AU        src/java/org/apache/lucene/analysis/PerFieldAnalyzerWrapper.java
AU        src/java/org/apache/lucene/analysis/WhitespaceAnalyzer.java
AU        src/java/org/apache/lucene/analysis/CachingTokenFilter.java
A         src/java/org/apache/lucene/analysis/tokenattributes
AU        src/java/org/apache/lucene/analysis/tokenattributes/FlagsAttribute.java
AU        src/java/org/apache/lucene/analysis/tokenattributes/TypeAttribute.java
AU        src/java/org/apache/lucene/analysis/tokenattributes/OffsetAttribute.java
AU        src/java/org/apache/lucene/analysis/tokenattributes/TermAttribute.java
AU        src/java/org/apache/lucene/analysis/tokenattributes/PayloadAttribute.java
AU        src/java/org/apache/lucene/analysis/tokenattributes/PositionIncrementAttribute.java
A         src/java/org/apache/lucene/analysis/de
AU        src/java/org/apache/lucene/analysis/CharTokenizer.java
AU        src/java/org/apache/lucene/analysis/PorterStemmer.java
AU        src/java/org/apache/lucene/analysis/Tokenizer.java
AU        src/java/org/apache/lucene/analysis/PorterStemFilter.java
AU        src/java/org/apache/lucene/analysis/package.html
AU        src/java/org/apache/lucene/analysis/KeywordTokenizer.java
AU        src/java/org/apache/lucene/analysis/LowerCaseTokenizer.java
A         src/java/org/apache/lucene/analysis/standard
AU        src/java/org/apache/lucene/analysis/standard/StandardTokenizerImpl.jflex
AU        src/java/org/apache/lucene/analysis/standard/StandardAnalyzer.java
AU        src/java/org/apache/lucene/analysis/standard/StandardFilter.java
AU        src/java/org/apache/lucene/analysis/standard/StandardTokenizer.java
AU        src/java/org/apache/lucene/analysis/standard/StandardTokenizerImpl.java
AU        src/java/org/apache/lucene/analysis/standard/package.html
AU        src/java/org/apache/lucene/analysis/Token.java
AU        src/java/org/apache/lucene/analysis/TeeTokenFilter.java
AU        src/java/org/apache/lucene/analysis/Analyzer.java
AU        src/java/org/apache/lucene/analysis/TokenFilter.java
A         src/java/org/apache/lucene/analysis/LengthFilter.java
AU        src/java/org/apache/lucene/analysis/ISOLatin1AccentFilter.java
AU        src/java/org/apache/lucene/analysis/WhitespaceTokenizer.java
AU        src/java/org/apache/lucene/analysis/CharArraySet.java
AU        src/java/org/apache/lucene/analysis/LowerCaseFilter.java
AU        src/java/org/apache/lucene/analysis/LetterTokenizer.java
AU        src/java/org/apache/lucene/analysis/KeywordAnalyzer.java
AU        src/java/org/apache/lucene/analysis/StopAnalyzer.java
AU        src/java/org/apache/lucene/analysis/StopFilter.java
AU        src/java/org/apache/lucene/analysis/TokenStream.java
AU        src/java/org/apache/lucene/analysis/WordlistLoader.java
A         src/java/org/apache/lucene/search
AU        src/java/org/apache/lucene/search/TopFieldDocCollector.java
AU        src/java/org/apache/lucene/search/FieldDocSortedHitQueue.java
AU        src/java/org/apache/lucene/search/RemoteSearchable.java
AU        src/java/org/apache/lucene/search/FieldCache.java
AU        src/java/org/apache/lucene/search/MultiTermQuery.java
AU        src/java/org/apache/lucene/search/PrefixTermEnum.java
AU        src/java/org/apache/lucene/search/ConstantScoreQuery.java
AU        src/java/org/apache/lucene/search/FuzzyQuery.java
AU        src/java/org/apache/lucene/search/SortComparator.java
ERROR: Failed to check out http://svn.apache.org/repos/asf/lucene/java/trunk
org.tmatesoft.svn.core.SVNException: svn: timed out waiting for server
svn: REPORT request failed on '/repos/asf/!svn/vcc/default'
	at org.tmatesoft.svn.core.internal.wc.SVNErrorManager.error(SVNErrorManager.java:102)
	at org.tmatesoft.svn.core.internal.wc.SVNErrorManager.error(SVNErrorManager.java:86)
	at org.tmatesoft.svn.core.internal.io.dav.http.HTTPConnection.request(HTTPConnection.java:545)
	at org.tmatesoft.svn.core.internal.io.dav.http.HTTPConnection.request(HTTPConnection.java:255)
	at org.tmatesoft.svn.core.internal.io.dav.http.HTTPConnection.request(HTTPConnection.java:243)
	at org.tmatesoft.svn.core.internal.io.dav.DAVConnection.doReport(DAVConnection.java:256)
	at org.tmatesoft.svn.core.internal.io.dav.DAVRepository.runReport(DAVRepository.java:1189)
	at org.tmatesoft.svn.core.internal.io.dav.DAVRepository.update(DAVRepository.java:1055)
	at org.tmatesoft.svn.core.wc.SVNUpdateClient.doUpdate(SVNUpdateClient.java:241)
	at org.tmatesoft.svn.core.wc.SVNUpdateClient.doCheckout(SVNUpdateClient.java:449)
	at org.tmatesoft.svn.core.wc.SVNUpdateClient.doCheckout(SVNUpdateClient.java:410)
	at org.tmatesoft.svn.core.wc.SVNUpdateClient.doCheckout(SVNUpdateClient.java:406)
	at hudson.scm.SubversionSCM$CheckOutTask.invoke(SubversionSCM.java:473)
	at hudson.scm.SubversionSCM$CheckOutTask.invoke(SubversionSCM.java:403)
	at hudson.FilePath$FileCallableWrapper.call(FilePath.java:1201)
	at hudson.remoting.UserRequest.perform(UserRequest.java:69)
	at hudson.remoting.UserRequest.perform(UserRequest.java:23)
	at hudson.remoting.Request$2.run(Request.java:200)
	at java.util.concurrent.Executors$RunnableAdapter.call(Executors.java:441)
	at java.util.concurrent.FutureTask$Sync.innerRun(FutureTask.java:303)
	at java.util.concurrent.FutureTask.run(FutureTask.java:138)
	at java.util.concurrent.ThreadPoolExecutor$Worker.runTask(ThreadPoolExecutor.java:885)
	at java.util.concurrent.ThreadPoolExecutor$Worker.run(ThreadPoolExecutor.java:907)
	at java.lang.Thread.run(Thread.java:619)
Caused by: java.net.SocketTimeoutException: Read timed out
	at java.net.SocketInputStream.socketRead0(Native Method)
	at java.net.SocketInputStream.read(SocketInputStream.java:129)
	at java.io.BufferedInputStream.fill(BufferedInputStream.java:218)
	at java.io.BufferedInputStream.read1(BufferedInputStream.java:258)
	at java.io.BufferedInputStream.read(BufferedInputStream.java:317)
	at org.tmatesoft.svn.core.internal.io.dav.http.ChunkedInputStream.read(ChunkedInputStream.java:69)
	at java.util.zip.InflaterInputStream.fill(InflaterInputStream.java:221)
	at java.util.zip.InflaterInputStream.read(InflaterInputStream.java:141)
	at java.util.zip.GZIPInputStream.read(GZIPInputStream.java:92)
	at sun.nio.cs.StreamDecoder.readBytes(StreamDecoder.java:264)
	at sun.nio.cs.StreamDecoder.implRead(StreamDecoder.java:306)
	at sun.nio.cs.StreamDecoder.read(StreamDecoder.java:158)
	at java.io.InputStreamReader.read(InputStreamReader.java:167)
	at org.tmatesoft.svn.core.internal.io.dav.http.XMLReader.read(XMLReader.java:39)
	at com.sun.org.apache.xerces.internal.impl.XMLEntityScanner.load(XMLEntityScanner.java:1742)
	at com.sun.org.apache.xerces.internal.impl.XMLEntityScanner.skipChar(XMLEntityScanner.java:1416)
	at com.sun.org.apache.xerces.internal.impl.XMLDocumentFragmentScannerImpl$FragmentContentDriver.next(XMLDocumentFragmentScannerImpl.java:2777)
	at com.sun.org.apache.xerces.internal.impl.XMLDocumentScannerImpl.next(XMLDocumentScannerImpl.java:645)
	at com.sun.org.apache.xerces.internal.impl.XMLNSDocumentScannerImpl.next(XMLNSDocumentScannerImpl.java:140)
	at com.sun.org.apache.xerces.internal.impl.XMLDocumentFragmentScannerImpl.scanDocument(XMLDocumentFragmentScannerImpl.java:508)
	at com.sun.org.apache.xerces.internal.parsers.XML11Configuration.parse(XML11Configuration.java:807)
	at com.sun.org.apache.xerces.internal.parsers.XML11Configuration.parse(XML11Configuration.java:737)
	at com.sun.org.apache.xerces.internal.parsers.XMLParser.parse(XMLParser.java:107)
	at com.sun.org.apache.xerces.internal.parsers.AbstractSAXParser.parse(AbstractSAXParser.java:1205)
	at com.sun.org.apache.xerces.internal.jaxp.SAXParserImpl$JAXPSAXParser.parse(SAXParserImpl.java:522)
	at org.tmatesoft.svn.core.internal.io.dav.http.HTTPConnection.readData(HTTPConnection.java:655)
	at org.tmatesoft.svn.core.internal.io.dav.http.HTTPConnection.readData(HTTPConnection.java:620)
	at org.tmatesoft.svn.core.internal.io.dav.http.HTTPRequest.dispatch(HTTPRequest.java:207)
	at org.tmatesoft.svn.core.internal.io.dav.http.HTTPConnection.request(HTTPConnection.java:321)
	... 21 more
Publishing Javadoc
FATAL: Unable to copy Javadoc from http://hudson.zones.apache.org/hudson/job/Lucene-trunk/ws/trunk/build/docs/api
 to /export/home/hudson/hudson/jobs/Lucene-trunk/javadoc
hudson.util.IOException2: java.io.EOFException
	at java.util.zip.GZIPInputStream.readUByte(GZIPInputStream.java:207)
	at java.util.zip.GZIPInputStream.readUShort(GZIPInputStream.java:197)
	at java.util.zip.GZIPInputStream.readHeader(GZIPInputStream.java:136)
	at java.util.zip.GZIPInputStream.<init>(GZIPInputStream.java:58)
	at java.util.zip.GZIPInputStream.<init>(GZIPInputStream.java:68)
	at hudson.FilePath.readFromTar(FilePath.java:996)
	at hudson.FilePath.copyRecursiveTo(FilePath.java:925)
	at hudson.FilePath.copyRecursiveTo(FilePath.java:837)
	at hudson.tasks.JavadocArchiver.perform(JavadocArchiver.java:68)
	at hudson.model.AbstractBuild$AbstractRunner.performAllBuildStep(AbstractBuild.java:318)
	at hudson.model.AbstractBuild$AbstractRunner.performAllBuildStep(AbstractBuild.java:306)
	at hudson.model.Build$RunnerImpl.post2(Build.java:126)
	at hudson.model.AbstractBuild$AbstractRunner.post(AbstractBuild.java:291)
	at hudson.model.Run.run(Run.java:813)
	at hudson.model.Build.run(Build.java:88)
	at hudson.model.ResourceController.execute(ResourceController.java:70)
	at hudson.model.Executor.run(Executor.java:88)

	at hudson.FilePath.copyRecursiveTo(FilePath.java:932)
	at hudson.FilePath.copyRecursiveTo(FilePath.java:837)
	at hudson.tasks.JavadocArchiver.perform(JavadocArchiver.java:68)
	at hudson.model.AbstractBuild$AbstractRunner.performAllBuildStep(AbstractBuild.java:318)
	at hudson.model.AbstractBuild$AbstractRunner.performAllBuildStep(AbstractBuild.java:306)
	at hudson.model.Build$RunnerImpl.post2(Build.java:126)
	at hudson.model.AbstractBuild$AbstractRunner.post(AbstractBuild.java:291)
	at hudson.model.Run.run(Run.java:813)
	at hudson.model.Build.run(Build.java:88)
	at hudson.model.ResourceController.execute(ResourceController.java:70)
	at hudson.model.Executor.run(Executor.java:88)
Caused by: java.util.concurrent.ExecutionException: http://hudson.zones.apache.org/hudson/job/Lucene-trunk/ws/trunk/build/docs/api
 not found.
	at hudson.remoting.Channel$1.adapt(Channel.java:486)
	at hudson.remoting.Channel$1.adapt(Channel.java:481)
	at hudson.remoting.FutureAdapter.get(FutureAdapter.java:36)
	at hudson.FilePath.copyRecursiveTo(FilePath.java:928)
	... 10 more
Caused by: http://hudson.zones.apache.org/hudson/job/Lucene-trunk/ws/trunk/build/docs/api
 not found.
	at org.apache.tools.ant.types.AbstractFileSet.getDirectoryScanner(AbstractFileSet.java:422)
	at hudson.FilePath.writeToTar(FilePath.java:959)
	at hudson.FilePath.access$400(FilePath.java:120)
	at hudson.FilePath$25.invoke(FilePath.java:918)
	at hudson.FilePath$25.invoke(FilePath.java:915)
	at hudson.FilePath$FileCallableWrapper.call(FilePath.java:1201)
	at hudson.remoting.UserRequest.perform(UserRequest.java:69)
	at hudson.remoting.UserRequest.perform(UserRequest.java:23)
	at hudson.remoting.Request$2.run(Request.java:200)
	at java.util.concurrent.Executors$RunnableAdapter.call(Executors.java:441)
	at java.util.concurrent.FutureTask$Sync.innerRun(FutureTask.java:303)
	at java.util.concurrent.FutureTask.run(FutureTask.java:138)
	at java.util.concurrent.ThreadPoolExecutor$Worker.runTask(ThreadPoolExecutor.java:885)
	at java.util.concurrent.ThreadPoolExecutor$Worker.run(ThreadPoolExecutor.java:907)
	at java.lang.Thread.run(Thread.java:619)
Recording test results
Publishing Clover coverage report...


---------------------------------------------------------------------
To unsubscribe, e-mail: java-dev-unsubscribe@lucene.apache.org
For additional commands, e-mail: java-dev-help@lucene.apache.org


Mime
View raw message