lucene-dev mailing list archives

Site index · List index
Message view « Date » · « Thread »
Top « Date » · « Thread »
From Apache Hudson Server <hud...@hudson.zones.apache.org>
Subject Build failed in Hudson: Lucene-trunk #562
Date Thu, 21 Aug 2008 02:10:48 GMT
See http://hudson.zones.apache.org/hudson/job/Lucene-trunk/562/changes

Changes:

[gsingers] LUCENE-1001: Make payloads accessible from SpanQuery's

[mikemccand] LUCENE-1333: improvements to Token reuse API and full cutover to reuse API for
all core and contrib analyzers

------------------------------------------
[...truncated 2151 lines...]
      [tar] Entry: lucene-2008-08-21_02-04-07/contrib/xml-query-parser/src/java/org/apache/lucene/xmlparser/DOMUtils.java
longer than 100 characters.
      [tar] Entry: lucene-2008-08-21_02-04-07/contrib/xml-query-parser/src/java/org/apache/lucene/xmlparser/FilterBuilder.java
longer than 100 characters.
      [tar] Entry: lucene-2008-08-21_02-04-07/contrib/xml-query-parser/src/java/org/apache/lucene/xmlparser/FilterBuilderFactory.java
longer than 100 characters.
      [tar] Entry: lucene-2008-08-21_02-04-07/contrib/xml-query-parser/src/java/org/apache/lucene/xmlparser/ParserException.java
longer than 100 characters.
      [tar] Entry: lucene-2008-08-21_02-04-07/contrib/xml-query-parser/src/java/org/apache/lucene/xmlparser/QueryBuilder.java
longer than 100 characters.
      [tar] Entry: lucene-2008-08-21_02-04-07/contrib/xml-query-parser/src/java/org/apache/lucene/xmlparser/QueryBuilderFactory.java
longer than 100 characters.
      [tar] Entry: lucene-2008-08-21_02-04-07/contrib/xml-query-parser/src/java/org/apache/lucene/xmlparser/QueryTemplateManager.java
longer than 100 characters.
      [tar] Entry: lucene-2008-08-21_02-04-07/contrib/xml-query-parser/src/java/org/apache/lucene/xmlparser/builders/BooleanFilterBuilder.java
longer than 100 characters.
      [tar] Entry: lucene-2008-08-21_02-04-07/contrib/xml-query-parser/src/java/org/apache/lucene/xmlparser/builders/BooleanQueryBuilder.java
longer than 100 characters.
      [tar] Entry: lucene-2008-08-21_02-04-07/contrib/xml-query-parser/src/java/org/apache/lucene/xmlparser/builders/BoostingQueryBuilder.java
longer than 100 characters.
      [tar] Entry: lucene-2008-08-21_02-04-07/contrib/xml-query-parser/src/java/org/apache/lucene/xmlparser/builders/CachedFilterBuilder.java
longer than 100 characters.
      [tar] Entry: lucene-2008-08-21_02-04-07/contrib/xml-query-parser/src/java/org/apache/lucene/xmlparser/builders/ConstantScoreQueryBuilder.java
longer than 100 characters.
      [tar] Entry: lucene-2008-08-21_02-04-07/contrib/xml-query-parser/src/java/org/apache/lucene/xmlparser/builders/DuplicateFilterBuilder.java
longer than 100 characters.
      [tar] Entry: lucene-2008-08-21_02-04-07/contrib/xml-query-parser/src/java/org/apache/lucene/xmlparser/builders/FilteredQueryBuilder.java
longer than 100 characters.
      [tar] Entry: lucene-2008-08-21_02-04-07/contrib/xml-query-parser/src/java/org/apache/lucene/xmlparser/builders/FuzzyLikeThisQueryBuilder.java
longer than 100 characters.
      [tar] Entry: lucene-2008-08-21_02-04-07/contrib/xml-query-parser/src/java/org/apache/lucene/xmlparser/builders/LikeThisQueryBuilder.java
longer than 100 characters.
      [tar] Entry: lucene-2008-08-21_02-04-07/contrib/xml-query-parser/src/java/org/apache/lucene/xmlparser/builders/MatchAllDocsQueryBuilder.java
longer than 100 characters.
      [tar] Entry: lucene-2008-08-21_02-04-07/contrib/xml-query-parser/src/java/org/apache/lucene/xmlparser/builders/RangeFilterBuilder.java
longer than 100 characters.
      [tar] Entry: lucene-2008-08-21_02-04-07/contrib/xml-query-parser/src/java/org/apache/lucene/xmlparser/builders/SpanBuilderBase.java
longer than 100 characters.
      [tar] Entry: lucene-2008-08-21_02-04-07/contrib/xml-query-parser/src/java/org/apache/lucene/xmlparser/builders/SpanFirstBuilder.java
longer than 100 characters.
      [tar] Entry: lucene-2008-08-21_02-04-07/contrib/xml-query-parser/src/java/org/apache/lucene/xmlparser/builders/SpanNearBuilder.java
longer than 100 characters.
      [tar] Entry: lucene-2008-08-21_02-04-07/contrib/xml-query-parser/src/java/org/apache/lucene/xmlparser/builders/SpanNotBuilder.java
longer than 100 characters.
      [tar] Entry: lucene-2008-08-21_02-04-07/contrib/xml-query-parser/src/java/org/apache/lucene/xmlparser/builders/SpanOrBuilder.java
longer than 100 characters.
      [tar] Entry: lucene-2008-08-21_02-04-07/contrib/xml-query-parser/src/java/org/apache/lucene/xmlparser/builders/SpanOrTermsBuilder.java
longer than 100 characters.
      [tar] Entry: lucene-2008-08-21_02-04-07/contrib/xml-query-parser/src/java/org/apache/lucene/xmlparser/builders/SpanQueryBuilder.java
longer than 100 characters.
      [tar] Entry: lucene-2008-08-21_02-04-07/contrib/xml-query-parser/src/java/org/apache/lucene/xmlparser/builders/SpanQueryBuilderFactory.java
longer than 100 characters.
      [tar] Entry: lucene-2008-08-21_02-04-07/contrib/xml-query-parser/src/java/org/apache/lucene/xmlparser/builders/SpanTermBuilder.java
longer than 100 characters.
      [tar] Entry: lucene-2008-08-21_02-04-07/contrib/xml-query-parser/src/java/org/apache/lucene/xmlparser/builders/TermQueryBuilder.java
longer than 100 characters.
      [tar] Entry: lucene-2008-08-21_02-04-07/contrib/xml-query-parser/src/java/org/apache/lucene/xmlparser/builders/TermsFilterBuilder.java
longer than 100 characters.
      [tar] Entry: lucene-2008-08-21_02-04-07/contrib/xml-query-parser/src/java/org/apache/lucene/xmlparser/builders/TermsQueryBuilder.java
longer than 100 characters.
      [tar] Entry: lucene-2008-08-21_02-04-07/contrib/xml-query-parser/src/java/org/apache/lucene/xmlparser/builders/UserInputQueryBuilder.java
longer than 100 characters.
      [tar] Entry: lucene-2008-08-21_02-04-07/contrib/xml-query-parser/src/test/org/apache/lucene/xmlparser/BooleanFilter.xml
longer than 100 characters.
      [tar] Entry: lucene-2008-08-21_02-04-07/contrib/xml-query-parser/src/test/org/apache/lucene/xmlparser/BooleanQuery.xml
longer than 100 characters.
      [tar] Entry: lucene-2008-08-21_02-04-07/contrib/xml-query-parser/src/test/org/apache/lucene/xmlparser/BoostingQuery.xml
longer than 100 characters.
      [tar] Entry: lucene-2008-08-21_02-04-07/contrib/xml-query-parser/src/test/org/apache/lucene/xmlparser/CachedFilter.xml
longer than 100 characters.
      [tar] Entry: lucene-2008-08-21_02-04-07/contrib/xml-query-parser/src/test/org/apache/lucene/xmlparser/ConstantScoreQuery.xml
longer than 100 characters.
      [tar] Entry: lucene-2008-08-21_02-04-07/contrib/xml-query-parser/src/test/org/apache/lucene/xmlparser/DuplicateFilterQuery.xml
longer than 100 characters.
      [tar] Entry: lucene-2008-08-21_02-04-07/contrib/xml-query-parser/src/test/org/apache/lucene/xmlparser/FuzzyLikeThisQuery.xml
longer than 100 characters.
      [tar] Entry: lucene-2008-08-21_02-04-07/contrib/xml-query-parser/src/test/org/apache/lucene/xmlparser/LikeThisQuery.xml
longer than 100 characters.
      [tar] Entry: lucene-2008-08-21_02-04-07/contrib/xml-query-parser/src/test/org/apache/lucene/xmlparser/MatchAllDocsQuery.xml
longer than 100 characters.
      [tar] Entry: lucene-2008-08-21_02-04-07/contrib/xml-query-parser/src/test/org/apache/lucene/xmlparser/NestedBooleanQuery.xml
longer than 100 characters.
      [tar] Entry: lucene-2008-08-21_02-04-07/contrib/xml-query-parser/src/test/org/apache/lucene/xmlparser/RangeFilterQuery.xml
longer than 100 characters.
      [tar] Entry: lucene-2008-08-21_02-04-07/contrib/xml-query-parser/src/test/org/apache/lucene/xmlparser/SpanQuery.xml
longer than 100 characters.
      [tar] Entry: lucene-2008-08-21_02-04-07/contrib/xml-query-parser/src/test/org/apache/lucene/xmlparser/TermQuery.xml
longer than 100 characters.
      [tar] Entry: lucene-2008-08-21_02-04-07/contrib/xml-query-parser/src/test/org/apache/lucene/xmlparser/TermsFilterQuery.xml
longer than 100 characters.
      [tar] Entry: lucene-2008-08-21_02-04-07/contrib/xml-query-parser/src/test/org/apache/lucene/xmlparser/TermsQuery.xml
longer than 100 characters.
      [tar] Entry: lucene-2008-08-21_02-04-07/contrib/xml-query-parser/src/test/org/apache/lucene/xmlparser/TestParser.java
longer than 100 characters.
      [tar] Entry: lucene-2008-08-21_02-04-07/contrib/xml-query-parser/src/test/org/apache/lucene/xmlparser/TestQueryTemplateManager.java
longer than 100 characters.
      [tar] Entry: lucene-2008-08-21_02-04-07/contrib/xml-query-parser/src/test/org/apache/lucene/xmlparser/UserInputQuery.xml
longer than 100 characters.
      [tar] Entry: lucene-2008-08-21_02-04-07/contrib/xml-query-parser/src/test/org/apache/lucene/xmlparser/UserInputQueryCustomField.xml
longer than 100 characters.
      [tar] Entry: lucene-2008-08-21_02-04-07/contrib/xml-query-parser/src/test/org/apache/lucene/xmlparser/albumBooleanQuery.xsl
longer than 100 characters.
      [tar] Entry: lucene-2008-08-21_02-04-07/contrib/xml-query-parser/src/test/org/apache/lucene/xmlparser/albumFilteredQuery.xsl
longer than 100 characters.
      [tar] Entry: lucene-2008-08-21_02-04-07/contrib/xml-query-parser/src/test/org/apache/lucene/xmlparser/albumLuceneClassicQuery.xsl
longer than 100 characters.
      [tar] Entry: lucene-2008-08-21_02-04-07/contrib/xml-query-parser/src/test/org/apache/lucene/xmlparser/reuters21578.txt
longer than 100 characters.
      [tar] Entry: lucene-2008-08-21_02-04-07/src/java/org/apache/lucene/index/TermVectorEntryFreqSortedComparator.java
longer than 100 characters.
      [tar] Entry: lucene-2008-08-21_02-04-07/src/site/src/documentation/content/xdocs/images/larm_crawling-process.jpg
longer than 100 characters.
      [tar] Entry: lucene-2008-08-21_02-04-07/src/test/org/apache/lucene/search/TestComplexExplanationsOfNonMatches.java
longer than 100 characters.
      [tar] Entry: lucene-2008-08-21_02-04-07/src/test/org/apache/lucene/search/TestSimpleExplanationsOfNonMatches.java
longer than 100 characters.
      [tar] Entry: lucene-2008-08-21_02-04-07/src/test/org/apache/lucene/search/spans/TestSpanExplanationsOfNonMatches.java
longer than 100 characters.
     [gzip] Building: http://hudson.zones.apache.org/hudson/job/Lucene-trunk/ws/trunk/dist/lucene-2008-08-21_02-04-07-src.tar.gz


BUILD SUCCESSFUL
Total time: 17 seconds
+ cp dist/lucene-2008-08-21_02-04-07-src.tar.gz http://hudson.zones.apache.org/hudson/job/Lucene-trunk/ws/artifacts

+ /export/home/hudson/tools/ant/latest/bin/ant -lib /export/home/nigel/hudsonSupport/maven
-Dversion=2.4-SNAPSHOT generate-maven-artifacts
Buildfile: build.xml

maven.ant.tasks-check:

javacc-uptodate-check:

javacc-notice:

jflex-uptodate-check:

jflex-notice:

init:

clover.setup:

clover.info:

clover:

common.compile-core:
    [mkdir] Created dir: http://hudson.zones.apache.org/hudson/job/Lucene-trunk/ws/trunk/build/classes/java

    [javac] Compiling 326 source files to http://hudson.zones.apache.org/hudson/job/Lucene-trunk/ws/trunk/build/classes/java

    [javac] Note: Some input files use or override a deprecated API.
    [javac] Note: Recompile with -Xlint:deprecation for details.

compile-core:
     [rmic] RMI Compiling 1 class to http://hudson.zones.apache.org/hudson/job/Lucene-trunk/ws/trunk/build/classes/java


jar-core:
     [exec] Execute failed: java.io.IOException: svnversion: not found
      [jar] Building jar: http://hudson.zones.apache.org/hudson/job/Lucene-trunk/ws/trunk/build/lucene-core-2.4-SNAPSHOT.jar


build-contrib:
     [echo] Building analyzers...

javacc-uptodate-check:

javacc-notice:

jflex-uptodate-check:

jflex-notice:

common.init:

build-lucene:

init:

clover.setup:

clover.info:

clover:

compile-core:
    [mkdir] Created dir: http://hudson.zones.apache.org/hudson/job/Lucene-trunk/ws/trunk/build/contrib/analyzers/classes/java

    [javac] Compiling 62 source files to http://hudson.zones.apache.org/hudson/job/Lucene-trunk/ws/trunk/build/contrib/analyzers/classes/java

    [javac] Note: Some input files use unchecked or unsafe operations.
    [javac] Note: Recompile with -Xlint:unchecked for details.

jar-core:
     [exec] Execute failed: java.io.IOException: svnversion: not found
      [jar] Building jar: http://hudson.zones.apache.org/hudson/job/Lucene-trunk/ws/trunk/build/contrib/analyzers/lucene-analyzers-2.4-SNAPSHOT.jar


jar:

compile-test:
     [echo] Building analyzers...

javacc-uptodate-check:

javacc-notice:

jflex-uptodate-check:

jflex-notice:

common.init:

build-lucene:

init:

clover.setup:

clover.info:

clover:

compile-core:

common.compile-test:
    [mkdir] Created dir: http://hudson.zones.apache.org/hudson/job/Lucene-trunk/ws/trunk/build/contrib/analyzers/classes/test

    [javac] Compiling 27 source files to http://hudson.zones.apache.org/hudson/job/Lucene-trunk/ws/trunk/build/contrib/analyzers/classes/test

    [javac] http://hudson.zones.apache.org/hudson/job/Lucene-trunk/ws/trunk/contrib/analyzers/src/test/org/apache/lucene/analysis/miscellaneous/TestSingleTokenTokenFilter.java
:23: cannot find symbol
    [javac] symbol  : class LuceneTestCase
    [javac] location: package org.apache.lucene.util
    [javac] import org.apache.lucene.util.LuceneTestCase;
    [javac]                               ^
    [javac] http://hudson.zones.apache.org/hudson/job/Lucene-trunk/ws/trunk/contrib/analyzers/src/test/org/apache/lucene/analysis/miscellaneous/TestSingleTokenTokenFilter.java
:25: cannot find symbol
    [javac] symbol: class LuceneTestCase
    [javac] public class TestSingleTokenTokenFilter extends LuceneTestCase {
    [javac]                                                 ^
    [javac] http://hudson.zones.apache.org/hudson/job/Lucene-trunk/ws/trunk/contrib/analyzers/src/test/org/apache/lucene/analysis/miscellaneous/TestSingleTokenTokenFilter.java
:33: cannot find symbol
    [javac] symbol  : method assertEquals(org.apache.lucene.analysis.Token,org.apache.lucene.analysis.Token)
    [javac] location: class org.apache.lucene.analysis.miscellaneous.TestSingleTokenTokenFilter
    [javac]     assertEquals(token, ts.next(reusableToken));
    [javac]     ^
    [javac] http://hudson.zones.apache.org/hudson/job/Lucene-trunk/ws/trunk/contrib/analyzers/src/test/org/apache/lucene/analysis/miscellaneous/TestSingleTokenTokenFilter.java
:34: cannot find symbol
    [javac] symbol  : method assertNull(org.apache.lucene.analysis.Token)
    [javac] location: class org.apache.lucene.analysis.miscellaneous.TestSingleTokenTokenFilter
    [javac]     assertNull(ts.next(reusableToken));
    [javac]     ^
    [javac] Note: Some input files use or override a deprecated API.
    [javac] Note: Recompile with -Xlint:deprecation for details.
    [javac] Note: Some input files use unchecked or unsafe operations.
    [javac] Note: Recompile with -Xlint:unchecked for details.
    [javac] 4 errors

BUILD FAILED
http://hudson.zones.apache.org/hudson/job/Lucene-trunk/ws/trunk/build.xml :553: The following
error occurred while executing this line:
http://hudson.zones.apache.org/hudson/job/Lucene-trunk/ws/trunk/build.xml :543: The following
error occurred while executing this line:
http://hudson.zones.apache.org/hudson/job/Lucene-trunk/ws/trunk/contrib/contrib-build.xml
:66: The following error occurred while executing this line:
http://hudson.zones.apache.org/hudson/job/Lucene-trunk/ws/trunk/common-build.xml :328: The
following error occurred while executing this line:
http://hudson.zones.apache.org/hudson/job/Lucene-trunk/ws/trunk/common-build.xml :481: Compile
failed; see the compiler error output for details.

Total time: 27 seconds
Publishing Javadoc
FATAL: Unable to copy Javadoc from http://hudson.zones.apache.org/hudson/job/Lucene-trunk/ws/trunk/build/docs/api
 to /export/home/hudson/hudson/jobs/Lucene-trunk/javadoc
hudson.util.IOException2: java.io.EOFException
	at java.util.zip.GZIPInputStream.readUByte(GZIPInputStream.java:207)
	at java.util.zip.GZIPInputStream.readUShort(GZIPInputStream.java:197)
	at java.util.zip.GZIPInputStream.readHeader(GZIPInputStream.java:136)
	at java.util.zip.GZIPInputStream.<init>(GZIPInputStream.java:58)
	at java.util.zip.GZIPInputStream.<init>(GZIPInputStream.java:68)
	at hudson.FilePath.readFromTar(FilePath.java:922)
	at hudson.FilePath.copyRecursiveTo(FilePath.java:851)
	at hudson.FilePath.copyRecursiveTo(FilePath.java:768)
	at hudson.tasks.JavadocArchiver.perform(JavadocArchiver.java:68)
	at hudson.model.AbstractBuild$AbstractRunner.performAllBuildStep(AbstractBuild.java:318)
	at hudson.model.AbstractBuild$AbstractRunner.performAllBuildStep(AbstractBuild.java:306)
	at hudson.model.Build$RunnerImpl.post2(Build.java:122)
	at hudson.model.AbstractBuild$AbstractRunner.post(AbstractBuild.java:291)
	at hudson.model.Run.run(Run.java:809)
	at hudson.model.Build.run(Build.java:84)
	at hudson.model.ResourceController.execute(ResourceController.java:70)
	at hudson.model.Executor.run(Executor.java:88)

	at hudson.FilePath.copyRecursiveTo(FilePath.java:858)
	at hudson.FilePath.copyRecursiveTo(FilePath.java:768)
	at hudson.tasks.JavadocArchiver.perform(JavadocArchiver.java:68)
	at hudson.model.AbstractBuild$AbstractRunner.performAllBuildStep(AbstractBuild.java:318)
	at hudson.model.AbstractBuild$AbstractRunner.performAllBuildStep(AbstractBuild.java:306)
	at hudson.model.Build$RunnerImpl.post2(Build.java:122)
	at hudson.model.AbstractBuild$AbstractRunner.post(AbstractBuild.java:291)
	at hudson.model.Run.run(Run.java:809)
	at hudson.model.Build.run(Build.java:84)
	at hudson.model.ResourceController.execute(ResourceController.java:70)
	at hudson.model.Executor.run(Executor.java:88)
Caused by: java.util.concurrent.ExecutionException: http://hudson.zones.apache.org/hudson/job/Lucene-trunk/ws/trunk/build/docs/api
 not found.
	at hudson.remoting.Channel$1.adapt(Channel.java:425)
	at hudson.remoting.Channel$1.adapt(Channel.java:420)
	at hudson.remoting.FutureAdapter.get(FutureAdapter.java:36)
	at hudson.FilePath.copyRecursiveTo(FilePath.java:854)
	... 10 more
Caused by: http://hudson.zones.apache.org/hudson/job/Lucene-trunk/ws/trunk/build/docs/api
 not found.
	at org.apache.tools.ant.types.AbstractFileSet.getDirectoryScanner(AbstractFileSet.java:422)
	at hudson.FilePath.writeToTar(FilePath.java:885)
	at hudson.FilePath.access$400(FilePath.java:117)
	at hudson.FilePath$24.invoke(FilePath.java:844)
	at hudson.FilePath$24.invoke(FilePath.java:841)
	at hudson.FilePath$FileCallableWrapper.call(FilePath.java:1127)
	at hudson.remoting.UserRequest.perform(UserRequest.java:69)
	at hudson.remoting.UserRequest.perform(UserRequest.java:23)
	at hudson.remoting.Request$2.run(Request.java:200)
	at java.util.concurrent.Executors$RunnableAdapter.call(Executors.java:441)
	at java.util.concurrent.FutureTask$Sync.innerRun(FutureTask.java:303)
	at java.util.concurrent.FutureTask.run(FutureTask.java:138)
	at java.util.concurrent.ThreadPoolExecutor$Worker.runTask(ThreadPoolExecutor.java:885)
	at java.util.concurrent.ThreadPoolExecutor$Worker.run(ThreadPoolExecutor.java:907)
	at java.lang.Thread.run(Thread.java:619)
Recording test results


---------------------------------------------------------------------
To unsubscribe, e-mail: java-dev-unsubscribe@lucene.apache.org
For additional commands, e-mail: java-dev-help@lucene.apache.org


Mime
View raw message