lucene-dev mailing list archives

Site index · List index
Message view « Date » · « Thread »
Top « Date » · « Thread »
From Apache Hudson Server <hud...@hudson.zones.apache.org>
Subject Build failed in Hudson: Lucene-trunk #424
Date Thu, 03 Apr 2008 06:13:23 GMT
See http://hudson.zones.apache.org/hudson/job/Lucene-trunk/424/changes

------------------------------------------
[...truncated 13676 lines...]
    [junit] Testsuite: org.apache.lucene.queryParser.TestMultiAnalyzer
    [junit] Tests run: 3, Failures: 0, Errors: 0, Time elapsed: 1.471 sec
    [junit] 
    [junit] Testsuite: org.apache.lucene.queryParser.TestMultiFieldQueryParser
    [junit] Tests run: 9, Failures: 0, Errors: 0, Time elapsed: 1.008 sec
    [junit] 
    [junit] Testsuite: org.apache.lucene.queryParser.TestQueryParser
    [junit] Tests run: 25, Failures: 0, Errors: 0, Time elapsed: 1.307 sec
    [junit] 
    [junit] ------------- Standard Output ---------------
    [junit] Result: (fieldX:xxxxx fieldy:xxxxxxxx)^2.0
    [junit] ------------- ---------------- ---------------
    [junit] Testsuite: org.apache.lucene.search.TestBoolean2
    [junit] Tests run: 11, Failures: 0, Errors: 0, Time elapsed: 22.484 sec
    [junit] 
    [junit] Testsuite: org.apache.lucene.search.TestBooleanMinShouldMatch
    [junit] Tests run: 15, Failures: 0, Errors: 0, Time elapsed: 23.253 sec
    [junit] 
    [junit] Testsuite: org.apache.lucene.search.TestBooleanOr
    [junit] Tests run: 5, Failures: 0, Errors: 0, Time elapsed: 1.527 sec
    [junit] 
    [junit] Testsuite: org.apache.lucene.search.TestBooleanPrefixQuery
    [junit] Tests run: 1, Failures: 0, Errors: 0, Time elapsed: 1.068 sec
    [junit] 
    [junit] Testsuite: org.apache.lucene.search.TestBooleanQuery
    [junit] Tests run: 2, Failures: 0, Errors: 0, Time elapsed: 0.428 sec
    [junit] 
    [junit] Testsuite: org.apache.lucene.search.TestBooleanScorer
    [junit] Tests run: 1, Failures: 0, Errors: 0, Time elapsed: 0.981 sec
    [junit] 
    [junit] Testsuite: org.apache.lucene.search.TestCachingWrapperFilter
    [junit] Tests run: 1, Failures: 0, Errors: 0, Time elapsed: 0.909 sec
    [junit] 
    [junit] Testsuite: org.apache.lucene.search.TestComplexExplanations
    [junit] Tests run: 22, Failures: 0, Errors: 0, Time elapsed: 4.377 sec
    [junit] 
    [junit] Testsuite: org.apache.lucene.search.TestComplexExplanationsOfNonMatches
    [junit] Tests run: 22, Failures: 0, Errors: 0, Time elapsed: 1.031 sec
    [junit] 
    [junit] Testsuite: org.apache.lucene.search.TestConstantScoreRangeQuery
    [junit] Tests run: 7, Failures: 0, Errors: 0, Time elapsed: 3.541 sec
    [junit] 
    [junit] Testsuite: org.apache.lucene.search.TestCustomSearcherSort
    [junit] Tests run: 3, Failures: 0, Errors: 0, Time elapsed: 3.73 sec
    [junit] 
    [junit] Testsuite: org.apache.lucene.search.TestDateFilter
    [junit] Tests run: 2, Failures: 0, Errors: 0, Time elapsed: 0.835 sec
    [junit] 
    [junit] Testsuite: org.apache.lucene.search.TestDateSort
    [junit] Tests run: 1, Failures: 0, Errors: 0, Time elapsed: 0.892 sec
    [junit] 
    [junit] Testsuite: org.apache.lucene.search.TestDisjunctionMaxQuery
    [junit] Tests run: 10, Failures: 0, Errors: 0, Time elapsed: 2.732 sec
    [junit] 
    [junit] Testsuite: org.apache.lucene.search.TestDocBoost
    [junit] Tests run: 1, Failures: 0, Errors: 0, Time elapsed: 3.32 sec
    [junit] 
    [junit] Testsuite: org.apache.lucene.search.TestExplanations
    [junit] Tests run: 1, Failures: 0, Errors: 0, Time elapsed: 1.183 sec
    [junit] 
    [junit] Testsuite: org.apache.lucene.search.TestExtendedFieldCache
    [junit] Tests run: 1, Failures: 0, Errors: 0, Time elapsed: 1.637 sec
    [junit] 
    [junit] Testsuite: org.apache.lucene.search.TestFilteredQuery
    [junit] Tests run: 3, Failures: 0, Errors: 0, Time elapsed: 1.458 sec
    [junit] 
    [junit] Testsuite: org.apache.lucene.search.TestFilteredSearch
    [junit] Tests run: 1, Failures: 0, Errors: 0, Time elapsed: 0.891 sec
    [junit] 
    [junit] Testsuite: org.apache.lucene.search.TestFuzzyQuery
    [junit] Tests run: 2, Failures: 0, Errors: 0, Time elapsed: 0.942 sec
    [junit] 
    [junit] Testsuite: org.apache.lucene.search.TestMatchAllDocsQuery
    [junit] Tests run: 2, Failures: 0, Errors: 0, Time elapsed: 0.956 sec
    [junit] 
    [junit] Testsuite: org.apache.lucene.search.TestMultiPhraseQuery
    [junit] Tests run: 3, Failures: 0, Errors: 0, Time elapsed: 1.599 sec
    [junit] 
    [junit] Testsuite: org.apache.lucene.search.TestMultiSearcher
    [junit] Tests run: 4, Failures: 0, Errors: 0, Time elapsed: 1.57 sec
    [junit] 
    [junit] Testsuite: org.apache.lucene.search.TestMultiSearcherRanking
    [junit] Tests run: 7, Failures: 0, Errors: 0, Time elapsed: 1.141 sec
    [junit] 
    [junit] Testsuite: org.apache.lucene.search.TestMultiThreadTermVectors
    [junit] Tests run: 1, Failures: 0, Errors: 0, Time elapsed: 4.279 sec
    [junit] 
    [junit] Testsuite: org.apache.lucene.search.TestNot
    [junit] Tests run: 1, Failures: 0, Errors: 0, Time elapsed: 0.826 sec
    [junit] 
    [junit] Testsuite: org.apache.lucene.search.TestParallelMultiSearcher
    [junit] Tests run: 4, Failures: 0, Errors: 0, Time elapsed: 1.017 sec
    [junit] 
    [junit] Testsuite: org.apache.lucene.search.TestPhrasePrefixQuery
    [junit] Tests run: 1, Failures: 0, Errors: 0, Time elapsed: 2.717 sec
    [junit] 
    [junit] Testsuite: org.apache.lucene.search.TestPhraseQuery
    [junit] Tests run: 13, Failures: 0, Errors: 0, Time elapsed: 2.749 sec
    [junit] 
    [junit] Testsuite: org.apache.lucene.search.TestPositionIncrement
    [junit] Tests run: 2, Failures: 0, Errors: 0, Time elapsed: 1.047 sec
    [junit] 
    [junit] Testsuite: org.apache.lucene.search.TestPrefixFilter
    [junit] Tests run: 1, Failures: 0, Errors: 0, Time elapsed: 0.755 sec
    [junit] 
    [junit] Testsuite: org.apache.lucene.search.TestPrefixQuery
    [junit] Tests run: 1, Failures: 0, Errors: 0, Time elapsed: 1.721 sec
    [junit] 
    [junit] Testsuite: org.apache.lucene.search.TestQueryTermVector
    [junit] Tests run: 1, Failures: 0, Errors: 0, Time elapsed: 0.426 sec
    [junit] 
    [junit] Testsuite: org.apache.lucene.search.TestRangeFilter
    [junit] Tests run: 3, Failures: 0, Errors: 0, Time elapsed: 6.131 sec
    [junit] 
    [junit] Testsuite: org.apache.lucene.search.TestRangeQuery
    [junit] Tests run: 3, Failures: 0, Errors: 0, Time elapsed: 0.81 sec
    [junit] 
    [junit] Testsuite: org.apache.lucene.search.TestRemoteCachingWrapperFilter
    [junit] Tests run: 1, Failures: 0, Errors: 0, Time elapsed: 4.078 sec
    [junit] 
    [junit] Testsuite: org.apache.lucene.search.TestRemoteSearchable
    [junit] Tests run: 5, Failures: 0, Errors: 0, Time elapsed: 2.965 sec
    [junit] 
    [junit] Testsuite: org.apache.lucene.search.TestScorerPerf
    [junit] Tests run: 1, Failures: 0, Errors: 0, Time elapsed: 4.678 sec
    [junit] 
    [junit] ------------- Standard Output ---------------
    [junit] Average number of matches=0
    [junit] ------------- ---------------- ---------------
    [junit] Testsuite: org.apache.lucene.search.TestSearchHitsWithDeletions
    [junit] Tests run: 9, Failures: 0, Errors: 0, Time elapsed: 19.256 sec
    [junit] 
    [junit] Testsuite: org.apache.lucene.search.TestSetNorm
    [junit] Tests run: 1, Failures: 0, Errors: 0, Time elapsed: 0.75 sec
    [junit] 
    [junit] Testsuite: org.apache.lucene.search.TestSimilarity
    [junit] Tests run: 1, Failures: 0, Errors: 0, Time elapsed: 0.792 sec
    [junit] 
    [junit] Testsuite: org.apache.lucene.search.TestSimpleExplanations
    [junit] Tests run: 52, Failures: 0, Errors: 0, Time elapsed: 5.588 sec
    [junit] 
    [junit] Testsuite: org.apache.lucene.search.TestSimpleExplanationsOfNonMatches
    [junit] Tests run: 52, Failures: 0, Errors: 0, Time elapsed: 3.536 sec
    [junit] 
    [junit] Testsuite: org.apache.lucene.search.TestSort
    [junit] Tests run: 17, Failures: 0, Errors: 0, Time elapsed: 9.944 sec
    [junit] 
    [junit] Testsuite: org.apache.lucene.search.TestSpanQueryFilter
    [junit] Tests run: 1, Failures: 0, Errors: 0, Time elapsed: 1.439 sec
    [junit] 
    [junit] Testsuite: org.apache.lucene.search.TestTermScorer
    [junit] Tests run: 4, Failures: 0, Errors: 0, Time elapsed: 1.386 sec
    [junit] 
    [junit] Testsuite: org.apache.lucene.search.TestTermVectors
    [junit] Tests run: 8, Failures: 0, Errors: 0, Time elapsed: 5.251 sec
    [junit] 
    [junit] Testsuite: org.apache.lucene.search.TestThreadSafe
    [junit] Tests run: 1, Failures: 0, Errors: 0, Time elapsed: 19.054 sec
    [junit] 
    [junit] Testsuite: org.apache.lucene.search.TestTimeLimitedCollector
    [junit] Tests run: 6, Failures: 1, Errors: 0, Time elapsed: 23.287 sec
    [junit] 
    [junit] Testcase: testTimeoutGreedy(org.apache.lucene.search.TestTimeLimitedCollector):
FAILED
    [junit] lastDoc=14 ,&& allowed=799 ,&& elapsed=960 >= 886 = ( 2*resolution
+  TIME_ALLOWED + SLOW_DOWN = 2*20 + 799 + 47)
    [junit] junit.framework.AssertionFailedError: lastDoc=14 ,&& allowed=799 ,&&
elapsed=960 >= 886 = ( 2*resolution +  TIME_ALLOWED + SLOW_DOWN = 2*20 + 799 + 47)
    [junit] 	at org.apache.lucene.search.TestTimeLimitedCollector.doTestTimeout(TestTimeLimitedCollector.java:189)
    [junit] 	at org.apache.lucene.search.TestTimeLimitedCollector.testTimeoutGreedy(TestTimeLimitedCollector.java:143)
    [junit] 
    [junit] 
    [junit] Test org.apache.lucene.search.TestTimeLimitedCollector FAILED
    [junit] Testsuite: org.apache.lucene.search.TestWildcard
    [junit] Tests run: 5, Failures: 0, Errors: 0, Time elapsed: 0.89 sec
    [junit] 
    [junit] Testsuite: org.apache.lucene.search.function.TestCustomScoreQuery
    [junit] Tests run: 4, Failures: 0, Errors: 0, Time elapsed: 51.926 sec
    [junit] 
    [junit] Testsuite: org.apache.lucene.search.function.TestFieldScoreQuery
    [junit] Tests run: 12, Failures: 0, Errors: 0, Time elapsed: 2.514 sec
    [junit] 
    [junit] Testsuite: org.apache.lucene.search.function.TestOrdValues
    [junit] Tests run: 5, Failures: 0, Errors: 0, Time elapsed: 1.607 sec
    [junit] 
    [junit] Testsuite: org.apache.lucene.search.payloads.TestBoostingTermQuery
    [junit] Tests run: 4, Failures: 0, Errors: 0, Time elapsed: 10.729 sec
    [junit] 
    [junit] Testsuite: org.apache.lucene.search.spans.TestBasics
    [junit] Tests run: 19, Failures: 0, Errors: 0, Time elapsed: 48.978 sec
    [junit] 
    [junit] Testsuite: org.apache.lucene.search.spans.TestNearSpansOrdered
    [junit] Tests run: 10, Failures: 0, Errors: 0, Time elapsed: 1.955 sec
    [junit] 
    [junit] Testsuite: org.apache.lucene.search.spans.TestSpanExplanations
    [junit] Tests run: 31, Failures: 0, Errors: 0, Time elapsed: 3.829 sec
    [junit] 
    [junit] Testsuite: org.apache.lucene.search.spans.TestSpanExplanationsOfNonMatches
    [junit] Tests run: 31, Failures: 0, Errors: 0, Time elapsed: 1.846 sec
    [junit] 
    [junit] Testsuite: org.apache.lucene.search.spans.TestSpans
    [junit] Tests run: 21, Failures: 0, Errors: 0, Time elapsed: 2.027 sec
    [junit] 
    [junit] Testsuite: org.apache.lucene.search.spans.TestSpansAdvanced
    [junit] Tests run: 1, Failures: 0, Errors: 0, Time elapsed: 1.028 sec
    [junit] 
    [junit] Testsuite: org.apache.lucene.search.spans.TestSpansAdvanced2
    [junit] Tests run: 4, Failures: 0, Errors: 0, Time elapsed: 3.92 sec
    [junit] 
    [junit] Testsuite: org.apache.lucene.store.TestBufferedIndexInput
    [junit] Tests run: 4, Failures: 0, Errors: 0, Time elapsed: 2.379 sec
    [junit] 
    [junit] Testsuite: org.apache.lucene.store.TestHugeRamFile
    [junit] Tests run: 1, Failures: 0, Errors: 0, Time elapsed: 6.94 sec
    [junit] 
    [junit] Testsuite: org.apache.lucene.store.TestLock
    [junit] Tests run: 1, Failures: 0, Errors: 0, Time elapsed: 0.351 sec
    [junit] 
    [junit] Testsuite: org.apache.lucene.store.TestLockFactory
    [junit] Tests run: 13, Failures: 0, Errors: 0, Time elapsed: 8.519 sec
    [junit] 
    [junit] Testsuite: org.apache.lucene.store.TestMMapDirectory
    [junit] Tests run: 1, Failures: 0, Errors: 0, Time elapsed: 1.115 sec
    [junit] 
    [junit] Testsuite: org.apache.lucene.store.TestWindowsMMap
    [junit] Tests run: 1, Failures: 0, Errors: 0, Time elapsed: 2.632 sec
    [junit] 
    [junit] Testsuite: org.apache.lucene.util.TestBitVector
    [junit] Tests run: 6, Failures: 0, Errors: 0, Time elapsed: 3.713 sec
    [junit] 
    [junit] Testsuite: org.apache.lucene.util.TestOpenBitSet
    [junit] Tests run: 3, Failures: 0, Errors: 0, Time elapsed: 2.365 sec
    [junit] 
    [junit] Testsuite: org.apache.lucene.util.TestPriorityQueue
    [junit] Tests run: 4, Failures: 0, Errors: 0, Time elapsed: 0.459 sec
    [junit] 
    [junit] Testsuite: org.apache.lucene.util.TestSmallFloat
    [junit] Tests run: 2, Failures: 0, Errors: 0, Time elapsed: 1.137 sec
    [junit] 
    [junit] Testsuite: org.apache.lucene.util.TestSortedVIntList
    [junit] Tests run: 19, Failures: 0, Errors: 0, Time elapsed: 0.674 sec
    [junit] 
    [junit] Testsuite: org.apache.lucene.util.TestStringHelper
    [junit] Tests run: 1, Failures: 0, Errors: 0, Time elapsed: 0.908 sec
    [junit] 

BUILD FAILED
http://hudson.zones.apache.org/hudson/job/Lucene-trunk/ws/trunk/common-build.xml :383: Tests
failed!

Total time: 127 minutes 37 seconds
Publishing Javadoc
Recording test results


---------------------------------------------------------------------
To unsubscribe, e-mail: java-dev-unsubscribe@lucene.apache.org
For additional commands, e-mail: java-dev-help@lucene.apache.org


Mime
View raw message