lucene-dev mailing list archives

Site index · List index
Message view « Date » · « Thread »
Top « Date » · « Thread »
From Michael McCandless <luc...@mikemccandless.com>
Subject Re: Build failed in Hudson: Lucene-trunk #399
Date Thu, 13 Mar 2008 09:06:03 GMT

Looks like Oracle finally shut off the old download location from  
Sleepycat.  It's been moved to a new location.  I'll commit a fix  
shortly.

Mike

On Mar 12, 2008, at 10:12 PM, Apache Hudson Server wrote:

> See http://hudson.zones.apache.org/hudson/job/Lucene-trunk/399/changes
>
> Changes:
>
> [mikemccand] LUCENE-1223: fix lazy field loading to not allow  
> string field to be loaded as binary, nor vice/versa
>
> [mikemccand] LUCENE-1214: preseve original exception in  
> SegmentInfos write & commit
>
> [mikemccand] LUCENE-1212: factor DocumentsWriter into separate  
> source files
>
> ------------------------------------------
> [...truncated 2190 lines...]
> javacc-notice:
>
> jflex-uptodate-check:
>
> jflex-notice:
>
> common.init:
>
> compile-demo:
>
> javacc-uptodate-check:
>
> javacc-notice:
>
> jflex-uptodate-check:
>
> jflex-notice:
>
> init:
>
> clover.setup:
>
> clover.info:
>
> clover:
>
> common.compile-core:
>
> compile-core:
>
> compile-demo:
>     [mkdir] Created dir: http://hudson.zones.apache.org/hudson/job/ 
> Lucene-trunk/ws/trunk/build/classes/demo
>     [javac] Compiling 17 source files to http:// 
> hudson.zones.apache.org/hudson/job/Lucene-trunk/ws/trunk/build/ 
> classes/demo
>
> compile-highlighter:
>      [echo] Building highlighter...
>
> javacc-uptodate-check:
>
> javacc-notice:
>
> jflex-uptodate-check:
>
> jflex-notice:
>
> common.init:
>
> build-lucene:
>
> init:
>
> clover.setup:
>
> clover.info:
>
> clover:
>
> compile-core:
>     [mkdir] Created dir: http://hudson.zones.apache.org/hudson/job/ 
> Lucene-trunk/ws/trunk/build/contrib/highlighter/classes/java
>     [javac] Compiling 18 source files to http:// 
> hudson.zones.apache.org/hudson/job/Lucene-trunk/ws/trunk/build/ 
> contrib/highlighter/classes/java
>     [javac] Note: http://hudson.zones.apache.org/hudson/job/Lucene- 
> trunk/ws/trunk/contrib/highlighter/src/java/org/apache/lucene/ 
> search/highlight/QueryScorer.java  uses or overrides a deprecated API.
>     [javac] Note: Recompile with -deprecation for details.
>
> compile:
>
> check-files:
>
> init:
>
> clover.setup:
>
> clover.info:
>
> clover:
>
> compile-core:
>     [mkdir] Created dir: http://hudson.zones.apache.org/hudson/job/ 
> Lucene-trunk/ws/trunk/build/contrib/benchmark/classes/java
>     [javac] Compiling 89 source files to http:// 
> hudson.zones.apache.org/hudson/job/Lucene-trunk/ws/trunk/build/ 
> contrib/benchmark/classes/java
>     [javac] Note: Some input files use or override a deprecated API.
>     [javac] Note: Recompile with -deprecation for details.
>
> jar-core:
>      [exec] Execute failed: java.io.IOException: svnversion: not found
>       [jar] Building jar: http://hudson.zones.apache.org/hudson/job/ 
> Lucene-trunk/ws/trunk/build/contrib/benchmark/lucene-benchmark-2.4- 
> SNAPSHOT.jar
>
> jar:
>
> compile-test:
>      [echo] Building benchmark...
>
> javacc-uptodate-check:
>
> javacc-notice:
>
> jflex-uptodate-check:
>
> jflex-notice:
>
> common.init:
>
> compile-demo:
>
> javacc-uptodate-check:
>
> javacc-notice:
>
> jflex-uptodate-check:
>
> jflex-notice:
>
> init:
>
> clover.setup:
>
> clover.info:
>
> clover:
>
> common.compile-core:
>
> compile-core:
>
> compile-demo:
>
> compile-highlighter:
>      [echo] Building highlighter...
>
> javacc-uptodate-check:
>
> javacc-notice:
>
> jflex-uptodate-check:
>
> jflex-notice:
>
> common.init:
>
> build-lucene:
>
> init:
>
> clover.setup:
>
> clover.info:
>
> clover:
>
> compile-core:
>
> compile:
>
> check-files:
>
> init:
>
> clover.setup:
>
> clover.info:
>
> clover:
>
> compile-core:
>
> common.compile-test:
>     [mkdir] Created dir: http://hudson.zones.apache.org/hudson/job/ 
> Lucene-trunk/ws/trunk/build/contrib/benchmark/classes/test
>     [javac] Compiling 5 source files to http:// 
> hudson.zones.apache.org/hudson/job/Lucene-trunk/ws/trunk/build/ 
> contrib/benchmark/classes/test
>      [copy] Copying 2 files to http://hudson.zones.apache.org/ 
> hudson/job/Lucene-trunk/ws/trunk/build/contrib/benchmark/classes/test
>
> build-artifacts-and-tests:
>
> bdb:
>      [echo] Building bdb...
>
> javacc-uptodate-check:
>
> javacc-notice:
>
> jflex-uptodate-check:
>
> jflex-notice:
>
> common.init:
>
> build-lucene:
>
> contrib-build.init:
>
> get-db-jar:
>     [mkdir] Created dir: http://hudson.zones.apache.org/hudson/job/ 
> Lucene-trunk/ws/trunk/contrib/db/bdb/lib
>       [get] Getting: http://downloads.osafoundation.org/db/ 
> db-4.3.29.jar
>       [get] To: http://hudson.zones.apache.org/hudson/job/Lucene- 
> trunk/ws/trunk/contrib/db/bdb/lib/db-4.3.29.jar
>
> check-and-get-db-jar:
>
> init:
>
> clover.setup:
>
> clover.info:
>
> clover:
>
> compile-core:
>     [mkdir] Created dir: http://hudson.zones.apache.org/hudson/job/ 
> Lucene-trunk/ws/trunk/build/contrib/db/bdb/classes/java
>     [javac] Compiling 7 source files to http:// 
> hudson.zones.apache.org/hudson/job/Lucene-trunk/ws/trunk/build/ 
> contrib/db/bdb/classes/java
>     [javac] Note: http://hudson.zones.apache.org/hudson/job/Lucene- 
> trunk/ws/trunk/contrib/db/bdb/src/java/org/apache/lucene/store/db/ 
> DbDirectory.java  uses or overrides a deprecated API.
>     [javac] Note: Recompile with -deprecation for details.
>
> jar-core:
>      [exec] Execute failed: java.io.IOException: svnversion: not found
>       [jar] Building jar: http://hudson.zones.apache.org/hudson/job/ 
> Lucene-trunk/ws/trunk/build/contrib/db/bdb/lucene-bdb-2.4-SNAPSHOT.jar
>
> default:
>
> bdb-je:
>      [echo] Building bdb-je...
>
> javacc-uptodate-check:
>
> javacc-notice:
>
> jflex-uptodate-check:
>
> jflex-notice:
>
> common.init:
>
> build-lucene:
>
> contrib-build.init:
>
> get-je-jar:
>     [mkdir] Created dir: http://hudson.zones.apache.org/hudson/job/ 
> Lucene-trunk/ws/trunk/contrib/db/bdb-je/lib
>       [get] Getting: http://downloads.sleepycat.com/je-2.0.90.zip
>       [get] To: http://hudson.zones.apache.org/hudson/job/Lucene- 
> trunk/ws/trunk/contrib/db/bdb-je/lib/je-2.0.90.zip
>       [get] Error opening connection java.io.FileNotFoundException:  
> http://downloads.sleepycat.com/je-2.0.90.zip
>       [get] Error opening connection java.io.FileNotFoundException:  
> http://downloads.sleepycat.com/je-2.0.90.zip
>       [get] Error opening connection java.io.FileNotFoundException:  
> http://downloads.sleepycat.com/je-2.0.90.zip
>       [get] Can't get http://downloads.sleepycat.com/je-2.0.90.zip  
> to http://hudson.zones.apache.org/hudson/job/Lucene-trunk/ws/trunk/ 
> contrib/db/bdb-je/lib/je-2.0.90.zip
>
> BUILD FAILED
> http://hudson.zones.apache.org/hudson/job/Lucene-trunk/ws/trunk/ 
> build.xml :551: The following error occurred while executing this  
> line:
> http://hudson.zones.apache.org/hudson/job/Lucene-trunk/ws/trunk/ 
> build.xml :541: The following error occurred while executing this  
> line:
> http://hudson.zones.apache.org/hudson/job/Lucene-trunk/ws/trunk/ 
> contrib/db/build.xml :33: The following error occurred while  
> executing this line:
> http://hudson.zones.apache.org/hudson/job/Lucene-trunk/ws/trunk/ 
> contrib/db/bdb-je/build.xml :29: Can't get http:// 
> downloads.sleepycat.com/je-2.0.90.zip to http:// 
> hudson.zones.apache.org/hudson/job/Lucene-trunk/ws/trunk/contrib/db/ 
> bdb-je/lib/je-2.0.90.zip
>
> Total time: 29 seconds
> Publishing Javadoc
> Recording test results
>
>
> ---------------------------------------------------------------------
> To unsubscribe, e-mail: java-dev-unsubscribe@lucene.apache.org
> For additional commands, e-mail: java-dev-help@lucene.apache.org
>


---------------------------------------------------------------------
To unsubscribe, e-mail: java-dev-unsubscribe@lucene.apache.org
For additional commands, e-mail: java-dev-help@lucene.apache.org


Mime
View raw message