lucene-dev mailing list archives

Site index · List index
Message view « Date » · « Thread »
Top « Date » · « Thread »
From Apache Hudson Server <hud...@hudson.zones.apache.org>
Subject Build failed in Hudson: Lucene-trunk #400
Date Fri, 14 Mar 2008 02:09:21 GMT
See http://hudson.zones.apache.org/hudson/job/Lucene-trunk/400/changes

Changes:

[buschmi] LUCENE-1226: Fixed IndexWriter.addIndexes(IndexReader[]) to commit successfully
created compound files.

[gsingers] LUCENE-550: put the comment in the wrong spot

[gsingers] LUCENE-550:  Added RAMDirectory alternative as a contrib. Similar to MemoryIndex,
but can hold more than one document

[mikemccand] download bdb zip from Oracle's servers

------------------------------------------
[...truncated 2478 lines...]
clover.info:

clover:

compile-core:
    [mkdir] Created dir: http://hudson.zones.apache.org/hudson/job/Lucene-trunk/ws/trunk/build/contrib/db/bdb-je/classes/java

    [javac] Compiling 6 source files to http://hudson.zones.apache.org/hudson/job/Lucene-trunk/ws/trunk/build/contrib/db/bdb-je/classes/java

    [javac] Note: http://hudson.zones.apache.org/hudson/job/Lucene-trunk/ws/trunk/contrib/db/bdb-je/src/java/org/apache/lucene/store/je/JEDirectory.java
 uses or overrides a deprecated API.
    [javac] Note: Recompile with -deprecation for details.

jar-core:
     [exec] Execute failed: java.io.IOException: svnversion: not found
      [jar] Building jar: http://hudson.zones.apache.org/hudson/job/Lucene-trunk/ws/trunk/build/contrib/db/bdb-je/lucene-bdb-je-2.4-SNAPSHOT.jar


default:

default:

compile-test:
     [echo] Building bdb...

javacc-uptodate-check:

javacc-notice:

jflex-uptodate-check:

jflex-notice:

common.init:

build-lucene:

contrib-build.init:

get-db-jar:

check-and-get-db-jar:

init:

compile-test:
     [echo] Building bdb...

javacc-uptodate-check:

javacc-notice:

jflex-uptodate-check:

jflex-notice:

common.init:

build-lucene:

contrib-build.init:

get-db-jar:

check-and-get-db-jar:

init:

clover.setup:

clover.info:

clover:

compile-core:

common.compile-test:
    [mkdir] Created dir: http://hudson.zones.apache.org/hudson/job/Lucene-trunk/ws/trunk/build/contrib/db/bdb/classes/test

    [javac] Compiling 2 source files to http://hudson.zones.apache.org/hudson/job/Lucene-trunk/ws/trunk/build/contrib/db/bdb/classes/test

     [echo] Building bdb-je...

javacc-uptodate-check:

javacc-notice:

jflex-uptodate-check:

jflex-notice:

common.init:

build-lucene:

contrib-build.init:

get-je-jar:

check-and-get-je-jar:

init:

compile-test:
     [echo] Building bdb-je...

javacc-uptodate-check:

javacc-notice:

jflex-uptodate-check:

jflex-notice:

common.init:

build-lucene:

contrib-build.init:

get-je-jar:

check-and-get-je-jar:

init:

clover.setup:

clover.info:

clover:

compile-core:

common.compile-test:
    [mkdir] Created dir: http://hudson.zones.apache.org/hudson/job/Lucene-trunk/ws/trunk/build/contrib/db/bdb-je/classes/test

    [javac] Compiling 1 source file to http://hudson.zones.apache.org/hudson/job/Lucene-trunk/ws/trunk/build/contrib/db/bdb-je/classes/test


build-artifacts-and-tests:
     [echo] Building highlighter...

javacc-uptodate-check:

javacc-notice:

jflex-uptodate-check:

jflex-notice:

common.init:

build-lucene:

init:

clover.setup:

clover.info:

clover:

compile-core:

jar-core:
     [exec] Execute failed: java.io.IOException: svnversion: not found
      [jar] Building jar: http://hudson.zones.apache.org/hudson/job/Lucene-trunk/ws/trunk/build/contrib/highlighter/lucene-highlighter-2.4-SNAPSHOT.jar


jar:

compile-test:
     [echo] Building highlighter...

javacc-uptodate-check:

javacc-notice:

jflex-uptodate-check:

jflex-notice:

common.init:

build-lucene:

init:

clover.setup:

clover.info:

clover:

compile-core:

common.compile-test:
    [mkdir] Created dir: http://hudson.zones.apache.org/hudson/job/Lucene-trunk/ws/trunk/build/contrib/highlighter/classes/test

    [javac] Compiling 1 source file to http://hudson.zones.apache.org/hudson/job/Lucene-trunk/ws/trunk/build/contrib/highlighter/classes/test

    [javac] Note: http://hudson.zones.apache.org/hudson/job/Lucene-trunk/ws/trunk/contrib/highlighter/src/test/org/apache/lucene/search/highlight/HighlighterTest.java
 uses or overrides a deprecated API.
    [javac] Note: Recompile with -deprecation for details.

build-artifacts-and-tests:
     [echo] Building instantiated...

javacc-uptodate-check:

javacc-notice:

jflex-uptodate-check:

jflex-notice:

common.init:

build-lucene:

init:

clover.setup:

clover.info:

clover:

compile-core:
    [mkdir] Created dir: http://hudson.zones.apache.org/hudson/job/Lucene-trunk/ws/trunk/build/contrib/instantiated/classes/java

    [javac] Compiling 11 source files to http://hudson.zones.apache.org/hudson/job/Lucene-trunk/ws/trunk/build/contrib/instantiated/classes/java

    [javac] javac: invalid target release: 1.5
    [javac] Usage: javac <options> <source files>
    [javac] where possible options include:
    [javac]   -g                        Generate all debugging info
    [javac]   -g:none                   Generate no debugging info
    [javac]   -g:{lines,vars,source}    Generate only some debugging info
    [javac]   -nowarn                   Generate no warnings
    [javac]   -verbose                  Output messages about what the compiler is doing
    [javac]   -deprecation              Output source locations where deprecated APIs are
used
    [javac]   -classpath <path>         Specify where to find user class files
    [javac]   -sourcepath <path>        Specify where to find input source files
    [javac]   -bootclasspath <path>     Override location of bootstrap class files
    [javac]   -extdirs <dirs>           Override location of installed extensions
    [javac]   -d <directory>            Specify where to place generated class files
    [javac]   -encoding <encoding>      Specify character encoding used by source files
    [javac]   -source <release>         Provide source compatibility with specified
release
    [javac]   -target <release>         Generate class files for specific VM version
    [javac]   -help                     Print a synopsis of standard options
    [javac] 

BUILD FAILED
http://hudson.zones.apache.org/hudson/job/Lucene-trunk/ws/trunk/build.xml :551: The following
error occurred while executing this line:
http://hudson.zones.apache.org/hudson/job/Lucene-trunk/ws/trunk/build.xml :541: The following
error occurred while executing this line:
http://hudson.zones.apache.org/hudson/job/Lucene-trunk/ws/trunk/common-build.xml :222: The
following error occurred while executing this line:
http://hudson.zones.apache.org/hudson/job/Lucene-trunk/ws/trunk/common-build.xml :471: Compile
failed; see the compiler error output for details.

Total time: 37 seconds
Publishing Javadoc
Recording test results


---------------------------------------------------------------------
To unsubscribe, e-mail: java-dev-unsubscribe@lucene.apache.org
For additional commands, e-mail: java-dev-help@lucene.apache.org


Mime
View raw message