lucene-dev mailing list archives

Site index · List index
Message view « Date » · « Thread »
Top « Date » · « Thread »
From Apache Hudson Server <hud...@hudson.zones.apache.org>
Subject Build failed in Hudson: Lucene-trunk #419
Date Sat, 29 Mar 2008 04:39:58 GMT
See http://hudson.zones.apache.org/hudson/job/Lucene-trunk/419/changes

Changes:

[mikemccand] LUCENE-1251: be sure to close the descriptor even if super.close() hits an exception,
in FSIndexOutput.close

[mikemccand] LUCENE-1247: remove always-true assert

------------------------------------------
[...truncated 13606 lines...]
    [junit] Tests run: 25, Failures: 0, Errors: 0, Time elapsed: 1.209 sec
    [junit] 
    [junit] ------------- Standard Output ---------------
    [junit] Result: (fieldX:xxxxx fieldy:xxxxxxxx)^2.0
    [junit] ------------- ---------------- ---------------
    [junit] Testsuite: org.apache.lucene.search.TestBoolean2
    [junit] Tests run: 11, Failures: 0, Errors: 0, Time elapsed: 18.901 sec
    [junit] 
    [junit] Testsuite: org.apache.lucene.search.TestBooleanMinShouldMatch
    [junit] Tests run: 15, Failures: 0, Errors: 0, Time elapsed: 38.05 sec
    [junit] 
    [junit] Testsuite: org.apache.lucene.search.TestBooleanOr
    [junit] Tests run: 5, Failures: 0, Errors: 0, Time elapsed: 2.082 sec
    [junit] 
    [junit] Testsuite: org.apache.lucene.search.TestBooleanPrefixQuery
    [junit] Tests run: 1, Failures: 0, Errors: 0, Time elapsed: 2.287 sec
    [junit] 
    [junit] Testsuite: org.apache.lucene.search.TestBooleanQuery
    [junit] Tests run: 2, Failures: 0, Errors: 0, Time elapsed: 0.414 sec
    [junit] 
    [junit] Testsuite: org.apache.lucene.search.TestBooleanScorer
    [junit] Tests run: 1, Failures: 0, Errors: 0, Time elapsed: 0.762 sec
    [junit] 
    [junit] Testsuite: org.apache.lucene.search.TestCachingWrapperFilter
    [junit] Tests run: 1, Failures: 0, Errors: 0, Time elapsed: 1.805 sec
    [junit] 
    [junit] Testsuite: org.apache.lucene.search.TestComplexExplanations
    [junit] Tests run: 22, Failures: 0, Errors: 0, Time elapsed: 6.201 sec
    [junit] 
    [junit] Testsuite: org.apache.lucene.search.TestComplexExplanationsOfNonMatches
    [junit] Tests run: 22, Failures: 0, Errors: 0, Time elapsed: 1.108 sec
    [junit] 
    [junit] Testsuite: org.apache.lucene.search.TestConstantScoreRangeQuery
    [junit] Tests run: 7, Failures: 0, Errors: 0, Time elapsed: 5.572 sec
    [junit] 
    [junit] Testsuite: org.apache.lucene.search.TestCustomSearcherSort
    [junit] Tests run: 3, Failures: 0, Errors: 0, Time elapsed: 9.691 sec
    [junit] 
    [junit] Testsuite: org.apache.lucene.search.TestDateFilter
    [junit] Tests run: 2, Failures: 0, Errors: 0, Time elapsed: 1.414 sec
    [junit] 
    [junit] Testsuite: org.apache.lucene.search.TestDateSort
    [junit] Tests run: 1, Failures: 0, Errors: 0, Time elapsed: 1.967 sec
    [junit] 
    [junit] Testsuite: org.apache.lucene.search.TestDisjunctionMaxQuery
    [junit] Tests run: 10, Failures: 0, Errors: 0, Time elapsed: 5.381 sec
    [junit] 
    [junit] Testsuite: org.apache.lucene.search.TestDocBoost
    [junit] Tests run: 1, Failures: 0, Errors: 0, Time elapsed: 1.338 sec
    [junit] 
    [junit] Testsuite: org.apache.lucene.search.TestExplanations
    [junit] Tests run: 1, Failures: 0, Errors: 0, Time elapsed: 3.698 sec
    [junit] 
    [junit] Testsuite: org.apache.lucene.search.TestExtendedFieldCache
    [junit] Tests run: 1, Failures: 0, Errors: 0, Time elapsed: 7.332 sec
    [junit] 
    [junit] Testsuite: org.apache.lucene.search.TestFilteredQuery
    [junit] Tests run: 3, Failures: 0, Errors: 0, Time elapsed: 2.507 sec
    [junit] 
    [junit] Testsuite: org.apache.lucene.search.TestFilteredSearch
    [junit] Tests run: 1, Failures: 0, Errors: 0, Time elapsed: 3.308 sec
    [junit] 
    [junit] Testsuite: org.apache.lucene.search.TestFuzzyQuery
    [junit] Tests run: 2, Failures: 0, Errors: 0, Time elapsed: 1.022 sec
    [junit] 
    [junit] Testsuite: org.apache.lucene.search.TestMatchAllDocsQuery
    [junit] Tests run: 2, Failures: 0, Errors: 0, Time elapsed: 1.093 sec
    [junit] 
    [junit] Testsuite: org.apache.lucene.search.TestMultiPhraseQuery
    [junit] Tests run: 3, Failures: 0, Errors: 0, Time elapsed: 1.691 sec
    [junit] 
    [junit] Testsuite: org.apache.lucene.search.TestMultiSearcher
    [junit] Tests run: 4, Failures: 0, Errors: 0, Time elapsed: 0.981 sec
    [junit] 
    [junit] Testsuite: org.apache.lucene.search.TestMultiSearcherRanking
    [junit] Tests run: 7, Failures: 0, Errors: 0, Time elapsed: 1.398 sec
    [junit] 
    [junit] Testsuite: org.apache.lucene.search.TestMultiThreadTermVectors
    [junit] Tests run: 1, Failures: 0, Errors: 0, Time elapsed: 4.125 sec
    [junit] 
    [junit] Testsuite: org.apache.lucene.search.TestNot
    [junit] Tests run: 1, Failures: 0, Errors: 0, Time elapsed: 1.076 sec
    [junit] 
    [junit] Testsuite: org.apache.lucene.search.TestParallelMultiSearcher
    [junit] Tests run: 4, Failures: 0, Errors: 0, Time elapsed: 1.069 sec
    [junit] 
    [junit] Testsuite: org.apache.lucene.search.TestPhrasePrefixQuery
    [junit] Tests run: 1, Failures: 0, Errors: 0, Time elapsed: 3.047 sec
    [junit] 
    [junit] Testsuite: org.apache.lucene.search.TestPhraseQuery
    [junit] Tests run: 13, Failures: 0, Errors: 0, Time elapsed: 5.093 sec
    [junit] 
    [junit] Testsuite: org.apache.lucene.search.TestPositionIncrement
    [junit] Tests run: 2, Failures: 0, Errors: 0, Time elapsed: 1.198 sec
    [junit] 
    [junit] Testsuite: org.apache.lucene.search.TestPrefixFilter
    [junit] Tests run: 1, Failures: 0, Errors: 0, Time elapsed: 1.388 sec
    [junit] 
    [junit] Testsuite: org.apache.lucene.search.TestPrefixQuery
    [junit] Tests run: 1, Failures: 0, Errors: 0, Time elapsed: 1.29 sec
    [junit] 
    [junit] Testsuite: org.apache.lucene.search.TestQueryTermVector
    [junit] Tests run: 1, Failures: 0, Errors: 0, Time elapsed: 1.258 sec
    [junit] 
    [junit] Testsuite: org.apache.lucene.search.TestRangeFilter
    [junit] Tests run: 3, Failures: 0, Errors: 0, Time elapsed: 7.334 sec
    [junit] 
    [junit] Testsuite: org.apache.lucene.search.TestRangeQuery
    [junit] Tests run: 3, Failures: 0, Errors: 0, Time elapsed: 1.112 sec
    [junit] 
    [junit] Testsuite: org.apache.lucene.search.TestRemoteCachingWrapperFilter
    [junit] Tests run: 1, Failures: 0, Errors: 0, Time elapsed: 3.136 sec
    [junit] 
    [junit] Testsuite: org.apache.lucene.search.TestRemoteSearchable
    [junit] Tests run: 5, Failures: 0, Errors: 0, Time elapsed: 6.523 sec
    [junit] 
    [junit] Testsuite: org.apache.lucene.search.TestScorerPerf
    [junit] Tests run: 1, Failures: 0, Errors: 0, Time elapsed: 1.704 sec
    [junit] 
    [junit] ------------- Standard Output ---------------
    [junit] Average number of matches=0
    [junit] ------------- ---------------- ---------------
    [junit] Testsuite: org.apache.lucene.search.TestSearchHitsWithDeletions
    [junit] Tests run: 9, Failures: 0, Errors: 0, Time elapsed: 26.404 sec
    [junit] 
    [junit] Testsuite: org.apache.lucene.search.TestSetNorm
    [junit] Tests run: 1, Failures: 0, Errors: 0, Time elapsed: 0.839 sec
    [junit] 
    [junit] Testsuite: org.apache.lucene.search.TestSimilarity
    [junit] Tests run: 1, Failures: 0, Errors: 0, Time elapsed: 2.55 sec
    [junit] 
    [junit] Testsuite: org.apache.lucene.search.TestSimpleExplanations
    [junit] Tests run: 52, Failures: 0, Errors: 0, Time elapsed: 4.788 sec
    [junit] 
    [junit] Testsuite: org.apache.lucene.search.TestSimpleExplanationsOfNonMatches
    [junit] Tests run: 52, Failures: 0, Errors: 0, Time elapsed: 2.446 sec
    [junit] 
    [junit] Testsuite: org.apache.lucene.search.TestSort
    [junit] Tests run: 17, Failures: 0, Errors: 0, Time elapsed: 5.897 sec
    [junit] 
    [junit] Testsuite: org.apache.lucene.search.TestSpanQueryFilter
    [junit] Tests run: 1, Failures: 0, Errors: 0, Time elapsed: 1.108 sec
    [junit] 
    [junit] Testsuite: org.apache.lucene.search.TestTermScorer
    [junit] Tests run: 4, Failures: 0, Errors: 0, Time elapsed: 0.952 sec
    [junit] 
    [junit] Testsuite: org.apache.lucene.search.TestTermVectors
    [junit] Tests run: 8, Failures: 0, Errors: 0, Time elapsed: 3.96 sec
    [junit] 
    [junit] Testsuite: org.apache.lucene.search.TestThreadSafe
    [junit] Tests run: 1, Failures: 0, Errors: 0, Time elapsed: 109.578 sec
    [junit] 
    [junit] Testsuite: org.apache.lucene.search.TestTimeLimitedCollector
    [junit] Tests run: 6, Failures: 2, Errors: 0, Time elapsed: 18.678 sec
    [junit] 
    [junit] Testcase: testTimeoutGreedy(org.apache.lucene.search.TestTimeLimitedCollector):
FAILED
    [junit] lastDoc=24 ,&& allowed=799 ,&& elapsed=1020 >= 886 = ( 2*resolution
+  TIME_ALLOWED + SLOW_DOWN = 2*20 + 799 + 47)
    [junit] junit.framework.AssertionFailedError: lastDoc=24 ,&& allowed=799 ,&&
elapsed=1020 >= 886 = ( 2*resolution +  TIME_ALLOWED + SLOW_DOWN = 2*20 + 799 + 47)
    [junit] 	at org.apache.lucene.search.TestTimeLimitedCollector.doTestTimeout(TestTimeLimitedCollector.java:189)
    [junit] 	at org.apache.lucene.search.TestTimeLimitedCollector.testTimeoutGreedy(TestTimeLimitedCollector.java:143)
    [junit] 
    [junit] 
    [junit] Testcase: testTimeoutNotGreedy(org.apache.lucene.search.TestTimeLimitedCollector):
FAILED
    [junit] lastDoc=18 ,&& allowed=799 ,&& elapsed=1200 >= 886 = ( 2*resolution
+  TIME_ALLOWED + SLOW_DOWN = 2*20 + 799 + 47)
    [junit] junit.framework.AssertionFailedError: lastDoc=18 ,&& allowed=799 ,&&
elapsed=1200 >= 886 = ( 2*resolution +  TIME_ALLOWED + SLOW_DOWN = 2*20 + 799 + 47)
    [junit] 	at org.apache.lucene.search.TestTimeLimitedCollector.doTestTimeout(TestTimeLimitedCollector.java:189)
    [junit] 	at org.apache.lucene.search.TestTimeLimitedCollector.testTimeoutNotGreedy(TestTimeLimitedCollector.java:150)
    [junit] 
    [junit] 
    [junit] Test org.apache.lucene.search.TestTimeLimitedCollector FAILED
    [junit] Testsuite: org.apache.lucene.search.TestWildcard
    [junit] Tests run: 5, Failures: 0, Errors: 0, Time elapsed: 1.317 sec
    [junit] 
    [junit] Testsuite: org.apache.lucene.search.function.TestCustomScoreQuery
    [junit] Tests run: 4, Failures: 0, Errors: 0, Time elapsed: 58.388 sec
    [junit] 
    [junit] Testsuite: org.apache.lucene.search.function.TestFieldScoreQuery
    [junit] Tests run: 12, Failures: 0, Errors: 0, Time elapsed: 1.679 sec
    [junit] 
    [junit] Testsuite: org.apache.lucene.search.function.TestOrdValues
    [junit] Tests run: 5, Failures: 0, Errors: 0, Time elapsed: 1.628 sec
    [junit] 
    [junit] Testsuite: org.apache.lucene.search.payloads.TestBoostingTermQuery
    [junit] Tests run: 4, Failures: 0, Errors: 0, Time elapsed: 3.323 sec
    [junit] 
    [junit] Testsuite: org.apache.lucene.search.spans.TestBasics
    [junit] Tests run: 19, Failures: 0, Errors: 0, Time elapsed: 35.403 sec
    [junit] 
    [junit] Testsuite: org.apache.lucene.search.spans.TestNearSpansOrdered
    [junit] Tests run: 10, Failures: 0, Errors: 0, Time elapsed: 1.127 sec
    [junit] 
    [junit] Testsuite: org.apache.lucene.search.spans.TestSpanExplanations
    [junit] Tests run: 31, Failures: 0, Errors: 0, Time elapsed: 1.831 sec
    [junit] 
    [junit] Testsuite: org.apache.lucene.search.spans.TestSpanExplanationsOfNonMatches
    [junit] Tests run: 31, Failures: 0, Errors: 0, Time elapsed: 1.399 sec
    [junit] 
    [junit] Testsuite: org.apache.lucene.search.spans.TestSpans
    [junit] Tests run: 21, Failures: 0, Errors: 0, Time elapsed: 3.496 sec
    [junit] 
    [junit] Testsuite: org.apache.lucene.search.spans.TestSpansAdvanced
    [junit] Tests run: 1, Failures: 0, Errors: 0, Time elapsed: 2.771 sec
    [junit] 
    [junit] Testsuite: org.apache.lucene.search.spans.TestSpansAdvanced2
    [junit] Tests run: 4, Failures: 0, Errors: 0, Time elapsed: 3.096 sec
    [junit] 
    [junit] Testsuite: org.apache.lucene.store.TestBufferedIndexInput
    [junit] Tests run: 4, Failures: 0, Errors: 0, Time elapsed: 2.469 sec
    [junit] 
    [junit] Testsuite: org.apache.lucene.store.TestHugeRamFile
    [junit] Tests run: 1, Failures: 0, Errors: 0, Time elapsed: 4.739 sec
    [junit] 
    [junit] Testsuite: org.apache.lucene.store.TestLock
    [junit] Tests run: 1, Failures: 0, Errors: 0, Time elapsed: 0.514 sec
    [junit] 
    [junit] Testsuite: org.apache.lucene.store.TestLockFactory
    [junit] Tests run: 13, Failures: 0, Errors: 0, Time elapsed: 7.169 sec
    [junit] 
    [junit] Testsuite: org.apache.lucene.store.TestMMapDirectory
    [junit] Tests run: 1, Failures: 0, Errors: 0, Time elapsed: 1.813 sec
    [junit] 
    [junit] Testsuite: org.apache.lucene.store.TestWindowsMMap
    [junit] Tests run: 1, Failures: 0, Errors: 0, Time elapsed: 4.005 sec
    [junit] 
    [junit] Testsuite: org.apache.lucene.util.TestBitVector
    [junit] Tests run: 6, Failures: 0, Errors: 0, Time elapsed: 4.68 sec
    [junit] 
    [junit] Testsuite: org.apache.lucene.util.TestOpenBitSet
    [junit] Tests run: 3, Failures: 0, Errors: 0, Time elapsed: 1.395 sec
    [junit] 
    [junit] Testsuite: org.apache.lucene.util.TestPriorityQueue
    [junit] Tests run: 4, Failures: 0, Errors: 0, Time elapsed: 0.628 sec
    [junit] 
    [junit] Testsuite: org.apache.lucene.util.TestSmallFloat
    [junit] Tests run: 2, Failures: 0, Errors: 0, Time elapsed: 0.988 sec
    [junit] 
    [junit] Testsuite: org.apache.lucene.util.TestSortedVIntList
    [junit] Tests run: 19, Failures: 0, Errors: 0, Time elapsed: 0.881 sec
    [junit] 
    [junit] Testsuite: org.apache.lucene.util.TestStringHelper
    [junit] Tests run: 1, Failures: 0, Errors: 0, Time elapsed: 0.502 sec
    [junit] 

BUILD FAILED
http://hudson.zones.apache.org/hudson/job/Lucene-trunk/ws/trunk/common-build.xml :383: Tests
failed!

Total time: 65 minutes 6 seconds
Publishing Javadoc
Recording test results


---------------------------------------------------------------------
To unsubscribe, e-mail: java-dev-unsubscribe@lucene.apache.org
For additional commands, e-mail: java-dev-help@lucene.apache.org


Mime
View raw message