lucene-dev mailing list archives

Site index · List index
Message view « Date » · « Thread »
Top « Date » · « Thread »
From Apache Hudson Server <hud...@hudson.zones.apache.org>
Subject Build failed in Hudson: Lucene-trunk #408
Date Tue, 18 Mar 2008 02:55:36 GMT
See http://hudson.zones.apache.org/hudson/job/Lucene-trunk/408/changes

Changes:

[doronc] fix formatting in CHANGES.txt to prevent perl errors in creating changes.html.

[mikemccand] LUCENE-1233: correct javadocs

------------------------------------------
[...truncated 5827 lines...]
    [junit] 
    [junit] Testsuite: org.apache.lucene.search.TestBooleanMinShouldMatch
    [junit] Tests run: 15, Failures: 0, Errors: 0, Time elapsed: 19.619 sec
    [junit] 
    [junit] Testsuite: org.apache.lucene.search.TestBooleanOr
    [junit] Tests run: 5, Failures: 0, Errors: 0, Time elapsed: 1.472 sec
    [junit] 
    [junit] Testsuite: org.apache.lucene.search.TestBooleanPrefixQuery
    [junit] Tests run: 1, Failures: 0, Errors: 0, Time elapsed: 0.66 sec
    [junit] 
    [junit] Testsuite: org.apache.lucene.search.TestBooleanQuery
    [junit] Tests run: 2, Failures: 0, Errors: 0, Time elapsed: 0.391 sec
    [junit] 
    [junit] Testsuite: org.apache.lucene.search.TestBooleanScorer
    [junit] Tests run: 1, Failures: 0, Errors: 0, Time elapsed: 0.638 sec
    [junit] 
    [junit] Testsuite: org.apache.lucene.search.TestCachingWrapperFilter
    [junit] Tests run: 1, Failures: 0, Errors: 0, Time elapsed: 0.458 sec
    [junit] 
    [junit] Testsuite: org.apache.lucene.search.TestComplexExplanations
    [junit] Tests run: 22, Failures: 0, Errors: 0, Time elapsed: 2.21 sec
    [junit] 
    [junit] Testsuite: org.apache.lucene.search.TestComplexExplanationsOfNonMatches
    [junit] Tests run: 22, Failures: 0, Errors: 0, Time elapsed: 1.286 sec
    [junit] 
    [junit] Testsuite: org.apache.lucene.search.TestConstantScoreRangeQuery
    [junit] Tests run: 7, Failures: 0, Errors: 0, Time elapsed: 1.553 sec
    [junit] 
    [junit] Testsuite: org.apache.lucene.search.TestCustomSearcherSort
    [junit] Tests run: 3, Failures: 0, Errors: 0, Time elapsed: 2.17 sec
    [junit] 
    [junit] Testsuite: org.apache.lucene.search.TestDateFilter
    [junit] Tests run: 2, Failures: 0, Errors: 0, Time elapsed: 0.485 sec
    [junit] 
    [junit] Testsuite: org.apache.lucene.search.TestDateSort
    [junit] Tests run: 1, Failures: 0, Errors: 0, Time elapsed: 0.448 sec
    [junit] 
    [junit] Testsuite: org.apache.lucene.search.TestDisjunctionMaxQuery
    [junit] Tests run: 10, Failures: 0, Errors: 0, Time elapsed: 1.062 sec
    [junit] 
    [junit] Testsuite: org.apache.lucene.search.TestDocBoost
    [junit] Tests run: 1, Failures: 0, Errors: 0, Time elapsed: 0.559 sec
    [junit] 
    [junit] Testsuite: org.apache.lucene.search.TestExplanations
    [junit] Tests run: 1, Failures: 0, Errors: 0, Time elapsed: 1.802 sec
    [junit] 
    [junit] Testsuite: org.apache.lucene.search.TestExtendedFieldCache
    [junit] Tests run: 1, Failures: 0, Errors: 0, Time elapsed: 2.886 sec
    [junit] 
    [junit] Testsuite: org.apache.lucene.search.TestFilteredQuery
    [junit] Tests run: 3, Failures: 0, Errors: 0, Time elapsed: 0.984 sec
    [junit] 
    [junit] Testsuite: org.apache.lucene.search.TestFilteredSearch
    [junit] Tests run: 1, Failures: 0, Errors: 0, Time elapsed: 0.405 sec
    [junit] 
    [junit] Testsuite: org.apache.lucene.search.TestFuzzyQuery
    [junit] Tests run: 2, Failures: 0, Errors: 0, Time elapsed: 0.761 sec
    [junit] 
    [junit] Testsuite: org.apache.lucene.search.TestMatchAllDocsQuery
    [junit] Tests run: 2, Failures: 0, Errors: 0, Time elapsed: 0.513 sec
    [junit] 
    [junit] Testsuite: org.apache.lucene.search.TestMultiPhraseQuery
    [junit] Tests run: 3, Failures: 0, Errors: 0, Time elapsed: 0.547 sec
    [junit] 
    [junit] Testsuite: org.apache.lucene.search.TestMultiSearcher
    [junit] Tests run: 4, Failures: 0, Errors: 0, Time elapsed: 1.153 sec
    [junit] 
    [junit] Testsuite: org.apache.lucene.search.TestMultiSearcherRanking
    [junit] Tests run: 7, Failures: 0, Errors: 0, Time elapsed: 0.565 sec
    [junit] 
    [junit] Testsuite: org.apache.lucene.search.TestMultiThreadTermVectors
    [junit] Tests run: 1, Failures: 0, Errors: 0, Time elapsed: 1.306 sec
    [junit] 
    [junit] Testsuite: org.apache.lucene.search.TestNot
    [junit] Tests run: 1, Failures: 0, Errors: 0, Time elapsed: 0.43 sec
    [junit] 
    [junit] Testsuite: org.apache.lucene.search.TestParallelMultiSearcher
    [junit] Tests run: 4, Failures: 0, Errors: 0, Time elapsed: 0.557 sec
    [junit] 
    [junit] Testsuite: org.apache.lucene.search.TestPhrasePrefixQuery
    [junit] Tests run: 1, Failures: 0, Errors: 0, Time elapsed: 0.538 sec
    [junit] 
    [junit] Testsuite: org.apache.lucene.search.TestPhraseQuery
    [junit] Tests run: 13, Failures: 0, Errors: 0, Time elapsed: 3.787 sec
    [junit] 
    [junit] Testsuite: org.apache.lucene.search.TestPositionIncrement
    [junit] Tests run: 2, Failures: 0, Errors: 0, Time elapsed: 0.464 sec
    [junit] 
    [junit] Testsuite: org.apache.lucene.search.TestPrefixFilter
    [junit] Tests run: 1, Failures: 0, Errors: 0, Time elapsed: 0.865 sec
    [junit] 
    [junit] Testsuite: org.apache.lucene.search.TestPrefixQuery
    [junit] Tests run: 1, Failures: 0, Errors: 0, Time elapsed: 0.563 sec
    [junit] 
    [junit] Testsuite: org.apache.lucene.search.TestQueryTermVector
    [junit] Tests run: 1, Failures: 0, Errors: 0, Time elapsed: 0.293 sec
    [junit] 
    [junit] Testsuite: org.apache.lucene.search.TestRangeFilter
    [junit] Tests run: 3, Failures: 0, Errors: 0, Time elapsed: 3.76 sec
    [junit] 
    [junit] Testsuite: org.apache.lucene.search.TestRangeQuery
    [junit] Tests run: 3, Failures: 0, Errors: 0, Time elapsed: 0.829 sec
    [junit] 
    [junit] Testsuite: org.apache.lucene.search.TestRemoteCachingWrapperFilter
    [junit] Tests run: 1, Failures: 0, Errors: 0, Time elapsed: 2.218 sec
    [junit] 
    [junit] Testsuite: org.apache.lucene.search.TestRemoteSearchable
    [junit] Tests run: 5, Failures: 0, Errors: 0, Time elapsed: 1.255 sec
    [junit] 
    [junit] Testsuite: org.apache.lucene.search.TestScorerPerf
    [junit] Tests run: 1, Failures: 0, Errors: 0, Time elapsed: 5.488 sec
    [junit] 
    [junit] ------------- Standard Output ---------------
    [junit] Average number of matches=0
    [junit] ------------- ---------------- ---------------
    [junit] Testsuite: org.apache.lucene.search.TestSearchHitsWithDeletions
    [junit] Tests run: 9, Failures: 0, Errors: 0, Time elapsed: 13.386 sec
    [junit] 
    [junit] Testsuite: org.apache.lucene.search.TestSetNorm
    [junit] Tests run: 1, Failures: 0, Errors: 0, Time elapsed: 0.454 sec
    [junit] 
    [junit] Testsuite: org.apache.lucene.search.TestSimilarity
    [junit] Tests run: 1, Failures: 0, Errors: 0, Time elapsed: 0.462 sec
    [junit] 
    [junit] Testsuite: org.apache.lucene.search.TestSimpleExplanations
    [junit] Tests run: 52, Failures: 0, Errors: 0, Time elapsed: 3.674 sec
    [junit] 
    [junit] Testsuite: org.apache.lucene.search.TestSimpleExplanationsOfNonMatches
    [junit] Tests run: 52, Failures: 0, Errors: 0, Time elapsed: 1.299 sec
    [junit] 
    [junit] Testsuite: org.apache.lucene.search.TestSort
    [junit] Tests run: 17, Failures: 0, Errors: 0, Time elapsed: 5.401 sec
    [junit] 
    [junit] Testsuite: org.apache.lucene.search.TestSpanQueryFilter
    [junit] Tests run: 1, Failures: 0, Errors: 0, Time elapsed: 0.756 sec
    [junit] 
    [junit] Testsuite: org.apache.lucene.search.TestTermScorer
    [junit] Tests run: 4, Failures: 0, Errors: 0, Time elapsed: 0.655 sec
    [junit] 
    [junit] Testsuite: org.apache.lucene.search.TestTermVectors
    [junit] Tests run: 8, Failures: 0, Errors: 0, Time elapsed: 1.907 sec
    [junit] 
    [junit] Testsuite: org.apache.lucene.search.TestThreadSafe
    [junit] Tests run: 1, Failures: 0, Errors: 0, Time elapsed: 8.668 sec
    [junit] 
    [junit] Testsuite: org.apache.lucene.search.TestTimeLimitedCollector
    [junit] Tests run: 5, Failures: 1, Errors: 0, Time elapsed: 13.849 sec
    [junit] 
    [junit] ------------- Standard Error -----------------
    [junit] Exception in thread "Thread-97" junit.framework.AssertionFailedError: no hits
found!
    [junit] 	at junit.framework.Assert.fail(Assert.java:47)
    [junit] 	at junit.framework.Assert.assertTrue(Assert.java:20)
    [junit] 	at org.apache.lucene.search.TestTimeLimitedCollector.doTestTimeout(TestTimeLimitedCollector.java:152)
    [junit] 	at org.apache.lucene.search.TestTimeLimitedCollector.access$100(TestTimeLimitedCollector.java:38)
    [junit] 	at org.apache.lucene.search.TestTimeLimitedCollector$1.run(TestTimeLimitedCollector.java:231)
    [junit] Exception in thread "Thread-85" junit.framework.AssertionFailedError: no hits
found!
    [junit] 	at junit.framework.Assert.fail(Assert.java:47)
    [junit] 	at junit.framework.Assert.assertTrue(Assert.java:20)
    [junit] 	at org.apache.lucene.search.TestTimeLimitedCollector.doTestTimeout(TestTimeLimitedCollector.java:152)
    [junit] 	at org.apache.lucene.search.TestTimeLimitedCollector.access$100(TestTimeLimitedCollector.java:38)
    [junit] 	at org.apache.lucene.search.TestTimeLimitedCollector$1.run(TestTimeLimitedCollector.java:231)
    [junit] ------------- ---------------- ---------------
    [junit] Testcase: testTimeoutMultiThreaded(org.apache.lucene.search.TestTimeLimitedCollector):
FAILED
    [junit] some threads failed! expected:<50> but was:<48>
    [junit] junit.framework.AssertionFailedError: some threads failed! expected:<50>
but was:<48>
    [junit] 	at org.apache.lucene.search.TestTimeLimitedCollector.doTestMultiThreads(TestTimeLimitedCollector.java:255)
    [junit] 	at org.apache.lucene.search.TestTimeLimitedCollector.testTimeoutMultiThreaded(TestTimeLimitedCollector.java:220)
    [junit] 
    [junit] 
    [junit] Test org.apache.lucene.search.TestTimeLimitedCollector FAILED
    [junit] Testsuite: org.apache.lucene.search.TestWildcard
    [junit] Tests run: 5, Failures: 0, Errors: 0, Time elapsed: 0.574 sec
    [junit] 
    [junit] Testsuite: org.apache.lucene.search.function.TestCustomScoreQuery
    [junit] Tests run: 4, Failures: 0, Errors: 0, Time elapsed: 49.04 sec
    [junit] 
    [junit] Testsuite: org.apache.lucene.search.function.TestFieldScoreQuery
    [junit] Tests run: 12, Failures: 0, Errors: 0, Time elapsed: 1.982 sec
    [junit] 
    [junit] Testsuite: org.apache.lucene.search.function.TestOrdValues
    [junit] Tests run: 5, Failures: 0, Errors: 0, Time elapsed: 1.072 sec
    [junit] 
    [junit] Testsuite: org.apache.lucene.search.payloads.TestBoostingTermQuery
    [junit] Tests run: 4, Failures: 0, Errors: 0, Time elapsed: 2.308 sec
    [junit] 
    [junit] Testsuite: org.apache.lucene.search.spans.TestBasics
    [junit] Tests run: 19, Failures: 0, Errors: 0, Time elapsed: 19.05 sec
    [junit] 
    [junit] Testsuite: org.apache.lucene.search.spans.TestNearSpansOrdered
    [junit] Tests run: 10, Failures: 0, Errors: 0, Time elapsed: 1.193 sec
    [junit] 
    [junit] Testsuite: org.apache.lucene.search.spans.TestSpanExplanations
    [junit] Tests run: 31, Failures: 0, Errors: 0, Time elapsed: 2.941 sec
    [junit] 
    [junit] Testsuite: org.apache.lucene.search.spans.TestSpanExplanationsOfNonMatches
    [junit] Tests run: 31, Failures: 0, Errors: 0, Time elapsed: 1.331 sec
    [junit] 
    [junit] Testsuite: org.apache.lucene.search.spans.TestSpans
    [junit] Tests run: 21, Failures: 0, Errors: 0, Time elapsed: 4.899 sec
    [junit] 
    [junit] Testsuite: org.apache.lucene.search.spans.TestSpansAdvanced
    [junit] Tests run: 1, Failures: 0, Errors: 0, Time elapsed: 1.4 sec
    [junit] 
    [junit] Testsuite: org.apache.lucene.search.spans.TestSpansAdvanced2
    [junit] Tests run: 4, Failures: 0, Errors: 0, Time elapsed: 1.328 sec
    [junit] 
    [junit] Testsuite: org.apache.lucene.store.TestBufferedIndexInput
    [junit] Tests run: 4, Failures: 0, Errors: 0, Time elapsed: 2.039 sec
    [junit] 
    [junit] Testsuite: org.apache.lucene.store.TestHugeRamFile
    [junit] Tests run: 1, Failures: 0, Errors: 0, Time elapsed: 7.61 sec
    [junit] 
    [junit] Testsuite: org.apache.lucene.store.TestLock
    [junit] Tests run: 1, Failures: 0, Errors: 0, Time elapsed: 0.483 sec
    [junit] 
    [junit] Testsuite: org.apache.lucene.store.TestLockFactory
    [junit] Tests run: 13, Failures: 0, Errors: 0, Time elapsed: 10.571 sec
    [junit] 
    [junit] Testsuite: org.apache.lucene.store.TestMMapDirectory
    [junit] Tests run: 1, Failures: 0, Errors: 0, Time elapsed: 1.233 sec
    [junit] 
    [junit] Testsuite: org.apache.lucene.store.TestWindowsMMap
    [junit] Tests run: 1, Failures: 0, Errors: 0, Time elapsed: 2.721 sec
    [junit] 
    [junit] Testsuite: org.apache.lucene.util.TestBitVector
    [junit] Tests run: 6, Failures: 0, Errors: 0, Time elapsed: 3.852 sec
    [junit] 
    [junit] Testsuite: org.apache.lucene.util.TestOpenBitSet
    [junit] Tests run: 3, Failures: 0, Errors: 0, Time elapsed: 1.403 sec
    [junit] 
    [junit] Testsuite: org.apache.lucene.util.TestPriorityQueue
    [junit] Tests run: 4, Failures: 0, Errors: 0, Time elapsed: 1.61 sec
    [junit] 
    [junit] Testsuite: org.apache.lucene.util.TestSmallFloat
    [junit] Tests run: 2, Failures: 0, Errors: 0, Time elapsed: 0.615 sec
    [junit] 
    [junit] Testsuite: org.apache.lucene.util.TestSortedVIntList
    [junit] Tests run: 19, Failures: 0, Errors: 0, Time elapsed: 0.406 sec
    [junit] 
    [junit] Testsuite: org.apache.lucene.util.TestStringHelper
    [junit] Tests run: 1, Failures: 0, Errors: 0, Time elapsed: 0.43 sec
    [junit] 

BUILD FAILED
http://hudson.zones.apache.org/hudson/job/Lucene-trunk/ws/trunk/common-build.xml :383: Tests
failed!

Total time: 31 minutes 11 seconds
Publishing Javadoc
Recording test results


---------------------------------------------------------------------
To unsubscribe, e-mail: java-dev-unsubscribe@lucene.apache.org
For additional commands, e-mail: java-dev-help@lucene.apache.org


Mime
View raw message