lucene-dev mailing list archives

Site index · List index
Message view « Date » · « Thread »
Top « Date » · « Thread »
From hud...@lucene.zones.apache.org
Subject Build failed in Hudson: Lucene-Nightly #195
Date Sun, 26 Aug 2007 02:18:36 GMT
See http://lucene.zones.apache.org:8080/hudson/job/Lucene-Nightly/195/changes

------------------------------------------
[...truncated 3532 lines...]
clover.setup:

clover.info:

clover:

compile-core:

jar-core:
      [jar] Building jar: http://lucene.zones.apache.org:8080/hudson/job/Lucene-Nightly/ws/trunk/build/contrib/analyzers/lucene-analyzers-2007-08-26_02-04-58.jar


jar:

compile-test:
     [echo] Building analyzers...

javacc-uptodate-check:

javacc-notice:

jflex-uptodate-check:

jflex-notice:

common.init:

build-lucene:

init:

clover.setup:

clover.info:

clover:

compile-core:

common.compile-test:

build-artifacts-and-tests:
     [echo] Building ant...

javacc-uptodate-check:

javacc-notice:

jflex-uptodate-check:

jflex-notice:

common.init:

build-lucene:

init:

clover.setup:

clover.info:

clover:

common.compile-core:

compile-core:

jar-core:
      [jar] Building jar: http://lucene.zones.apache.org:8080/hudson/job/Lucene-Nightly/ws/trunk/build/contrib/ant/lucene-ant-2007-08-26_02-04-58.jar


jar:

compile-test:
     [echo] Building ant...

javacc-uptodate-check:

javacc-notice:

jflex-uptodate-check:

jflex-notice:

common.init:

build-lucene:

init:

clover.setup:

clover.info:

clover:

common.compile-core:

compile-core:

common.compile-test:

build-artifacts-and-tests:
     [echo] Building benchmark...
Overriding previous definition of reference to classpath

javacc-uptodate-check:

javacc-notice:

jflex-uptodate-check:

jflex-notice:

common.init:

compile-demo:

javacc-uptodate-check:

javacc-notice:

jflex-uptodate-check:

jflex-notice:

init:

clover.setup:

clover.info:

clover:

common.compile-core:
    [javac] Compiling 1 source file to http://lucene.zones.apache.org:8080/hudson/job/Lucene-Nightly/ws/trunk/build/classes/java


compile-core:

compile-demo:

check-files:

init:

clover.setup:

clover.info:

clover:

compile-core:

jar-core:
      [jar] Building jar: http://lucene.zones.apache.org:8080/hudson/job/Lucene-Nightly/ws/trunk/build/contrib/benchmark/lucene-benchmark-2007-08-26_02-04-58.jar


jar:

compile-test:
     [echo] Building benchmark...
Overriding previous definition of reference to classpath

javacc-uptodate-check:

javacc-notice:

jflex-uptodate-check:

jflex-notice:

common.init:

compile-demo:

javacc-uptodate-check:

javacc-notice:

jflex-uptodate-check:

jflex-notice:

init:

clover.setup:

clover.info:

clover:

common.compile-core:
    [javac] Compiling 1 source file to http://lucene.zones.apache.org:8080/hudson/job/Lucene-Nightly/ws/trunk/build/classes/java


compile-core:

compile-demo:

check-files:

init:

clover.setup:

clover.info:

clover:

compile-core:

common.compile-test:

build-artifacts-and-tests:

bdb:
     [echo] Building bdb...

javacc-uptodate-check:

javacc-notice:

jflex-uptodate-check:

jflex-notice:

common.init:

build-lucene:

contrib-build.init:

get-db-jar:
      [get] Getting: http://downloads.osafoundation.org/db/db-4.3.29.jar
      [get] To: http://lucene.zones.apache.org:8080/hudson/job/Lucene-Nightly/ws/trunk/contrib/db/bdb/lib/db-4.3.29.jar

      [get] Error opening connection java.io.FileNotFoundException: http://downloads.osafoundation.org/db/db-4.3.29.jar
      [get] Error opening connection java.io.FileNotFoundException: http://downloads.osafoundation.org/db/db-4.3.29.jar
      [get] Error opening connection java.io.FileNotFoundException: http://downloads.osafoundation.org/db/db-4.3.29.jar
      [get] Can't get http://downloads.osafoundation.org/db/db-4.3.29.jar to http://lucene.zones.apache.org:8080/hudson/job/Lucene-Nightly/ws/trunk/contrib/db/bdb/lib/db-4.3.29.jar


BUILD FAILED
http://lucene.zones.apache.org:8080/hudson/job/Lucene-Nightly/ws/trunk/build.xml :470: The
following error occurred while executing this line:
http://lucene.zones.apache.org:8080/hudson/job/Lucene-Nightly/ws/trunk/build.xml :460: The
following error occurred while executing this line:
http://lucene.zones.apache.org:8080/hudson/job/Lucene-Nightly/ws/trunk/contrib/db/build.xml
:29: The following error occurred while executing this line:
http://lucene.zones.apache.org:8080/hudson/job/Lucene-Nightly/ws/trunk/contrib/db/bdb/build.xml
:29: Can't get http://downloads.osafoundation.org/db/db-4.3.29.jar to http://lucene.zones.apache.org:8080/hudson/job/Lucene-Nightly/ws/trunk/contrib/db/bdb/lib/db-4.3.29.jar


Total time: 4 seconds

#javadocs are in $TRUNK/build/docs/api
#scp -r build/docs/api/* $REL_SERVER:$DOCS_DIR/api

Publishing Javadoc
Recording test results


---------------------------------------------------------------------
To unsubscribe, e-mail: java-dev-unsubscribe@lucene.apache.org
For additional commands, e-mail: java-dev-help@lucene.apache.org


Mime
View raw message