lucene-dev mailing list archives

Site index · List index
Message view « Date » · « Thread »
Top « Date » · « Thread »
From java-...@lucene.apache.org
Subject Lucene nightly build failure
Date Fri, 30 Mar 2007 00:23:45 GMT

javacc-uptodate-check:

javacc-notice:
     [echo] 
     [echo]       One or more of the JavaCC .jj files is newer than its corresponding
     [echo]       .java file.  Run the "javacc" target to regenerate the artifacts.
     [echo]     

init:

clover.setup:
    [mkdir] Created dir: /tmp/lucene-nightly-gsi/build/test/clover/db
[clover-setup] Clover Version 1.3.2, built on November 01 2004
[clover-setup] loaded from: /export/home/gsingers/bin/apache-ant-1.6.5/lib/clover.jar
[clover-setup] Open Source License registered to the Apache Software Foundation. This license
of Clover is provided to support projects of the Apache Software Foundation only.

[clover-setup] Clover is enabled with initstring '/tmp/lucene-nightly-gsi/build/test/clover/db/lucene_coverage.db'

clover.info:

clover:

common.compile-core:
    [mkdir] Created dir: /tmp/lucene-nightly-gsi/build/classes/java
    [javac] Compiling 214 source files to /tmp/lucene-nightly-gsi/build/classes/java
   [clover] Clover Version 1.3.2, built on November 01 2004
   [clover] loaded from: /export/home/gsingers/bin/apache-ant-1.6.5/lib/clover.jar
   [clover] Open Source License registered to the Apache Software Foundation. This license
of Clover is provided to support projects of the Apache Software Foundation only.

   [clover] No coverage database '/tmp/lucene-nightly-gsi/build/test/clover/db/lucene_coverage.db'
found. Creating a fresh one.
   [clover] Clover all over. Instrumented 214 files.
    [javac] Note: Some input files use or override a deprecated API.
    [javac] Note: Recompile with -deprecation for details.

compile-core:
     [rmic] RMI Compiling 1 class to /tmp/lucene-nightly-gsi/build/classes/java

compile-demo:
    [mkdir] Created dir: /tmp/lucene-nightly-gsi/build/classes/demo
    [javac] Compiling 17 source files to /tmp/lucene-nightly-gsi/build/classes/demo
   [clover] Clover Version 1.3.2, built on November 01 2004
   [clover] loaded from: /export/home/gsingers/bin/apache-ant-1.6.5/lib/clover.jar
   [clover] Open Source License registered to the Apache Software Foundation. This license
of Clover is provided to support projects of the Apache Software Foundation only.

   [clover] Updating database at '/tmp/lucene-nightly-gsi/build/test/clover/db/lucene_coverage.db'
   [clover] Clover all over. Instrumented 0 files.

common.compile-test:
    [mkdir] Created dir: /tmp/lucene-nightly-gsi/build/classes/test
    [javac] Compiling 134 source files to /tmp/lucene-nightly-gsi/build/classes/test
   [clover] Clover Version 1.3.2, built on November 01 2004
   [clover] loaded from: /export/home/gsingers/bin/apache-ant-1.6.5/lib/clover.jar
   [clover] Open Source License registered to the Apache Software Foundation. This license
of Clover is provided to support projects of the Apache Software Foundation only.

   [clover] Updating database at '/tmp/lucene-nightly-gsi/build/test/clover/db/lucene_coverage.db'
   [clover] Clover all over. Instrumented 0 files.
    [javac] Note: Some input files use or override a deprecated API.
    [javac] Note: Recompile with -deprecation for details.
     [copy] Copying 2 files to /tmp/lucene-nightly-gsi/build/classes/test
     [copy] Copied 1 empty directory to 1 empty directory under /tmp/lucene-nightly-gsi/build/classes/test

compile-test:

test:
    [junit] Testsuite: org.apache.lucene.TestDemo
    [junit] Tests run: 1, Failures: 0, Errors: 0, Time elapsed: 0.777 sec

    [junit] Testsuite: org.apache.lucene.TestHitIterator
    [junit] Tests run: 1, Failures: 0, Errors: 0, Time elapsed: 0.545 sec

    [junit] Testsuite: org.apache.lucene.TestSearch
    [junit] Tests run: 1, Failures: 0, Errors: 0, Time elapsed: 0.696 sec

    [junit] Testsuite: org.apache.lucene.TestSearchForDuplicates
    [junit] Tests run: 1, Failures: 0, Errors: 0, Time elapsed: 1.5 sec

    [junit] Testsuite: org.apache.lucene.analysis.TestAnalyzers
    [junit] Tests run: 3, Failures: 0, Errors: 0, Time elapsed: 0.342 sec

    [junit] Testsuite: org.apache.lucene.analysis.TestISOLatin1AccentFilter
    [junit] Tests run: 1, Failures: 0, Errors: 0, Time elapsed: 0.342 sec

    [junit] Testsuite: org.apache.lucene.analysis.TestKeywordAnalyzer
    [junit] Tests run: 1, Failures: 0, Errors: 0, Time elapsed: 0.643 sec

    [junit] Testsuite: org.apache.lucene.analysis.TestLengthFilter
    [junit] Tests run: 1, Failures: 0, Errors: 0, Time elapsed: 0.439 sec

    [junit] Testsuite: org.apache.lucene.analysis.TestPerFieldAnalzyerWrapper
    [junit] Tests run: 1, Failures: 0, Errors: 0, Time elapsed: 0.466 sec

    [junit] Testsuite: org.apache.lucene.analysis.TestStandardAnalyzer
    [junit] Tests run: 1, Failures: 0, Errors: 0, Time elapsed: 0.533 sec

    [junit] Testsuite: org.apache.lucene.analysis.TestStopAnalyzer
    [junit] Tests run: 2, Failures: 0, Errors: 0, Time elapsed: 0.51 sec

    [junit] Testsuite: org.apache.lucene.analysis.TestStopFilter
    [junit] Tests run: 2, Failures: 0, Errors: 0, Time elapsed: 0.364 sec

    [junit] Testsuite: org.apache.lucene.document.TestBinaryDocument
    [junit] Tests run: 1, Failures: 0, Errors: 0, Time elapsed: 0.609 sec

    [junit] Testsuite: org.apache.lucene.document.TestDateTools
    [junit] Tests run: 5, Failures: 0, Errors: 0, Time elapsed: 0.399 sec

    [junit] Testsuite: org.apache.lucene.document.TestDocument
    [junit] Tests run: 5, Failures: 0, Errors: 0, Time elapsed: 0.728 sec

    [junit] Testsuite: org.apache.lucene.document.TestNumberTools
    [junit] Tests run: 3, Failures: 0, Errors: 0, Time elapsed: 0.697 sec

    [junit] Testsuite: org.apache.lucene.index.TestAddIndexesNoOptimize
    [junit] Tests run: 7, Failures: 0, Errors: 0, Time elapsed: 4.209 sec

    [junit] Testsuite: org.apache.lucene.index.TestBackwardsCompatibility
    [junit] Tests run: 6, Failures: 0, Errors: 0, Time elapsed: 1.539 sec

    [junit] Testsuite: org.apache.lucene.index.TestCompoundFile
    [junit] Tests run: 10, Failures: 0, Errors: 0, Time elapsed: 3.76 sec

    [junit] Testsuite: org.apache.lucene.index.TestDeletionPolicy
    [junit] Tests run: 6, Failures: 0, Errors: 0, Time elapsed: 7.34 sec

    [junit] Testsuite: org.apache.lucene.index.TestDoc
    [junit] Tests run: 1, Failures: 0, Errors: 0, Time elapsed: 0.661 sec

    [junit] Testsuite: org.apache.lucene.index.TestDocumentWriter
    [junit] Tests run: 3, Failures: 0, Errors: 0, Time elapsed: 0.676 sec

    [junit] Testsuite: org.apache.lucene.index.TestFieldInfos
    [junit] Tests run: 1, Failures: 0, Errors: 0, Time elapsed: 0.446 sec

    [junit] Testsuite: org.apache.lucene.index.TestFieldsReader
    [junit] Tests run: 6, Failures: 0, Errors: 0, Time elapsed: 15.664 sec

    [junit] ------------- Standard Output ---------------
    [junit] Average Non-lazy time (should be very close to zero): 0 ms for 50 reads
    [junit] Average Lazy Time (should be greater than zero): 106 ms for 50 reads
    [junit] ------------- ---------------- ---------------
    [junit] Testsuite: org.apache.lucene.index.TestFilterIndexReader
    [junit] Tests run: 1, Failures: 0, Errors: 0, Time elapsed: 0.551 sec

    [junit] Testsuite: org.apache.lucene.index.TestIndexFileDeleter
    [junit] Tests run: 1, Failures: 0, Errors: 0, Time elapsed: 0.661 sec

    [junit] Testsuite: org.apache.lucene.index.TestIndexInput
    [junit] Tests run: 2, Failures: 0, Errors: 0, Time elapsed: 0.306 sec

    [junit] Testsuite: org.apache.lucene.index.TestIndexModifier
    [junit] Tests run: 3, Failures: 0, Errors: 0, Time elapsed: 29.4 sec

    [junit] Testsuite: org.apache.lucene.index.TestIndexReader
    [junit] Tests run: 23, Failures: 0, Errors: 0, Time elapsed: 7.4 sec

    [junit] Testsuite: org.apache.lucene.index.TestIndexWriter
    [junit] Tests run: 16, Failures: 0, Errors: 0, Time elapsed: 94.532 sec

    [junit] Testsuite: org.apache.lucene.index.TestIndexWriterDelete
    [junit] Tests run: 7, Failures: 0, Errors: 0, Time elapsed: 2.013 sec

    [junit] Testsuite: org.apache.lucene.index.TestIndexWriterLockRelease
    [junit] Tests run: 1, Failures: 0, Errors: 0, Time elapsed: 0.393 sec

    [junit] Testsuite: org.apache.lucene.index.TestIndexWriterMergePolicy
    [junit] Tests run: 6, Failures: 0, Errors: 0, Time elapsed: 5.705 sec

    [junit] Testsuite: org.apache.lucene.index.TestIndexWriterMerging
    [junit] Tests run: 1, Failures: 0, Errors: 0, Time elapsed: 1.366 sec

    [junit] Testsuite: org.apache.lucene.index.TestLazyBug
    [junit] Tests run: 3, Failures: 0, Errors: 0, Time elapsed: 35.329 sec

    [junit] Testsuite: org.apache.lucene.index.TestLazyProxSkipping
    [junit] Tests run: 1, Failures: 0, Errors: 0, Time elapsed: 2.01 sec

    [junit] Testsuite: org.apache.lucene.index.TestMultiReader
    [junit] Tests run: 4, Failures: 0, Errors: 0, Time elapsed: 1.092 sec

    [junit] Testsuite: org.apache.lucene.index.TestNorms
    [junit] Tests run: 1, Failures: 0, Errors: 0, Time elapsed: 3.858 sec

    [junit] Testsuite: org.apache.lucene.index.TestParallelReader
    [junit] Tests run: 4, Failures: 0, Errors: 0, Time elapsed: 0.704 sec

    [junit] Testsuite: org.apache.lucene.index.TestParallelTermEnum
    [junit] Tests run: 1, Failures: 0, Errors: 0, Time elapsed: 0.514 sec

    [junit] Testsuite: org.apache.lucene.index.TestPayloads
    [junit] Tests run: 3, Failures: 0, Errors: 0, Time elapsed: 0.829 sec

    [junit] Testsuite: org.apache.lucene.index.TestSegmentMerger
    [junit] Tests run: 2, Failures: 0, Errors: 0, Time elapsed: 1.039 sec

    [junit] Testsuite: org.apache.lucene.index.TestSegmentReader
    [junit] Tests run: 7, Failures: 0, Errors: 0, Time elapsed: 0.923 sec

    [junit] Testsuite: org.apache.lucene.index.TestSegmentTermDocs
    [junit] Tests run: 4, Failures: 0, Errors: 0, Time elapsed: 1.659 sec

    [junit] Testsuite: org.apache.lucene.index.TestSegmentTermEnum
    [junit] Tests run: 1, Failures: 0, Errors: 0, Time elapsed: 0.897 sec

    [junit] Testsuite: org.apache.lucene.index.TestStressIndexing
    [junit] Tests run: 1, Failures: 0, Errors: 0, Time elapsed: 31.48 sec

    [junit] Testsuite: org.apache.lucene.index.TestTerm
    [junit] Tests run: 1, Failures: 0, Errors: 0, Time elapsed: 0.299 sec

    [junit] Testsuite: org.apache.lucene.index.TestTermVectorsReader
    [junit] Tests run: 5, Failures: 0, Errors: 0, Time elapsed: 0.302 sec

    [junit] Testsuite: org.apache.lucene.index.TestTermVectorsWriter
    [junit] Tests run: 5, Failures: 0, Errors: 0, Time elapsed: 0.48 sec

    [junit] Testsuite: org.apache.lucene.index.TestTermdocPerf
    [junit] Tests run: 1, Failures: 0, Errors: 0, Time elapsed: 0.26 sec

    [junit] Testsuite: org.apache.lucene.index.TestWordlistLoader
    [junit] Tests run: 1, Failures: 0, Errors: 0, Time elapsed: 0.309 sec

    [junit] Testsuite: org.apache.lucene.index.store.TestRAMDirectory
    [junit] Tests run: 5, Failures: 0, Errors: 0, Time elapsed: 6.323 sec

    [junit] Testsuite: org.apache.lucene.queryParser.TestMultiAnalyzer
    [junit] Tests run: 3, Failures: 0, Errors: 0, Time elapsed: 0.447 sec

    [junit] Testsuite: org.apache.lucene.queryParser.TestMultiFieldQueryParser
    [junit] Tests run: 9, Failures: 0, Errors: 0, Time elapsed: 0.776 sec

    [junit] Testsuite: org.apache.lucene.queryParser.TestQueryParser
    [junit] Tests run: 23, Failures: 0, Errors: 0, Time elapsed: 0.836 sec

    [junit] Testsuite: org.apache.lucene.search.TestBoolean2
    [junit] Tests run: 11, Failures: 0, Errors: 0, Time elapsed: 2.194 sec

    [junit] Testsuite: org.apache.lucene.search.TestBooleanMinShouldMatch
    [junit] Tests run: 14, Failures: 0, Errors: 0, Time elapsed: 3.014 sec

    [junit] Testsuite: org.apache.lucene.search.TestBooleanOr
    [junit] Tests run: 5, Failures: 0, Errors: 0, Time elapsed: 0.628 sec

    [junit] Testsuite: org.apache.lucene.search.TestBooleanPrefixQuery
    [junit] Tests run: 1, Failures: 0, Errors: 0, Time elapsed: 0.528 sec

    [junit] Testsuite: org.apache.lucene.search.TestBooleanQuery
    [junit] Tests run: 2, Failures: 0, Errors: 0, Time elapsed: 0.309 sec

    [junit] Testsuite: org.apache.lucene.search.TestBooleanScorer
    [junit] Tests run: 1, Failures: 0, Errors: 0, Time elapsed: 0.555 sec

    [junit] Testsuite: org.apache.lucene.search.TestCachingWrapperFilter
    [junit] Tests run: 1, Failures: 0, Errors: 0, Time elapsed: 0.418 sec

    [junit] Testsuite: org.apache.lucene.search.TestComplexExplanations
    [junit] Tests run: 22, Failures: 0, Errors: 0, Time elapsed: 1.111 sec

    [junit] Testsuite: org.apache.lucene.search.TestComplexExplanationsOfNonMatches
    [junit] Tests run: 22, Failures: 0, Errors: 0, Time elapsed: 0.87 sec

    [junit] Testsuite: org.apache.lucene.search.TestConstantScoreRangeQuery
    [junit] Tests run: 7, Failures: 0, Errors: 0, Time elapsed: 1.415 sec

    [junit] Testsuite: org.apache.lucene.search.TestCustomSearcherSort
    [junit] Tests run: 3, Failures: 0, Errors: 0, Time elapsed: 7.809 sec

    [junit] Testsuite: org.apache.lucene.search.TestDateFilter
    [junit] Tests run: 2, Failures: 0, Errors: 0, Time elapsed: 0.63 sec

    [junit] Testsuite: org.apache.lucene.search.TestDisjunctionMaxQuery
    [junit] Tests run: 8, Failures: 0, Errors: 0, Time elapsed: 0.67 sec

    [junit] Testsuite: org.apache.lucene.search.TestDocBoost
    [junit] Tests run: 1, Failures: 0, Errors: 0, Time elapsed: 0.547 sec

    [junit] Testsuite: org.apache.lucene.search.TestExplanations
    [junit] Tests run: 1, Failures: 0, Errors: 0, Time elapsed: 0.465 sec

    [junit] Testsuite: org.apache.lucene.search.TestFilteredQuery
    [junit] Tests run: 3, Failures: 0, Errors: 0, Time elapsed: 0.597 sec

    [junit] Testsuite: org.apache.lucene.search.TestFuzzyQuery
    [junit] Tests run: 2, Failures: 0, Errors: 0, Time elapsed: 0.591 sec

    [junit] Testsuite: org.apache.lucene.search.TestMatchAllDocsQuery
    [junit] Tests run: 2, Failures: 0, Errors: 0, Time elapsed: 0.604 sec

    [junit] Testsuite: org.apache.lucene.search.TestMultiPhraseQuery
    [junit] Tests run: 3, Failures: 0, Errors: 0, Time elapsed: 0.711 sec

    [junit] Testsuite: org.apache.lucene.search.TestMultiSearcher
    [junit] Tests run: 3, Failures: 0, Errors: 0, Time elapsed: 0.932 sec

    [junit] Testsuite: org.apache.lucene.search.TestMultiSearcherRanking
    [junit] Tests run: 7, Failures: 0, Errors: 0, Time elapsed: 1.349 sec

    [junit] Testsuite: org.apache.lucene.search.TestMultiThreadTermVectors
    [junit] Tests run: 1, Failures: 0, Errors: 0, Time elapsed: 1.911 sec

    [junit] Testsuite: org.apache.lucene.search.TestNot
    [junit] Tests run: 1, Failures: 0, Errors: 0, Time elapsed: 0.686 sec

    [junit] Testsuite: org.apache.lucene.search.TestParallelMultiSearcher
    [junit] Tests run: 3, Failures: 0, Errors: 0, Time elapsed: 0.85 sec

    [junit] Testsuite: org.apache.lucene.search.TestPhrasePrefixQuery
    [junit] Tests run: 1, Failures: 0, Errors: 0, Time elapsed: 0.53 sec

    [junit] Testsuite: org.apache.lucene.search.TestPhraseQuery
    [junit] Tests run: 10, Failures: 0, Errors: 0, Time elapsed: 0.816 sec

    [junit] Testsuite: org.apache.lucene.search.TestPositionIncrement
    [junit] Tests run: 2, Failures: 0, Errors: 0, Time elapsed: 0.605 sec

    [junit] Testsuite: org.apache.lucene.search.TestPrefixFilter
    [junit] Tests run: 1, Failures: 0, Errors: 0, Time elapsed: 0.606 sec

    [junit] Testsuite: org.apache.lucene.search.TestPrefixQuery
    [junit] Tests run: 1, Failures: 0, Errors: 0, Time elapsed: 0.569 sec

    [junit] Testsuite: org.apache.lucene.search.TestQueryTermVector
    [junit] Tests run: 1, Failures: 0, Errors: 0, Time elapsed: 0.327 sec

    [junit] Testsuite: org.apache.lucene.search.TestRangeFilter
    [junit] Tests run: 3, Failures: 0, Errors: 0, Time elapsed: 1.624 sec

    [junit] Testsuite: org.apache.lucene.search.TestRangeQuery
    [junit] Tests run: 3, Failures: 0, Errors: 0, Time elapsed: 0.682 sec

    [junit] Testsuite: org.apache.lucene.search.TestRemoteSearchable
    [junit] Tests run: 5, Failures: 0, Errors: 5, Time elapsed: 0.656 sec

    [junit] Testcase: testTermQuery(org.apache.lucene.search.TestRemoteSearchable):	Caused
an ERROR
    [junit] Port already in use: 1099; nested exception is: 
    [junit] 	java.net.BindException: Address already in use
    [junit] java.rmi.server.ExportException: Port already in use: 1099; nested exception is:

    [junit] 	java.net.BindException: Address already in use
    [junit] 	at sun.rmi.transport.tcp.TCPTransport.listen(TCPTransport.java:243)
    [junit] 	at sun.rmi.transport.tcp.TCPTransport.exportObject(TCPTransport.java:178)
    [junit] 	at sun.rmi.transport.tcp.TCPEndpoint.exportObject(TCPEndpoint.java:382)
    [junit] 	at sun.rmi.transport.LiveRef.exportObject(LiveRef.java:116)
    [junit] 	at sun.rmi.server.UnicastServerRef.exportObject(UnicastServerRef.java:145)
    [junit] 	at sun.rmi.registry.RegistryImpl.setup(RegistryImpl.java:92)
    [junit] 	at sun.rmi.registry.RegistryImpl.<init>(RegistryImpl.java:78)
    [junit] 	at java.rmi.registry.LocateRegistry.createRegistry(LocateRegistry.java:164)
    [junit] 	at org.apache.lucene.search.TestRemoteSearchable.startServer(TestRemoteSearchable.java:66)
    [junit] 	at org.apache.lucene.search.TestRemoteSearchable.getRemote(TestRemoteSearchable.java:45)
    [junit] 	at org.apache.lucene.search.TestRemoteSearchable.search(TestRemoteSearchable.java:74)
    [junit] 	at org.apache.lucene.search.TestRemoteSearchable.testTermQuery(TestRemoteSearchable.java:96)
    [junit] Caused by: java.net.BindException: Address already in use
    [junit] 	at java.net.PlainSocketImpl.socketBind(Native Method)
    [junit] 	at java.net.PlainSocketImpl.bind(PlainSocketImpl.java:331)
    [junit] 	at java.net.ServerSocket.bind(ServerSocket.java:318)
    [junit] 	at java.net.ServerSocket.<init>(ServerSocket.java:185)
    [junit] 	at java.net.ServerSocket.<init>(ServerSocket.java:97)
    [junit] 	at sun.rmi.transport.proxy.RMIDirectSocketFactory.createServerSocket(RMIDirectSocketFactory.java:27)
    [junit] 	at sun.rmi.transport.proxy.RMIMasterSocketFactory.createServerSocket(RMIMasterSocketFactory.java:333)
    [junit] 	at sun.rmi.transport.tcp.TCPEndpoint.newServerSocket(TCPEndpoint.java:615)
    [junit] 	at sun.rmi.transport.tcp.TCPTransport.listen(TCPTransport.java:231)
    [junit] 	... 26 more


    [junit] Testcase: testBooleanQuery(org.apache.lucene.search.TestRemoteSearchable):	Caused
an ERROR
    [junit] Port already in use: 1099; nested exception is: 
    [junit] 	java.net.BindException: Address already in use
    [junit] java.rmi.server.ExportException: Port already in use: 1099; nested exception is:

    [junit] 	java.net.BindException: Address already in use
    [junit] 	at sun.rmi.transport.tcp.TCPTransport.listen(TCPTransport.java:243)
    [junit] 	at sun.rmi.transport.tcp.TCPTransport.exportObject(TCPTransport.java:178)
    [junit] 	at sun.rmi.transport.tcp.TCPEndpoint.exportObject(TCPEndpoint.java:382)
    [junit] 	at sun.rmi.transport.LiveRef.exportObject(LiveRef.java:116)
    [junit] 	at sun.rmi.server.UnicastServerRef.exportObject(UnicastServerRef.java:145)
    [junit] 	at sun.rmi.registry.RegistryImpl.setup(RegistryImpl.java:92)
    [junit] 	at sun.rmi.registry.RegistryImpl.<init>(RegistryImpl.java:78)
    [junit] 	at java.rmi.registry.LocateRegistry.createRegistry(LocateRegistry.java:164)
    [junit] 	at org.apache.lucene.search.TestRemoteSearchable.startServer(TestRemoteSearchable.java:66)
    [junit] 	at org.apache.lucene.search.TestRemoteSearchable.getRemote(TestRemoteSearchable.java:45)
    [junit] 	at org.apache.lucene.search.TestRemoteSearchable.search(TestRemoteSearchable.java:74)
    [junit] 	at org.apache.lucene.search.TestRemoteSearchable.testBooleanQuery(TestRemoteSearchable.java:102)
    [junit] Caused by: java.net.BindException: Address already in use
    [junit] 	at java.net.PlainSocketImpl.socketBind(Native Method)
    [junit] 	at java.net.PlainSocketImpl.bind(PlainSocketImpl.java:331)
    [junit] 	at java.net.ServerSocket.bind(ServerSocket.java:318)
    [junit] 	at java.net.ServerSocket.<init>(ServerSocket.java:185)
    [junit] 	at java.net.ServerSocket.<init>(ServerSocket.java:97)
    [junit] 	at sun.rmi.transport.proxy.RMIDirectSocketFactory.createServerSocket(RMIDirectSocketFactory.java:27)
    [junit] 	at sun.rmi.transport.proxy.RMIMasterSocketFactory.createServerSocket(RMIMasterSocketFactory.java:333)
    [junit] 	at sun.rmi.transport.tcp.TCPEndpoint.newServerSocket(TCPEndpoint.java:615)
    [junit] 	at sun.rmi.transport.tcp.TCPTransport.listen(TCPTransport.java:231)
    [junit] 	... 26 more


    [junit] Testcase: testPhraseQuery(org.apache.lucene.search.TestRemoteSearchable):	Caused
an ERROR
    [junit] Port already in use: 1099; nested exception is: 
    [junit] 	java.net.BindException: Address already in use
    [junit] java.rmi.server.ExportException: Port already in use: 1099; nested exception is:

    [junit] 	java.net.BindException: Address already in use
    [junit] 	at sun.rmi.transport.tcp.TCPTransport.listen(TCPTransport.java:243)
    [junit] 	at sun.rmi.transport.tcp.TCPTransport.exportObject(TCPTransport.java:178)
    [junit] 	at sun.rmi.transport.tcp.TCPEndpoint.exportObject(TCPEndpoint.java:382)
    [junit] 	at sun.rmi.transport.LiveRef.exportObject(LiveRef.java:116)
    [junit] 	at sun.rmi.server.UnicastServerRef.exportObject(UnicastServerRef.java:145)
    [junit] 	at sun.rmi.registry.RegistryImpl.setup(RegistryImpl.java:92)
    [junit] 	at sun.rmi.registry.RegistryImpl.<init>(RegistryImpl.java:78)
    [junit] 	at java.rmi.registry.LocateRegistry.createRegistry(LocateRegistry.java:164)
    [junit] 	at org.apache.lucene.search.TestRemoteSearchable.startServer(TestRemoteSearchable.java:66)
    [junit] 	at org.apache.lucene.search.TestRemoteSearchable.getRemote(TestRemoteSearchable.java:45)
    [junit] 	at org.apache.lucene.search.TestRemoteSearchable.search(TestRemoteSearchable.java:74)
    [junit] 	at org.apache.lucene.search.TestRemoteSearchable.testPhraseQuery(TestRemoteSearchable.java:109)
    [junit] Caused by: java.net.BindException: Address already in use
    [junit] 	at java.net.PlainSocketImpl.socketBind(Native Method)
    [junit] 	at java.net.PlainSocketImpl.bind(PlainSocketImpl.java:331)
    [junit] 	at java.net.ServerSocket.bind(ServerSocket.java:318)
    [junit] 	at java.net.ServerSocket.<init>(ServerSocket.java:185)
    [junit] 	at java.net.ServerSocket.<init>(ServerSocket.java:97)
    [junit] 	at sun.rmi.transport.proxy.RMIDirectSocketFactory.createServerSocket(RMIDirectSocketFactory.java:27)
    [junit] 	at sun.rmi.transport.proxy.RMIMasterSocketFactory.createServerSocket(RMIMasterSocketFactory.java:333)
    [junit] 	at sun.rmi.transport.tcp.TCPEndpoint.newServerSocket(TCPEndpoint.java:615)
    [junit] 	at sun.rmi.transport.tcp.TCPTransport.listen(TCPTransport.java:231)
    [junit] 	... 26 more


    [junit] Testcase: testQueryFilter(org.apache.lucene.search.TestRemoteSearchable):	Caused
an ERROR
    [junit] Port already in use: 1099; nested exception is: 
    [junit] 	java.net.BindException: Address already in use
    [junit] java.rmi.server.ExportException: Port already in use: 1099; nested exception is:

    [junit] 	java.net.BindException: Address already in use
    [junit] 	at sun.rmi.transport.tcp.TCPTransport.listen(TCPTransport.java:243)
    [junit] 	at sun.rmi.transport.tcp.TCPTransport.exportObject(TCPTransport.java:178)
    [junit] 	at sun.rmi.transport.tcp.TCPEndpoint.exportObject(TCPEndpoint.java:382)
    [junit] 	at sun.rmi.transport.LiveRef.exportObject(LiveRef.java:116)
    [junit] 	at sun.rmi.server.UnicastServerRef.exportObject(UnicastServerRef.java:145)
    [junit] 	at sun.rmi.registry.RegistryImpl.setup(RegistryImpl.java:92)
    [junit] 	at sun.rmi.registry.RegistryImpl.<init>(RegistryImpl.java:78)
    [junit] 	at java.rmi.registry.LocateRegistry.createRegistry(LocateRegistry.java:164)
    [junit] 	at org.apache.lucene.search.TestRemoteSearchable.startServer(TestRemoteSearchable.java:66)
    [junit] 	at org.apache.lucene.search.TestRemoteSearchable.getRemote(TestRemoteSearchable.java:45)
    [junit] 	at org.apache.lucene.search.TestRemoteSearchable.testQueryFilter(TestRemoteSearchable.java:115)
    [junit] Caused by: java.net.BindException: Address already in use
    [junit] 	at java.net.PlainSocketImpl.socketBind(Native Method)
    [junit] 	at java.net.PlainSocketImpl.bind(PlainSocketImpl.java:331)
    [junit] 	at java.net.ServerSocket.bind(ServerSocket.java:318)
    [junit] 	at java.net.ServerSocket.<init>(ServerSocket.java:185)
    [junit] 	at java.net.ServerSocket.<init>(ServerSocket.java:97)
    [junit] 	at sun.rmi.transport.proxy.RMIDirectSocketFactory.createServerSocket(RMIDirectSocketFactory.java:27)
    [junit] 	at sun.rmi.transport.proxy.RMIMasterSocketFactory.createServerSocket(RMIMasterSocketFactory.java:333)
    [junit] 	at sun.rmi.transport.tcp.TCPEndpoint.newServerSocket(TCPEndpoint.java:615)
    [junit] 	at sun.rmi.transport.tcp.TCPTransport.listen(TCPTransport.java:231)
    [junit] 	... 25 more


    [junit] Testcase: testConstantScoreQuery(org.apache.lucene.search.TestRemoteSearchable):
Caused an ERROR
    [junit] Port already in use: 1099; nested exception is: 
    [junit] 	java.net.BindException: Address already in use
    [junit] java.rmi.server.ExportException: Port already in use: 1099; nested exception is:

    [junit] 	java.net.BindException: Address already in use
    [junit] 	at sun.rmi.transport.tcp.TCPTransport.listen(TCPTransport.java:243)
    [junit] 	at sun.rmi.transport.tcp.TCPTransport.exportObject(TCPTransport.java:178)
    [junit] 	at sun.rmi.transport.tcp.TCPEndpoint.exportObject(TCPEndpoint.java:382)
    [junit] 	at sun.rmi.transport.LiveRef.exportObject(LiveRef.java:116)
    [junit] 	at sun.rmi.server.UnicastServerRef.exportObject(UnicastServerRef.java:145)
    [junit] 	at sun.rmi.registry.RegistryImpl.setup(RegistryImpl.java:92)
    [junit] 	at sun.rmi.registry.RegistryImpl.<init>(RegistryImpl.java:78)
    [junit] 	at java.rmi.registry.LocateRegistry.createRegistry(LocateRegistry.java:164)
    [junit] 	at org.apache.lucene.search.TestRemoteSearchable.startServer(TestRemoteSearchable.java:66)
    [junit] 	at org.apache.lucene.search.TestRemoteSearchable.getRemote(TestRemoteSearchable.java:45)
    [junit] 	at org.apache.lucene.search.TestRemoteSearchable.testConstantScoreQuery(TestRemoteSearchable.java:129)
    [junit] Caused by: java.net.BindException: Address already in use
    [junit] 	at java.net.PlainSocketImpl.socketBind(Native Method)
    [junit] 	at java.net.PlainSocketImpl.bind(PlainSocketImpl.java:331)
    [junit] 	at java.net.ServerSocket.bind(ServerSocket.java:318)
    [junit] 	at java.net.ServerSocket.<init>(ServerSocket.java:185)
    [junit] 	at java.net.ServerSocket.<init>(ServerSocket.java:97)
    [junit] 	at sun.rmi.transport.proxy.RMIDirectSocketFactory.createServerSocket(RMIDirectSocketFactory.java:27)
    [junit] 	at sun.rmi.transport.proxy.RMIMasterSocketFactory.createServerSocket(RMIMasterSocketFactory.java:333)
    [junit] 	at sun.rmi.transport.tcp.TCPEndpoint.newServerSocket(TCPEndpoint.java:615)
    [junit] 	at sun.rmi.transport.tcp.TCPTransport.listen(TCPTransport.java:231)
    [junit] 	... 25 more


    [junit] Test org.apache.lucene.search.TestRemoteSearchable FAILED
    [junit] Testsuite: org.apache.lucene.search.TestScorerPerf
    [junit] Tests run: 1, Failures: 0, Errors: 0, Time elapsed: 0.938 sec

    [junit] Testsuite: org.apache.lucene.search.TestSetNorm
    [junit] Tests run: 1, Failures: 0, Errors: 0, Time elapsed: 0.527 sec

    [junit] Testsuite: org.apache.lucene.search.TestSimilarity
    [junit] Tests run: 1, Failures: 0, Errors: 0, Time elapsed: 0.562 sec

    [junit] Testsuite: org.apache.lucene.search.TestSimpleExplanations
    [junit] Tests run: 53, Failures: 0, Errors: 0, Time elapsed: 1.395 sec

    [junit] Testsuite: org.apache.lucene.search.TestSimpleExplanationsOfNonMatches
    [junit] Tests run: 53, Failures: 0, Errors: 0, Time elapsed: 1.24 sec

    [junit] Testsuite: org.apache.lucene.search.TestSort
    [junit] Tests run: 17, Failures: 0, Errors: 0, Time elapsed: 3.459 sec

    [junit] Testsuite: org.apache.lucene.search.TestTermScorer
    [junit] Tests run: 4, Failures: 0, Errors: 0, Time elapsed: 1.556 sec

    [junit] Testsuite: org.apache.lucene.search.TestTermVectors
    [junit] Tests run: 5, Failures: 0, Errors: 0, Time elapsed: 19.502 sec

    [junit] Testsuite: org.apache.lucene.search.TestThreadSafe
    [junit] Tests run: 1, Failures: 0, Errors: 0, Time elapsed: 155.928 sec

    [junit] Testsuite: org.apache.lucene.search.TestWildcard
    [junit] Tests run: 5, Failures: 0, Errors: 0, Time elapsed: 0.723 sec

    [junit] Testsuite: org.apache.lucene.search.payloads.TestBoostingTermQuery
    [junit] Tests run: 2, Failures: 0, Errors: 0, Time elapsed: 3.029 sec

    [junit] Testsuite: org.apache.lucene.search.spans.TestBasics
    [junit] Tests run: 19, Failures: 0, Errors: 0, Time elapsed: 14.926 sec

    [junit] Testsuite: org.apache.lucene.search.spans.TestNearSpansOrdered
    [junit] Tests run: 10, Failures: 0, Errors: 0, Time elapsed: 0.62 sec

    [junit] Testsuite: org.apache.lucene.search.spans.TestSpanExplanations
    [junit] Tests run: 31, Failures: 0, Errors: 0, Time elapsed: 0.951 sec

    [junit] Testsuite: org.apache.lucene.search.spans.TestSpanExplanationsOfNonMatches
    [junit] Tests run: 31, Failures: 0, Errors: 0, Time elapsed: 0.874 sec

    [junit] Testsuite: org.apache.lucene.search.spans.TestSpans
    [junit] Tests run: 21, Failures: 0, Errors: 0, Time elapsed: 1.167 sec

    [junit] Testsuite: org.apache.lucene.search.spans.TestSpansAdvanced
    [junit] Tests run: 1, Failures: 0, Errors: 0, Time elapsed: 0.585 sec

    [junit] Testsuite: org.apache.lucene.search.spans.TestSpansAdvanced2
    [junit] Tests run: 4, Failures: 0, Errors: 0, Time elapsed: 0.702 sec

    [junit] Testsuite: org.apache.lucene.store.TestBufferedIndexInput
    [junit] Tests run: 3, Failures: 0, Errors: 0, Time elapsed: 1.576 sec

    [junit] Testsuite: org.apache.lucene.store.TestLock
    [junit] Tests run: 1, Failures: 0, Errors: 0, Time elapsed: 0.319 sec

    [junit] Testsuite: org.apache.lucene.store.TestLockFactory
    [junit] Tests run: 13, Failures: 0, Errors: 0, Time elapsed: 4.763 sec

    [junit] Testsuite: org.apache.lucene.store.TestWindowsMMap
    [junit] Tests run: 1, Failures: 0, Errors: 0, Time elapsed: 2.284 sec

    [junit] Testsuite: org.apache.lucene.util.TestBitVector
    [junit] Tests run: 6, Failures: 0, Errors: 0, Time elapsed: 5.189 sec

    [junit] Testsuite: org.apache.lucene.util.TestPriorityQueue
    [junit] Tests run: 3, Failures: 0, Errors: 0, Time elapsed: 0.323 sec

    [junit] Testsuite: org.apache.lucene.util.TestSmallFloat
    [junit] Tests run: 2, Failures: 0, Errors: 0, Time elapsed: 0.394 sec

    [junit] Testsuite: org.apache.lucene.util.TestStringHelper
    [junit] Tests run: 1, Failures: 0, Errors: 0, Time elapsed: 0.312 sec


BUILD FAILED
/tmp/lucene-nightly-gsi/common-build.xml:210: Tests failed!

Total time: 11 minutes 19 seconds



---------------------------------------------------------------------
To unsubscribe, e-mail: java-dev-unsubscribe@lucene.apache.org
For additional commands, e-mail: java-dev-help@lucene.apache.org


Mime
View raw message