lucene-dev mailing list archives

Site index · List index
Message view « Date » · « Thread »
Top « Date » · « Thread »
From java-...@lucene.apache.org
Subject Lucene nightly build failure
Date Sun, 17 Dec 2006 00:11:01 GMT

javacc-uptodate-check:

javacc-notice:
     [echo] 
     [echo]       One or more of the JavaCC .jj files is newer than its corresponding
     [echo]       .java file.  Run the "javacc" target to regenerate the artifacts.
     [echo]     

init:

clover.setup:
    [mkdir] Created dir: /tmp/lucene-nightly-gsi/build/test/clover/db
[clover-setup] Clover Version 1.3.2, built on November 01 2004
[clover-setup] loaded from: /export/home/gsingers/bin/apache-ant-1.6.5/lib/clover.jar
[clover-setup] Open Source License registered to the Apache Software Foundation. This license
of Clover is provided to support projects of the Apache Software Foundation only.

[clover-setup] Clover is enabled with initstring '/tmp/lucene-nightly-gsi/build/test/clover/db/lucene_coverage.db'

clover.info:

clover:

common.compile-core:
    [mkdir] Created dir: /tmp/lucene-nightly-gsi/build/classes/java
    [javac] Compiling 204 source files to /tmp/lucene-nightly-gsi/build/classes/java
   [clover] Clover Version 1.3.2, built on November 01 2004
   [clover] loaded from: /export/home/gsingers/bin/apache-ant-1.6.5/lib/clover.jar
   [clover] Open Source License registered to the Apache Software Foundation. This license
of Clover is provided to support projects of the Apache Software Foundation only.

   [clover] No coverage database '/tmp/lucene-nightly-gsi/build/test/clover/db/lucene_coverage.db'
found. Creating a fresh one.
   [clover] Clover all over. Instrumented 204 files.
    [javac] Note: /var/tmp/clover44975.tmp/src44976.tmp/org/apache/lucene/queryParser/QueryParser.java
uses or overrides a deprecated API.
    [javac] Note: Recompile with -deprecation for details.

compile-core:
     [rmic] RMI Compiling 1 class to /tmp/lucene-nightly-gsi/build/classes/java

compile-demo:
    [mkdir] Created dir: /tmp/lucene-nightly-gsi/build/classes/demo
    [javac] Compiling 17 source files to /tmp/lucene-nightly-gsi/build/classes/demo
   [clover] Clover Version 1.3.2, built on November 01 2004
   [clover] loaded from: /export/home/gsingers/bin/apache-ant-1.6.5/lib/clover.jar
   [clover] Open Source License registered to the Apache Software Foundation. This license
of Clover is provided to support projects of the Apache Software Foundation only.

   [clover] Updating database at '/tmp/lucene-nightly-gsi/build/test/clover/db/lucene_coverage.db'
   [clover] Clover all over. Instrumented 0 files.

common.compile-test:
    [mkdir] Created dir: /tmp/lucene-nightly-gsi/build/classes/test
    [javac] Compiling 124 source files to /tmp/lucene-nightly-gsi/build/classes/test
   [clover] Clover Version 1.3.2, built on November 01 2004
   [clover] loaded from: /export/home/gsingers/bin/apache-ant-1.6.5/lib/clover.jar
   [clover] Open Source License registered to the Apache Software Foundation. This license
of Clover is provided to support projects of the Apache Software Foundation only.

   [clover] Updating database at '/tmp/lucene-nightly-gsi/build/test/clover/db/lucene_coverage.db'
   [clover] Clover all over. Instrumented 0 files.
    [javac] Note: /var/tmp/clover44979.tmp/src44980.tmp/org/apache/lucene/queryParser/TestQueryParser.java
uses or overrides a deprecated API.
    [javac] Note: Recompile with -deprecation for details.
     [copy] Copying 2 files to /tmp/lucene-nightly-gsi/build/classes/test
     [copy] Copied 1 empty directory to 1 empty directory under /tmp/lucene-nightly-gsi/build/classes/test

compile-test:

test:
    [junit] Testsuite: org.apache.lucene.TestDemo
    [junit] Tests run: 1, Failures: 0, Errors: 0, Time elapsed: 0.633 sec

    [junit] Testsuite: org.apache.lucene.TestHitIterator
    [junit] Tests run: 1, Failures: 0, Errors: 0, Time elapsed: 0.531 sec

    [junit] Testsuite: org.apache.lucene.TestSearch
    [junit] Tests run: 1, Failures: 0, Errors: 0, Time elapsed: 0.67 sec

    [junit] Testsuite: org.apache.lucene.TestSearchForDuplicates
    [junit] Tests run: 1, Failures: 0, Errors: 0, Time elapsed: 1.325 sec

    [junit] Testsuite: org.apache.lucene.analysis.TestAnalyzers
    [junit] Tests run: 3, Failures: 0, Errors: 0, Time elapsed: 0.309 sec

    [junit] Testsuite: org.apache.lucene.analysis.TestISOLatin1AccentFilter
    [junit] Tests run: 1, Failures: 0, Errors: 0, Time elapsed: 0.321 sec

    [junit] Testsuite: org.apache.lucene.analysis.TestKeywordAnalyzer
    [junit] Tests run: 1, Failures: 0, Errors: 0, Time elapsed: 0.567 sec

    [junit] Testsuite: org.apache.lucene.analysis.TestLengthFilter
    [junit] Tests run: 1, Failures: 0, Errors: 0, Time elapsed: 0.314 sec

    [junit] Testsuite: org.apache.lucene.analysis.TestPerFieldAnalzyerWrapper
    [junit] Tests run: 1, Failures: 0, Errors: 0, Time elapsed: 0.311 sec

    [junit] Testsuite: org.apache.lucene.analysis.TestStandardAnalyzer
    [junit] Tests run: 1, Failures: 0, Errors: 0, Time elapsed: 0.473 sec

    [junit] Testsuite: org.apache.lucene.analysis.TestStopAnalyzer
    [junit] Tests run: 2, Failures: 0, Errors: 0, Time elapsed: 0.424 sec

    [junit] Testsuite: org.apache.lucene.analysis.TestStopFilter
    [junit] Tests run: 2, Failures: 0, Errors: 0, Time elapsed: 0.391 sec

    [junit] Testsuite: org.apache.lucene.document.TestBinaryDocument
    [junit] Tests run: 1, Failures: 0, Errors: 0, Time elapsed: 0.468 sec

    [junit] Testsuite: org.apache.lucene.document.TestDateTools
    [junit] Tests run: 5, Failures: 0, Errors: 0, Time elapsed: 0.336 sec

    [junit] Testsuite: org.apache.lucene.document.TestDocument
    [junit] Tests run: 5, Failures: 0, Errors: 0, Time elapsed: 0.577 sec

    [junit] Testsuite: org.apache.lucene.document.TestNumberTools
    [junit] Tests run: 3, Failures: 0, Errors: 0, Time elapsed: 0.702 sec

    [junit] Testsuite: org.apache.lucene.index.TestAddIndexesNoOptimize
    [junit] Tests run: 7, Failures: 0, Errors: 0, Time elapsed: 3.327 sec

    [junit] Testsuite: org.apache.lucene.index.TestBackwardsCompatibility
    [junit] Tests run: 9, Failures: 0, Errors: 0, Time elapsed: 1.218 sec

    [junit] Testsuite: org.apache.lucene.index.TestCompoundFile
    [junit] Tests run: 10, Failures: 0, Errors: 0, Time elapsed: 4.346 sec

    [junit] Testsuite: org.apache.lucene.index.TestDoc
    [junit] Tests run: 1, Failures: 0, Errors: 0, Time elapsed: 0.592 sec

    [junit] Testsuite: org.apache.lucene.index.TestDocumentWriter
    [junit] Tests run: 3, Failures: 0, Errors: 0, Time elapsed: 0.66 sec

    [junit] Testsuite: org.apache.lucene.index.TestFieldInfos
    [junit] Tests run: 1, Failures: 0, Errors: 0, Time elapsed: 0.368 sec

    [junit] Testsuite: org.apache.lucene.index.TestFieldsReader
    [junit] Tests run: 4, Failures: 0, Errors: 0, Time elapsed: 11.483 sec

    [junit] ------------- Standard Output ---------------
    [junit] Average Non-lazy time (should be very close to zero): 0 ms for 50 reads
    [junit] Average Lazy Time (should be greater than zero): 83 ms for 50 reads
    [junit] ------------- ---------------- ---------------
    [junit] Testsuite: org.apache.lucene.index.TestFilterIndexReader
    [junit] Tests run: 1, Failures: 0, Errors: 0, Time elapsed: 0.484 sec

    [junit] Testsuite: org.apache.lucene.index.TestIndexFileDeleter
    [junit] Tests run: 1, Failures: 0, Errors: 0, Time elapsed: 0.564 sec

    [junit] Testsuite: org.apache.lucene.index.TestIndexInput
    [junit] Tests run: 2, Failures: 0, Errors: 0, Time elapsed: 0.32 sec

    [junit] Testsuite: org.apache.lucene.index.TestIndexModifier
    [junit] Tests run: 3, Failures: 0, Errors: 1, Time elapsed: 0.527 sec

    [junit] Testcase: testIndexWithThreads(org.apache.lucene.index.TestIndexModifier):	Caused
an ERROR
    [junit] Cannot delete /var/tmp/lucenetestindex/_2v.cfs
    [junit] java.io.IOException: Cannot delete /var/tmp/lucenetestindex/_2v.cfs
    [junit] 	at org.apache.lucene.store.FSDirectory.create(FSDirectory.java:319)
    [junit] 	at org.apache.lucene.store.FSDirectory.init(FSDirectory.java:239)
    [junit] 	at org.apache.lucene.store.FSDirectory.init(FSDirectory.java:301)
    [junit] 	at org.apache.lucene.store.FSDirectory.getDirectory(FSDirectory.java:197)
    [junit] 	at org.apache.lucene.store.FSDirectory.getDirectory(FSDirectory.java:169)
    [junit] 	at org.apache.lucene.store.FSDirectory.getDirectory(FSDirectory.java:227)
    [junit] 	at org.apache.lucene.index.TestIndexModifier.testIndexInternal(TestIndexModifier.java:149)
    [junit] 	at org.apache.lucene.index.TestIndexModifier.testIndexWithThreads(TestIndexModifier.java:136)


    [junit] Test org.apache.lucene.index.TestIndexModifier FAILED
    [junit] Testsuite: org.apache.lucene.index.TestIndexReader
    [junit] Tests run: 16, Failures: 0, Errors: 0, Time elapsed: 3.749 sec

    [junit] Testsuite: org.apache.lucene.index.TestIndexWriter
    [junit] Tests run: 5, Failures: 0, Errors: 0, Time elapsed: 1.23 sec

    [junit] Testsuite: org.apache.lucene.index.TestIndexWriterLockRelease
    [junit] Tests run: 1, Failures: 0, Errors: 0, Time elapsed: 0.746 sec

    [junit] Testsuite: org.apache.lucene.index.TestIndexWriterMergePolicy
    [junit] Tests run: 6, Failures: 0, Errors: 0, Time elapsed: 5.051 sec

    [junit] Testsuite: org.apache.lucene.index.TestIndexWriterMerging
    [junit] Tests run: 1, Failures: 0, Errors: 0, Time elapsed: 1.207 sec

    [junit] Testsuite: org.apache.lucene.index.TestLazyBug
    [junit] Tests run: 3, Failures: 0, Errors: 0, Time elapsed: 30.741 sec

    [junit] Testsuite: org.apache.lucene.index.TestLazyProxSkipping
    [junit] Tests run: 1, Failures: 0, Errors: 0, Time elapsed: 2.068 sec

    [junit] Testsuite: org.apache.lucene.index.TestMultiReader
    [junit] Tests run: 4, Failures: 0, Errors: 0, Time elapsed: 1.044 sec

    [junit] Testsuite: org.apache.lucene.index.TestParallelReader
    [junit] Tests run: 4, Failures: 0, Errors: 0, Time elapsed: 1.277 sec

    [junit] Testsuite: org.apache.lucene.index.TestParallelTermEnum
    [junit] Tests run: 1, Failures: 0, Errors: 0, Time elapsed: 0.646 sec

    [junit] Testsuite: org.apache.lucene.index.TestSegmentMerger
    [junit] Tests run: 2, Failures: 0, Errors: 0, Time elapsed: 1.18 sec

    [junit] Testsuite: org.apache.lucene.index.TestSegmentReader
    [junit] Tests run: 7, Failures: 0, Errors: 0, Time elapsed: 1.227 sec

    [junit] Testsuite: org.apache.lucene.index.TestSegmentTermDocs
    [junit] Tests run: 4, Failures: 0, Errors: 0, Time elapsed: 1.085 sec

    [junit] Testsuite: org.apache.lucene.index.TestSegmentTermEnum
    [junit] Tests run: 1, Failures: 0, Errors: 0, Time elapsed: 1.417 sec

    [junit] Testsuite: org.apache.lucene.index.TestStressIndexing
    [junit] Tests run: 1, Failures: 0, Errors: 1, Time elapsed: 15.881 sec

    [junit] Testcase: testStressIndexAndSearching(org.apache.lucene.index.TestStressIndexing):
Caused an ERROR
    [junit] Cannot delete /var/tmp/lucene.test.stress/_32.cfs
    [junit] java.io.IOException: Cannot delete /var/tmp/lucene.test.stress/_32.cfs
    [junit] 	at org.apache.lucene.store.FSDirectory.create(FSDirectory.java:319)
    [junit] 	at org.apache.lucene.store.FSDirectory.init(FSDirectory.java:239)
    [junit] 	at org.apache.lucene.store.FSDirectory.init(FSDirectory.java:301)
    [junit] 	at org.apache.lucene.store.FSDirectory.getDirectory(FSDirectory.java:197)
    [junit] 	at org.apache.lucene.store.FSDirectory.getDirectory(FSDirectory.java:169)
    [junit] 	at org.apache.lucene.store.FSDirectory.getDirectory(FSDirectory.java:227)
    [junit] 	at org.apache.lucene.index.TestStressIndexing.testStressIndexAndSearching(TestStressIndexing.java:160)


    [junit] Test org.apache.lucene.index.TestStressIndexing FAILED
    [junit] Testsuite: org.apache.lucene.index.TestTermVectorsReader
    [junit] Tests run: 5, Failures: 0, Errors: 0, Time elapsed: 0.358 sec

    [junit] Testsuite: org.apache.lucene.index.TestTermVectorsWriter
    [junit] Tests run: 5, Failures: 0, Errors: 0, Time elapsed: 0.808 sec

    [junit] Testsuite: org.apache.lucene.index.TestTermdocPerf
    [junit] Tests run: 1, Failures: 0, Errors: 0, Time elapsed: 0.293 sec

    [junit] Testsuite: org.apache.lucene.index.TestWordlistLoader
    [junit] Tests run: 1, Failures: 0, Errors: 0, Time elapsed: 0.399 sec

    [junit] Testsuite: org.apache.lucene.index.store.TestRAMDirectory
    [junit] Tests run: 4, Failures: 0, Errors: 0, Time elapsed: 10.245 sec

    [junit] Testsuite: org.apache.lucene.queryParser.TestMultiAnalyzer
    [junit] Tests run: 3, Failures: 0, Errors: 0, Time elapsed: 0.537 sec

    [junit] Testsuite: org.apache.lucene.queryParser.TestMultiFieldQueryParser
    [junit] Tests run: 9, Failures: 0, Errors: 0, Time elapsed: 0.7 sec

    [junit] Testsuite: org.apache.lucene.queryParser.TestQueryParser
    [junit] Tests run: 21, Failures: 0, Errors: 0, Time elapsed: 0.713 sec

    [junit] Testsuite: org.apache.lucene.search.TestBoolean2
    [junit] Tests run: 11, Failures: 0, Errors: 0, Time elapsed: 1.783 sec

    [junit] Testsuite: org.apache.lucene.search.TestBooleanMinShouldMatch
    [junit] Tests run: 14, Failures: 0, Errors: 0, Time elapsed: 3.949 sec

    [junit] Testsuite: org.apache.lucene.search.TestBooleanOr
    [junit] Tests run: 5, Failures: 0, Errors: 0, Time elapsed: 0.574 sec

    [junit] Testsuite: org.apache.lucene.search.TestBooleanPrefixQuery
    [junit] Tests run: 1, Failures: 0, Errors: 0, Time elapsed: 0.528 sec

    [junit] Testsuite: org.apache.lucene.search.TestBooleanQuery
    [junit] Tests run: 2, Failures: 0, Errors: 0, Time elapsed: 0.342 sec

    [junit] Testsuite: org.apache.lucene.search.TestBooleanScorer
    [junit] Tests run: 1, Failures: 0, Errors: 0, Time elapsed: 0.649 sec

    [junit] Testsuite: org.apache.lucene.search.TestCachingWrapperFilter
    [junit] Tests run: 1, Failures: 0, Errors: 0, Time elapsed: 0.425 sec

    [junit] Testsuite: org.apache.lucene.search.TestComplexExplanations
    [junit] Tests run: 22, Failures: 0, Errors: 0, Time elapsed: 1.085 sec

    [junit] Testsuite: org.apache.lucene.search.TestComplexExplanationsOfNonMatches
    [junit] Tests run: 22, Failures: 0, Errors: 0, Time elapsed: 0.991 sec

    [junit] Testsuite: org.apache.lucene.search.TestConstantScoreRangeQuery
    [junit] Tests run: 7, Failures: 0, Errors: 0, Time elapsed: 1.373 sec

    [junit] Testsuite: org.apache.lucene.search.TestCustomSearcherSort
    [junit] Tests run: 3, Failures: 0, Errors: 0, Time elapsed: 6.318 sec

    [junit] Testsuite: org.apache.lucene.search.TestDateFilter
    [junit] Tests run: 2, Failures: 0, Errors: 0, Time elapsed: 0.533 sec

    [junit] Testsuite: org.apache.lucene.search.TestDisjunctionMaxQuery
    [junit] Tests run: 8, Failures: 0, Errors: 0, Time elapsed: 0.595 sec

    [junit] Testsuite: org.apache.lucene.search.TestDocBoost
    [junit] Tests run: 1, Failures: 0, Errors: 0, Time elapsed: 0.472 sec

    [junit] Testsuite: org.apache.lucene.search.TestExplanations
    [junit] Tests run: 1, Failures: 0, Errors: 0, Time elapsed: 0.465 sec

    [junit] Testsuite: org.apache.lucene.search.TestFilteredQuery
    [junit] Tests run: 3, Failures: 0, Errors: 0, Time elapsed: 0.609 sec

    [junit] Testsuite: org.apache.lucene.search.TestFuzzyQuery
    [junit] Tests run: 2, Failures: 0, Errors: 0, Time elapsed: 0.624 sec

    [junit] Testsuite: org.apache.lucene.search.TestMatchAllDocsQuery
    [junit] Tests run: 2, Failures: 0, Errors: 0, Time elapsed: 0.554 sec

    [junit] Testsuite: org.apache.lucene.search.TestMultiPhraseQuery
    [junit] Tests run: 3, Failures: 0, Errors: 0, Time elapsed: 0.676 sec

    [junit] Testsuite: org.apache.lucene.search.TestMultiSearcher
    [junit] Tests run: 2, Failures: 0, Errors: 0, Time elapsed: 0.729 sec

    [junit] Testsuite: org.apache.lucene.search.TestMultiSearcherRanking
    [junit] Tests run: 7, Failures: 0, Errors: 0, Time elapsed: 1.158 sec

    [junit] Testsuite: org.apache.lucene.search.TestMultiThreadTermVectors
    [junit] Tests run: 1, Failures: 0, Errors: 0, Time elapsed: 1.928 sec

    [junit] Testsuite: org.apache.lucene.search.TestNot
    [junit] Tests run: 1, Failures: 0, Errors: 0, Time elapsed: 0.539 sec

    [junit] Testsuite: org.apache.lucene.search.TestParallelMultiSearcher
    [junit] Tests run: 2, Failures: 0, Errors: 0, Time elapsed: 0.689 sec

    [junit] Testsuite: org.apache.lucene.search.TestPhrasePrefixQuery
    [junit] Tests run: 1, Failures: 0, Errors: 0, Time elapsed: 0.574 sec

    [junit] Testsuite: org.apache.lucene.search.TestPhraseQuery
    [junit] Tests run: 10, Failures: 0, Errors: 0, Time elapsed: 0.686 sec

    [junit] Testsuite: org.apache.lucene.search.TestPositionIncrement
    [junit] Tests run: 2, Failures: 0, Errors: 0, Time elapsed: 0.561 sec

    [junit] Testsuite: org.apache.lucene.search.TestPrefixFilter
    [junit] Tests run: 1, Failures: 0, Errors: 0, Time elapsed: 0.518 sec

    [junit] Testsuite: org.apache.lucene.search.TestPrefixQuery
    [junit] Tests run: 1, Failures: 0, Errors: 0, Time elapsed: 0.52 sec

    [junit] Testsuite: org.apache.lucene.search.TestQueryTermVector
    [junit] Tests run: 1, Failures: 0, Errors: 0, Time elapsed: 0.309 sec

    [junit] Testsuite: org.apache.lucene.search.TestRangeFilter
    [junit] Tests run: 3, Failures: 0, Errors: 0, Time elapsed: 2.061 sec

    [junit] Testsuite: org.apache.lucene.search.TestRangeQuery
    [junit] Tests run: 3, Failures: 0, Errors: 0, Time elapsed: 0.583 sec

    [junit] Testsuite: org.apache.lucene.search.TestRemoteSearchable
    [junit] Tests run: 5, Failures: 0, Errors: 0, Time elapsed: 0.73 sec

    [junit] Testsuite: org.apache.lucene.search.TestScorerPerf
    [junit] Tests run: 1, Failures: 0, Errors: 0, Time elapsed: 0.947 sec

    [junit] Testsuite: org.apache.lucene.search.TestSetNorm
    [junit] Tests run: 1, Failures: 0, Errors: 0, Time elapsed: 0.494 sec

    [junit] Testsuite: org.apache.lucene.search.TestSimilarity
    [junit] Tests run: 1, Failures: 0, Errors: 0, Time elapsed: 0.536 sec

    [junit] Testsuite: org.apache.lucene.search.TestSimpleExplanations
    [junit] Tests run: 53, Failures: 0, Errors: 0, Time elapsed: 1.19 sec

    [junit] Testsuite: org.apache.lucene.search.TestSimpleExplanationsOfNonMatches
    [junit] Tests run: 53, Failures: 0, Errors: 0, Time elapsed: 1.022 sec

    [junit] Testsuite: org.apache.lucene.search.TestSort
    [junit] Tests run: 17, Failures: 0, Errors: 0, Time elapsed: 2.566 sec

    [junit] Testsuite: org.apache.lucene.search.TestTermScorer
    [junit] Tests run: 4, Failures: 0, Errors: 0, Time elapsed: 0.52 sec

    [junit] Testsuite: org.apache.lucene.search.TestTermVectors
    [junit] Tests run: 5, Failures: 0, Errors: 0, Time elapsed: 5.748 sec

    [junit] Testsuite: org.apache.lucene.search.TestThreadSafe
    [junit] Tests run: 1, Failures: 0, Errors: 0, Time elapsed: 95.57 sec

    [junit] Testsuite: org.apache.lucene.search.TestWildcard
    [junit] Tests run: 4, Failures: 0, Errors: 0, Time elapsed: 0.536 sec

    [junit] Testsuite: org.apache.lucene.search.spans.TestBasics
    [junit] Tests run: 19, Failures: 0, Errors: 0, Time elapsed: 12.21 sec

    [junit] Testsuite: org.apache.lucene.search.spans.TestNearSpansOrdered
    [junit] Tests run: 10, Failures: 0, Errors: 0, Time elapsed: 0.53 sec

    [junit] Testsuite: org.apache.lucene.search.spans.TestSpanExplanations
    [junit] Tests run: 31, Failures: 0, Errors: 0, Time elapsed: 0.888 sec

    [junit] Testsuite: org.apache.lucene.search.spans.TestSpanExplanationsOfNonMatches
    [junit] Tests run: 31, Failures: 0, Errors: 0, Time elapsed: 0.835 sec

    [junit] Testsuite: org.apache.lucene.search.spans.TestSpans
    [junit] Tests run: 21, Failures: 0, Errors: 0, Time elapsed: 1.055 sec

    [junit] Testsuite: org.apache.lucene.search.spans.TestSpansAdvanced
    [junit] Tests run: 1, Failures: 0, Errors: 0, Time elapsed: 0.559 sec

    [junit] Testsuite: org.apache.lucene.search.spans.TestSpansAdvanced2
    [junit] Tests run: 4, Failures: 0, Errors: 0, Time elapsed: 0.63 sec

    [junit] Testsuite: org.apache.lucene.store.TestBufferedIndexInput
    [junit] Tests run: 3, Failures: 0, Errors: 0, Time elapsed: 1.501 sec

    [junit] Testsuite: org.apache.lucene.store.TestLock
    [junit] Tests run: 1, Failures: 0, Errors: 0, Time elapsed: 0.309 sec

    [junit] Testsuite: org.apache.lucene.store.TestLockFactory
    [junit] Tests run: 13, Failures: 0, Errors: 0, Time elapsed: 4.689 sec

    [junit] Testsuite: org.apache.lucene.store.TestWindowsMMap
    [junit] Tests run: 1, Failures: 0, Errors: 0, Time elapsed: 2.272 sec

    [junit] Testsuite: org.apache.lucene.util.TestBitVector
    [junit] Tests run: 6, Failures: 0, Errors: 0, Time elapsed: 4.977 sec

    [junit] Testsuite: org.apache.lucene.util.TestPriorityQueue
    [junit] Tests run: 3, Failures: 0, Errors: 0, Time elapsed: 0.321 sec

    [junit] Testsuite: org.apache.lucene.util.TestSmallFloat
    [junit] Tests run: 2, Failures: 0, Errors: 0, Time elapsed: 0.409 sec

    [junit] Testsuite: org.apache.lucene.util.TestStringHelper
    [junit] Tests run: 1, Failures: 0, Errors: 0, Time elapsed: 0.31 sec


BUILD FAILED
/tmp/lucene-nightly-gsi/common-build.xml:206: Tests failed!

Total time: 7 minutes 11 seconds



---------------------------------------------------------------------
To unsubscribe, e-mail: java-dev-unsubscribe@lucene.apache.org
For additional commands, e-mail: java-dev-help@lucene.apache.org


Mime
View raw message