lucene-dev mailing list archives

Site index · List index
Message view « Date » · « Thread »
Top « Date » · « Thread »
From java-...@lucene.apache.org
Subject Lucene nightly build failure
Date Sun, 17 Dec 2006 00:08:49 GMT

javacc-uptodate-check:

javacc-notice:
     [echo] 
     [echo]       One or more of the JavaCC .jj files is newer than its corresponding
     [echo]       .java file.  Run the "javacc" target to regenerate the artifacts.
     [echo]     

init:

clover.setup:

clover.info:
     [echo] 
     [echo]       Clover not found. Code coverage reports disabled.
     [echo]   	

clover:

common.compile-core:
    [mkdir] Created dir: /tmp/lucene-nightly/build/classes/java
    [javac] Compiling 204 source files to /tmp/lucene-nightly/build/classes/java
    [javac] Note: /tmp/lucene-nightly/src/java/org/apache/lucene/queryParser/QueryParser.java
uses or overrides a deprecated API.
    [javac] Note: Recompile with -deprecation for details.

compile-core:
     [rmic] RMI Compiling 1 class to /tmp/lucene-nightly/build/classes/java

compile-demo:
    [mkdir] Created dir: /tmp/lucene-nightly/build/classes/demo
    [javac] Compiling 17 source files to /tmp/lucene-nightly/build/classes/demo

common.compile-test:
    [mkdir] Created dir: /tmp/lucene-nightly/build/classes/test
    [javac] Compiling 124 source files to /tmp/lucene-nightly/build/classes/test
    [javac] Note: /tmp/lucene-nightly/src/test/org/apache/lucene/queryParser/TestQueryParser.java
uses or overrides a deprecated API.
    [javac] Note: Recompile with -deprecation for details.
     [copy] Copying 2 files to /tmp/lucene-nightly/build/classes/test
     [copy] Copied 1 empty directory to 1 empty directory under /tmp/lucene-nightly/build/classes/test

compile-test:

test:
    [mkdir] Created dir: /tmp/lucene-nightly/build/test
    [junit] Testsuite: org.apache.lucene.TestDemo
    [junit] Tests run: 1, Failures: 0, Errors: 0, Time elapsed: 0.401 sec

    [junit] Testsuite: org.apache.lucene.TestHitIterator
    [junit] Tests run: 1, Failures: 0, Errors: 0, Time elapsed: 0.356 sec

    [junit] Testsuite: org.apache.lucene.TestSearch
    [junit] Tests run: 1, Failures: 0, Errors: 0, Time elapsed: 0.412 sec

    [junit] Testsuite: org.apache.lucene.TestSearchForDuplicates
    [junit] Tests run: 1, Failures: 0, Errors: 0, Time elapsed: 0.982 sec

    [junit] Testsuite: org.apache.lucene.analysis.TestAnalyzers
    [junit] Tests run: 3, Failures: 0, Errors: 0, Time elapsed: 0.28 sec

    [junit] Testsuite: org.apache.lucene.analysis.TestISOLatin1AccentFilter
    [junit] Tests run: 1, Failures: 0, Errors: 0, Time elapsed: 0.291 sec

    [junit] Testsuite: org.apache.lucene.analysis.TestKeywordAnalyzer
    [junit] Tests run: 1, Failures: 0, Errors: 0, Time elapsed: 0.42 sec

    [junit] Testsuite: org.apache.lucene.analysis.TestLengthFilter
    [junit] Tests run: 1, Failures: 0, Errors: 0, Time elapsed: 0.285 sec

    [junit] Testsuite: org.apache.lucene.analysis.TestPerFieldAnalzyerWrapper
    [junit] Tests run: 1, Failures: 0, Errors: 0, Time elapsed: 0.291 sec

    [junit] Testsuite: org.apache.lucene.analysis.TestStandardAnalyzer
    [junit] Tests run: 1, Failures: 0, Errors: 0, Time elapsed: 0.368 sec

    [junit] Testsuite: org.apache.lucene.analysis.TestStopAnalyzer
    [junit] Tests run: 2, Failures: 0, Errors: 0, Time elapsed: 0.29 sec

    [junit] Testsuite: org.apache.lucene.analysis.TestStopFilter
    [junit] Tests run: 2, Failures: 0, Errors: 0, Time elapsed: 0.28 sec

    [junit] Testsuite: org.apache.lucene.document.TestBinaryDocument
    [junit] Tests run: 1, Failures: 0, Errors: 0, Time elapsed: 0.35 sec

    [junit] Testsuite: org.apache.lucene.document.TestDateTools
    [junit] Tests run: 5, Failures: 0, Errors: 0, Time elapsed: 0.313 sec

    [junit] Testsuite: org.apache.lucene.document.TestDocument
    [junit] Tests run: 5, Failures: 0, Errors: 0, Time elapsed: 0.369 sec

    [junit] Testsuite: org.apache.lucene.document.TestNumberTools
    [junit] Tests run: 3, Failures: 0, Errors: 0, Time elapsed: 0.625 sec

    [junit] Testsuite: org.apache.lucene.index.TestAddIndexesNoOptimize
    [junit] Tests run: 7, Failures: 0, Errors: 0, Time elapsed: 2.803 sec

    [junit] Testsuite: org.apache.lucene.index.TestBackwardsCompatibility
    [junit] Tests run: 9, Failures: 0, Errors: 0, Time elapsed: 0.908 sec

    [junit] Testsuite: org.apache.lucene.index.TestCompoundFile
    [junit] Tests run: 10, Failures: 0, Errors: 0, Time elapsed: 4.209 sec

    [junit] Testsuite: org.apache.lucene.index.TestDoc
    [junit] Tests run: 1, Failures: 0, Errors: 0, Time elapsed: 0.44 sec

    [junit] Testsuite: org.apache.lucene.index.TestDocumentWriter
    [junit] Tests run: 3, Failures: 0, Errors: 0, Time elapsed: 0.483 sec

    [junit] Testsuite: org.apache.lucene.index.TestFieldInfos
    [junit] Tests run: 1, Failures: 0, Errors: 0, Time elapsed: 0.346 sec

    [junit] Testsuite: org.apache.lucene.index.TestFieldsReader
    [junit] Tests run: 4, Failures: 0, Errors: 0, Time elapsed: 8.04 sec

    [junit] ------------- Standard Output ---------------
    [junit] Average Non-lazy time (should be very close to zero): 0 ms for 50 reads
    [junit] Average Lazy Time (should be greater than zero): 59 ms for 50 reads
    [junit] ------------- ---------------- ---------------
    [junit] Testsuite: org.apache.lucene.index.TestFilterIndexReader
    [junit] Tests run: 1, Failures: 0, Errors: 0, Time elapsed: 0.333 sec

    [junit] Testsuite: org.apache.lucene.index.TestIndexFileDeleter
    [junit] Tests run: 1, Failures: 0, Errors: 0, Time elapsed: 0.382 sec

    [junit] Testsuite: org.apache.lucene.index.TestIndexInput
    [junit] Tests run: 2, Failures: 0, Errors: 0, Time elapsed: 0.287 sec

    [junit] Testsuite: org.apache.lucene.index.TestIndexModifier
    [junit] Tests run: 3, Failures: 0, Errors: 0, Time elapsed: 41.162 sec

    [junit] Testsuite: org.apache.lucene.index.TestIndexReader
    [junit] Tests run: 16, Failures: 0, Errors: 0, Time elapsed: 3.003 sec

    [junit] Testsuite: org.apache.lucene.index.TestIndexWriter
    [junit] Tests run: 5, Failures: 0, Errors: 0, Time elapsed: 0.933 sec

    [junit] Testsuite: org.apache.lucene.index.TestIndexWriterLockRelease
    [junit] Tests run: 1, Failures: 0, Errors: 0, Time elapsed: 0.324 sec

    [junit] Testsuite: org.apache.lucene.index.TestIndexWriterMergePolicy
    [junit] Tests run: 6, Failures: 0, Errors: 0, Time elapsed: 4.083 sec

    [junit] Testsuite: org.apache.lucene.index.TestIndexWriterMerging
    [junit] Tests run: 1, Failures: 0, Errors: 0, Time elapsed: 0.86 sec

    [junit] Testsuite: org.apache.lucene.index.TestLazyBug
    [junit] Tests run: 3, Failures: 0, Errors: 0, Time elapsed: 16.37 sec

    [junit] Testsuite: org.apache.lucene.index.TestLazyProxSkipping
    [junit] Tests run: 1, Failures: 0, Errors: 0, Time elapsed: 1.507 sec

    [junit] Testsuite: org.apache.lucene.index.TestMultiReader
    [junit] Tests run: 4, Failures: 0, Errors: 0, Time elapsed: 0.685 sec

    [junit] Testsuite: org.apache.lucene.index.TestParallelReader
    [junit] Tests run: 4, Failures: 0, Errors: 0, Time elapsed: 0.516 sec

    [junit] Testsuite: org.apache.lucene.index.TestParallelTermEnum
    [junit] Tests run: 1, Failures: 0, Errors: 0, Time elapsed: 0.519 sec

    [junit] Testsuite: org.apache.lucene.index.TestSegmentMerger
    [junit] Tests run: 2, Failures: 0, Errors: 0, Time elapsed: 1.199 sec

    [junit] Testsuite: org.apache.lucene.index.TestSegmentReader
    [junit] Tests run: 7, Failures: 0, Errors: 0, Time elapsed: 0.659 sec

    [junit] Testsuite: org.apache.lucene.index.TestSegmentTermDocs
    [junit] Tests run: 4, Failures: 0, Errors: 0, Time elapsed: 0.923 sec

    [junit] Testsuite: org.apache.lucene.index.TestSegmentTermEnum
    [junit] Tests run: 1, Failures: 0, Errors: 0, Time elapsed: 0.87 sec

    [junit] Testsuite: org.apache.lucene.index.TestStressIndexing
    [junit] Tests run: 1, Failures: 0, Errors: 0, Time elapsed: 31.267 sec

    [junit] Testsuite: org.apache.lucene.index.TestTermVectorsReader
    [junit] Tests run: 5, Failures: 0, Errors: 0, Time elapsed: 0.32 sec

    [junit] Testsuite: org.apache.lucene.index.TestTermVectorsWriter
    [junit] Tests run: 5, Failures: 0, Errors: 0, Time elapsed: 0.389 sec

    [junit] Testsuite: org.apache.lucene.index.TestTermdocPerf
    [junit] Tests run: 1, Failures: 0, Errors: 0, Time elapsed: 0.512 sec

    [junit] Testsuite: org.apache.lucene.index.TestWordlistLoader
    [junit] Tests run: 1, Failures: 0, Errors: 0, Time elapsed: 0.3 sec

    [junit] Testsuite: org.apache.lucene.index.store.TestRAMDirectory
    [junit] Tests run: 4, Failures: 0, Errors: 4, Time elapsed: 0.441 sec

    [junit] Testcase: testRAMDirectory(org.apache.lucene.index.store.TestRAMDirectory):	Caused
an ERROR
    [junit] Cannot delete /var/tmp/RAMDirIndex/_a.cfs
    [junit] java.io.IOException: Cannot delete /var/tmp/RAMDirIndex/_a.cfs
    [junit] 	at org.apache.lucene.store.FSDirectory.create(FSDirectory.java:319)
    [junit] 	at org.apache.lucene.store.FSDirectory.init(FSDirectory.java:239)
    [junit] 	at org.apache.lucene.store.FSDirectory.init(FSDirectory.java:301)
    [junit] 	at org.apache.lucene.store.FSDirectory.getDirectory(FSDirectory.java:197)
    [junit] 	at org.apache.lucene.store.FSDirectory.getDirectory(FSDirectory.java:169)
    [junit] 	at org.apache.lucene.store.FSDirectory.getDirectory(FSDirectory.java:227)
    [junit] 	at org.apache.lucene.index.IndexWriter.<init>(IndexWriter.java:220)
    [junit] 	at org.apache.lucene.index.store.TestRAMDirectory.setUp(TestRAMDirectory.java:58)


    [junit] Testcase: testRAMDirectoryFile(org.apache.lucene.index.store.TestRAMDirectory):
Caused an ERROR
    [junit] Cannot delete /var/tmp/RAMDirIndex/_a.cfs
    [junit] java.io.IOException: Cannot delete /var/tmp/RAMDirIndex/_a.cfs
    [junit] 	at org.apache.lucene.store.FSDirectory.create(FSDirectory.java:319)
    [junit] 	at org.apache.lucene.store.FSDirectory.init(FSDirectory.java:239)
    [junit] 	at org.apache.lucene.store.FSDirectory.init(FSDirectory.java:301)
    [junit] 	at org.apache.lucene.store.FSDirectory.getDirectory(FSDirectory.java:197)
    [junit] 	at org.apache.lucene.store.FSDirectory.getDirectory(FSDirectory.java:169)
    [junit] 	at org.apache.lucene.store.FSDirectory.getDirectory(FSDirectory.java:227)
    [junit] 	at org.apache.lucene.index.IndexWriter.<init>(IndexWriter.java:220)
    [junit] 	at org.apache.lucene.index.store.TestRAMDirectory.setUp(TestRAMDirectory.java:58)


    [junit] Testcase: testRAMDirectoryString(org.apache.lucene.index.store.TestRAMDirectory):
Caused an ERROR
    [junit] Cannot delete /var/tmp/RAMDirIndex/_a.cfs
    [junit] java.io.IOException: Cannot delete /var/tmp/RAMDirIndex/_a.cfs
    [junit] 	at org.apache.lucene.store.FSDirectory.create(FSDirectory.java:319)
    [junit] 	at org.apache.lucene.store.FSDirectory.init(FSDirectory.java:239)
    [junit] 	at org.apache.lucene.store.FSDirectory.init(FSDirectory.java:301)
    [junit] 	at org.apache.lucene.store.FSDirectory.getDirectory(FSDirectory.java:197)
    [junit] 	at org.apache.lucene.store.FSDirectory.getDirectory(FSDirectory.java:169)
    [junit] 	at org.apache.lucene.store.FSDirectory.getDirectory(FSDirectory.java:227)
    [junit] 	at org.apache.lucene.index.IndexWriter.<init>(IndexWriter.java:220)
    [junit] 	at org.apache.lucene.index.store.TestRAMDirectory.setUp(TestRAMDirectory.java:58)


    [junit] Testcase: testRAMDirectorySize(org.apache.lucene.index.store.TestRAMDirectory):
Caused an ERROR
    [junit] Cannot delete /var/tmp/RAMDirIndex/_a.cfs
    [junit] java.io.IOException: Cannot delete /var/tmp/RAMDirIndex/_a.cfs
    [junit] 	at org.apache.lucene.store.FSDirectory.create(FSDirectory.java:319)
    [junit] 	at org.apache.lucene.store.FSDirectory.init(FSDirectory.java:239)
    [junit] 	at org.apache.lucene.store.FSDirectory.init(FSDirectory.java:301)
    [junit] 	at org.apache.lucene.store.FSDirectory.getDirectory(FSDirectory.java:197)
    [junit] 	at org.apache.lucene.store.FSDirectory.getDirectory(FSDirectory.java:169)
    [junit] 	at org.apache.lucene.store.FSDirectory.getDirectory(FSDirectory.java:227)
    [junit] 	at org.apache.lucene.index.IndexWriter.<init>(IndexWriter.java:220)
    [junit] 	at org.apache.lucene.index.store.TestRAMDirectory.setUp(TestRAMDirectory.java:58)


    [junit] Test org.apache.lucene.index.store.TestRAMDirectory FAILED
    [junit] Testsuite: org.apache.lucene.queryParser.TestMultiAnalyzer
    [junit] Tests run: 3, Failures: 0, Errors: 0, Time elapsed: 0.403 sec

    [junit] Testsuite: org.apache.lucene.queryParser.TestMultiFieldQueryParser
    [junit] Tests run: 9, Failures: 0, Errors: 0, Time elapsed: 0.729 sec

    [junit] Testsuite: org.apache.lucene.queryParser.TestQueryParser
    [junit] Tests run: 21, Failures: 0, Errors: 0, Time elapsed: 0.583 sec

    [junit] Testsuite: org.apache.lucene.search.TestBoolean2
    [junit] Tests run: 11, Failures: 0, Errors: 0, Time elapsed: 1.096 sec

    [junit] Testsuite: org.apache.lucene.search.TestBooleanMinShouldMatch
    [junit] Tests run: 14, Failures: 0, Errors: 0, Time elapsed: 1.817 sec

    [junit] Testsuite: org.apache.lucene.search.TestBooleanOr
    [junit] Tests run: 5, Failures: 0, Errors: 0, Time elapsed: 0.54 sec

    [junit] Testsuite: org.apache.lucene.search.TestBooleanPrefixQuery
    [junit] Tests run: 1, Failures: 0, Errors: 0, Time elapsed: 0.374 sec

    [junit] Testsuite: org.apache.lucene.search.TestBooleanQuery
    [junit] Tests run: 2, Failures: 0, Errors: 0, Time elapsed: 0.524 sec

    [junit] Testsuite: org.apache.lucene.search.TestBooleanScorer
    [junit] Tests run: 1, Failures: 0, Errors: 0, Time elapsed: 0.678 sec

    [junit] Testsuite: org.apache.lucene.search.TestCachingWrapperFilter
    [junit] Tests run: 1, Failures: 0, Errors: 0, Time elapsed: 0.368 sec

    [junit] Testsuite: org.apache.lucene.search.TestComplexExplanations
    [junit] Tests run: 22, Failures: 0, Errors: 0, Time elapsed: 0.726 sec

    [junit] Testsuite: org.apache.lucene.search.TestComplexExplanationsOfNonMatches
    [junit] Tests run: 22, Failures: 0, Errors: 0, Time elapsed: 0.633 sec

    [junit] Testsuite: org.apache.lucene.search.TestConstantScoreRangeQuery
    [junit] Tests run: 7, Failures: 0, Errors: 0, Time elapsed: 0.956 sec

    [junit] Testsuite: org.apache.lucene.search.TestCustomSearcherSort
    [junit] Tests run: 3, Failures: 0, Errors: 0, Time elapsed: 4.671 sec

    [junit] Testsuite: org.apache.lucene.search.TestDateFilter
    [junit] Tests run: 2, Failures: 0, Errors: 0, Time elapsed: 0.427 sec

    [junit] Testsuite: org.apache.lucene.search.TestDisjunctionMaxQuery
    [junit] Tests run: 8, Failures: 0, Errors: 0, Time elapsed: 0.465 sec

    [junit] Testsuite: org.apache.lucene.search.TestDocBoost
    [junit] Tests run: 1, Failures: 0, Errors: 0, Time elapsed: 0.375 sec

    [junit] Testsuite: org.apache.lucene.search.TestExplanations
    [junit] Tests run: 1, Failures: 0, Errors: 0, Time elapsed: 0.348 sec

    [junit] Testsuite: org.apache.lucene.search.TestFilteredQuery
    [junit] Tests run: 3, Failures: 0, Errors: 0, Time elapsed: 0.422 sec

    [junit] Testsuite: org.apache.lucene.search.TestFuzzyQuery
    [junit] Tests run: 2, Failures: 0, Errors: 0, Time elapsed: 0.403 sec

    [junit] Testsuite: org.apache.lucene.search.TestMatchAllDocsQuery
    [junit] Tests run: 2, Failures: 0, Errors: 0, Time elapsed: 0.393 sec

    [junit] Testsuite: org.apache.lucene.search.TestMultiPhraseQuery
    [junit] Tests run: 3, Failures: 0, Errors: 0, Time elapsed: 0.427 sec

    [junit] Testsuite: org.apache.lucene.search.TestMultiSearcher
    [junit] Tests run: 2, Failures: 0, Errors: 0, Time elapsed: 0.525 sec

    [junit] Testsuite: org.apache.lucene.search.TestMultiSearcherRanking
    [junit] Tests run: 7, Failures: 0, Errors: 0, Time elapsed: 0.813 sec

    [junit] Testsuite: org.apache.lucene.search.TestMultiThreadTermVectors
    [junit] Tests run: 1, Failures: 0, Errors: 0, Time elapsed: 1.137 sec

    [junit] Testsuite: org.apache.lucene.search.TestNot
    [junit] Tests run: 1, Failures: 0, Errors: 0, Time elapsed: 0.407 sec

    [junit] Testsuite: org.apache.lucene.search.TestParallelMultiSearcher
    [junit] Tests run: 2, Failures: 0, Errors: 0, Time elapsed: 0.508 sec

    [junit] Testsuite: org.apache.lucene.search.TestPhrasePrefixQuery
    [junit] Tests run: 1, Failures: 0, Errors: 0, Time elapsed: 0.393 sec

    [junit] Testsuite: org.apache.lucene.search.TestPhraseQuery
    [junit] Tests run: 10, Failures: 0, Errors: 0, Time elapsed: 0.446 sec

    [junit] Testsuite: org.apache.lucene.search.TestPositionIncrement
    [junit] Tests run: 2, Failures: 0, Errors: 0, Time elapsed: 0.369 sec

    [junit] Testsuite: org.apache.lucene.search.TestPrefixFilter
    [junit] Tests run: 1, Failures: 0, Errors: 0, Time elapsed: 0.367 sec

    [junit] Testsuite: org.apache.lucene.search.TestPrefixQuery
    [junit] Tests run: 1, Failures: 0, Errors: 0, Time elapsed: 0.379 sec

    [junit] Testsuite: org.apache.lucene.search.TestQueryTermVector
    [junit] Tests run: 1, Failures: 0, Errors: 0, Time elapsed: 0.288 sec

    [junit] Testsuite: org.apache.lucene.search.TestRangeFilter
    [junit] Tests run: 3, Failures: 0, Errors: 0, Time elapsed: 0.878 sec

    [junit] Testsuite: org.apache.lucene.search.TestRangeQuery
    [junit] Tests run: 3, Failures: 0, Errors: 0, Time elapsed: 0.413 sec

    [junit] Testsuite: org.apache.lucene.search.TestRemoteSearchable
    [junit] Tests run: 5, Failures: 0, Errors: 0, Time elapsed: 0.785 sec

    [junit] Testsuite: org.apache.lucene.search.TestScorerPerf
    [junit] Tests run: 1, Failures: 0, Errors: 0, Time elapsed: 0.682 sec

    [junit] Testsuite: org.apache.lucene.search.TestSetNorm
    [junit] Tests run: 1, Failures: 0, Errors: 0, Time elapsed: 0.357 sec

    [junit] Testsuite: org.apache.lucene.search.TestSimilarity
    [junit] Tests run: 1, Failures: 0, Errors: 0, Time elapsed: 0.41 sec

    [junit] Testsuite: org.apache.lucene.search.TestSimpleExplanations
    [junit] Tests run: 53, Failures: 0, Errors: 0, Time elapsed: 0.908 sec

    [junit] Testsuite: org.apache.lucene.search.TestSimpleExplanationsOfNonMatches
    [junit] Tests run: 53, Failures: 0, Errors: 0, Time elapsed: 0.804 sec

    [junit] Testsuite: org.apache.lucene.search.TestSort
    [junit] Tests run: 17, Failures: 0, Errors: 0, Time elapsed: 2.077 sec

    [junit] Testsuite: org.apache.lucene.search.TestTermScorer
    [junit] Tests run: 4, Failures: 0, Errors: 0, Time elapsed: 0.404 sec

    [junit] Testsuite: org.apache.lucene.search.TestTermVectors
    [junit] Tests run: 5, Failures: 0, Errors: 0, Time elapsed: 4.717 sec

    [junit] Testsuite: org.apache.lucene.search.TestThreadSafe
    [junit] Tests run: 1, Failures: 0, Errors: 0, Time elapsed: 9.109 sec

    [junit] Testsuite: org.apache.lucene.search.TestWildcard
    [junit] Tests run: 4, Failures: 0, Errors: 0, Time elapsed: 0.412 sec

    [junit] Testsuite: org.apache.lucene.search.spans.TestBasics
    [junit] Tests run: 19, Failures: 0, Errors: 0, Time elapsed: 10.53 sec

    [junit] Testsuite: org.apache.lucene.search.spans.TestNearSpansOrdered
    [junit] Tests run: 10, Failures: 0, Errors: 0, Time elapsed: 0.45 sec

    [junit] Testsuite: org.apache.lucene.search.spans.TestSpanExplanations
    [junit] Tests run: 31, Failures: 0, Errors: 0, Time elapsed: 0.631 sec

    [junit] Testsuite: org.apache.lucene.search.spans.TestSpanExplanationsOfNonMatches
    [junit] Tests run: 31, Failures: 0, Errors: 0, Time elapsed: 0.644 sec

    [junit] Testsuite: org.apache.lucene.search.spans.TestSpans
    [junit] Tests run: 21, Failures: 0, Errors: 0, Time elapsed: 0.808 sec

    [junit] Testsuite: org.apache.lucene.search.spans.TestSpansAdvanced
    [junit] Tests run: 1, Failures: 0, Errors: 0, Time elapsed: 0.44 sec

    [junit] Testsuite: org.apache.lucene.search.spans.TestSpansAdvanced2
    [junit] Tests run: 4, Failures: 0, Errors: 0, Time elapsed: 0.479 sec

    [junit] Testsuite: org.apache.lucene.store.TestBufferedIndexInput
    [junit] Tests run: 3, Failures: 0, Errors: 0, Time elapsed: 1.496 sec

    [junit] Testsuite: org.apache.lucene.store.TestLock
    [junit] Tests run: 1, Failures: 0, Errors: 0, Time elapsed: 0.277 sec

    [junit] Testsuite: org.apache.lucene.store.TestLockFactory
    [junit] Tests run: 13, Failures: 0, Errors: 0, Time elapsed: 4.586 sec

    [junit] Testsuite: org.apache.lucene.store.TestWindowsMMap
    [junit] Tests run: 1, Failures: 0, Errors: 0, Time elapsed: 1.708 sec

    [junit] Testsuite: org.apache.lucene.util.TestBitVector
    [junit] Tests run: 6, Failures: 0, Errors: 0, Time elapsed: 2.05 sec

    [junit] Testsuite: org.apache.lucene.util.TestPriorityQueue
    [junit] Tests run: 3, Failures: 0, Errors: 0, Time elapsed: 0.309 sec

    [junit] Testsuite: org.apache.lucene.util.TestSmallFloat
    [junit] Tests run: 2, Failures: 0, Errors: 0, Time elapsed: 0.431 sec

    [junit] Testsuite: org.apache.lucene.util.TestStringHelper
    [junit] Tests run: 1, Failures: 0, Errors: 0, Time elapsed: 0.289 sec


BUILD FAILED
/tmp/lucene-nightly/common-build.xml:206: Tests failed!

Total time: 4 minutes 59 seconds



---------------------------------------------------------------------
To unsubscribe, e-mail: java-dev-unsubscribe@lucene.apache.org
For additional commands, e-mail: java-dev-help@lucene.apache.org


Mime
View raw message