lucene-dev mailing list archives

Site index · List index
Message view « Date » · « Thread »
Top « Date » · « Thread »
From java-...@lucene.apache.org
Subject Lucene nightly build failure
Date Fri, 03 Nov 2006 00:44:52 GMT

javacc-uptodate-check:

javacc-notice:
     [echo] 
     [echo]       One or more of the JavaCC .jj files is newer than its corresponding
     [echo]       .java file.  Run the "javacc" target to regenerate the artifacts.
     [echo]     

init:

common.compile-core:
    [mkdir] Created dir: /tmp/lucene-nightly/build/classes/java
    [javac] Compiling 203 source files to /tmp/lucene-nightly/build/classes/java
    [javac] Note: Some input files use or override a deprecated API.
    [javac] Note: Recompile with -deprecation for details.

compile-core:
     [rmic] RMI Compiling 1 class to /tmp/lucene-nightly/build/classes/java

compile-demo:
    [mkdir] Created dir: /tmp/lucene-nightly/build/classes/demo
    [javac] Compiling 17 source files to /tmp/lucene-nightly/build/classes/demo

common.compile-test:
    [mkdir] Created dir: /tmp/lucene-nightly/build/classes/test
    [javac] Compiling 119 source files to /tmp/lucene-nightly/build/classes/test
    [javac] Note: /tmp/lucene-nightly/src/test/org/apache/lucene/queryParser/TestQueryParser.java
uses or overrides a deprecated API.
    [javac] Note: Recompile with -deprecation for details.
     [copy] Copied 1 empty directory to 1 empty directory under /tmp/lucene-nightly/build/classes/test

compile-test:

test:
    [mkdir] Created dir: /tmp/lucene-nightly/build/test
    [junit] Testsuite: org.apache.lucene.TestDemo
    [junit] Tests run: 1, Failures: 0, Errors: 0, Time elapsed: 0.505 sec

    [junit] Testsuite: org.apache.lucene.TestHitIterator
    [junit] Tests run: 1, Failures: 0, Errors: 0, Time elapsed: 0.369 sec

    [junit] Testsuite: org.apache.lucene.TestSearch
    [junit] Tests run: 1, Failures: 0, Errors: 0, Time elapsed: 0.429 sec

    [junit] Testsuite: org.apache.lucene.TestSearchForDuplicates
    [junit] Tests run: 1, Failures: 0, Errors: 0, Time elapsed: 0.886 sec

    [junit] Testsuite: org.apache.lucene.analysis.TestAnalyzers
    [junit] Tests run: 3, Failures: 0, Errors: 0, Time elapsed: 0.286 sec

    [junit] Testsuite: org.apache.lucene.analysis.TestISOLatin1AccentFilter
    [junit] Tests run: 1, Failures: 0, Errors: 0, Time elapsed: 0.297 sec

    [junit] Testsuite: org.apache.lucene.analysis.TestKeywordAnalyzer
    [junit] Tests run: 1, Failures: 0, Errors: 0, Time elapsed: 0.42 sec

    [junit] Testsuite: org.apache.lucene.analysis.TestLengthFilter
    [junit] Tests run: 1, Failures: 0, Errors: 0, Time elapsed: 0.273 sec

    [junit] Testsuite: org.apache.lucene.analysis.TestPerFieldAnalzyerWrapper
    [junit] Tests run: 1, Failures: 0, Errors: 0, Time elapsed: 0.292 sec

    [junit] Testsuite: org.apache.lucene.analysis.TestStandardAnalyzer
    [junit] Tests run: 1, Failures: 0, Errors: 0, Time elapsed: 0.355 sec

    [junit] Testsuite: org.apache.lucene.analysis.TestStopAnalyzer
    [junit] Tests run: 2, Failures: 0, Errors: 0, Time elapsed: 0.261 sec

    [junit] Testsuite: org.apache.lucene.analysis.TestStopFilter
    [junit] Tests run: 2, Failures: 0, Errors: 0, Time elapsed: 0.283 sec

    [junit] Testsuite: org.apache.lucene.document.TestBinaryDocument
    [junit] Tests run: 1, Failures: 0, Errors: 0, Time elapsed: 0.377 sec

    [junit] Testsuite: org.apache.lucene.document.TestDateTools
    [junit] Tests run: 5, Failures: 0, Errors: 0, Time elapsed: 0.319 sec

    [junit] Testsuite: org.apache.lucene.document.TestDocument
    [junit] Tests run: 5, Failures: 0, Errors: 0, Time elapsed: 0.383 sec

    [junit] Testsuite: org.apache.lucene.document.TestNumberTools
    [junit] Tests run: 3, Failures: 0, Errors: 0, Time elapsed: 0.631 sec

    [junit] Testsuite: org.apache.lucene.index.TestAddIndexesNoOptimize
    [junit] Tests run: 7, Failures: 0, Errors: 0, Time elapsed: 2.615 sec

    [junit] Testsuite: org.apache.lucene.index.TestCompoundFile
    [junit] Tests run: 10, Failures: 0, Errors: 0, Time elapsed: 3.318 sec

    [junit] Testsuite: org.apache.lucene.index.TestDoc
    [junit] Tests run: 1, Failures: 0, Errors: 0, Time elapsed: 0.43 sec

    [junit] Testsuite: org.apache.lucene.index.TestDocumentWriter
    [junit] Tests run: 3, Failures: 0, Errors: 0, Time elapsed: 0.484 sec

    [junit] Testsuite: org.apache.lucene.index.TestFieldInfos
    [junit] Tests run: 1, Failures: 0, Errors: 0, Time elapsed: 0.344 sec

    [junit] Testsuite: org.apache.lucene.index.TestFieldsReader
    [junit] Tests run: 4, Failures: 0, Errors: 0, Time elapsed: 7.778 sec

    [junit] ------------- Standard Output ---------------
    [junit] Average Non-lazy time (should be very close to zero): 0 ms for 50 reads
    [junit] Average Lazy Time (should be greater than zero): 54 ms for 50 reads
    [junit] ------------- ---------------- ---------------
    [junit] Testsuite: org.apache.lucene.index.TestFilterIndexReader
    [junit] Tests run: 1, Failures: 0, Errors: 0, Time elapsed: 0.335 sec

    [junit] Testsuite: org.apache.lucene.index.TestIndexInput
    [junit] Tests run: 2, Failures: 0, Errors: 0, Time elapsed: 0.28 sec

    [junit] Testsuite: org.apache.lucene.index.TestIndexModifier
    [junit] Tests run: 3, Failures: 0, Errors: 0, Time elapsed: 36.426 sec

    [junit] Testsuite: org.apache.lucene.index.TestIndexReader
    [junit] Tests run: 11, Failures: 0, Errors: 0, Time elapsed: 2.868 sec

    [junit] Testsuite: org.apache.lucene.index.TestIndexWriter
    [junit] Tests run: 1, Failures: 0, Errors: 0, Time elapsed: 0.46 sec

    [junit] Testsuite: org.apache.lucene.index.TestIndexWriterMergePolicy
    [junit] Tests run: 6, Failures: 0, Errors: 0, Time elapsed: 3.787 sec

    [junit] Testsuite: org.apache.lucene.index.TestIndexWriterMerging
    [junit] Tests run: 1, Failures: 0, Errors: 0, Time elapsed: 0.793 sec

    [junit] Testsuite: org.apache.lucene.index.TestLazyBug
    [junit] Tests run: 3, Failures: 0, Errors: 0, Time elapsed: 15.316 sec

    [junit] Testsuite: org.apache.lucene.index.TestLazyProxSkipping
    [junit] Tests run: 1, Failures: 0, Errors: 0, Time elapsed: 1.161 sec

    [junit] Testsuite: org.apache.lucene.index.TestMultiReader
    [junit] Tests run: 4, Failures: 0, Errors: 0, Time elapsed: 0.652 sec

    [junit] Testsuite: org.apache.lucene.index.TestParallelReader
    [junit] Tests run: 4, Failures: 0, Errors: 0, Time elapsed: 0.495 sec

    [junit] Testsuite: org.apache.lucene.index.TestParallelTermEnum
    [junit] Tests run: 1, Failures: 0, Errors: 0, Time elapsed: 0.338 sec

    [junit] Testsuite: org.apache.lucene.index.TestSegmentMerger
    [junit] Tests run: 2, Failures: 0, Errors: 0, Time elapsed: 0.702 sec

    [junit] Testsuite: org.apache.lucene.index.TestSegmentReader
    [junit] Tests run: 7, Failures: 0, Errors: 0, Time elapsed: 0.609 sec

    [junit] Testsuite: org.apache.lucene.index.TestSegmentTermDocs
    [junit] Tests run: 4, Failures: 0, Errors: 0, Time elapsed: 0.616 sec

    [junit] Testsuite: org.apache.lucene.index.TestSegmentTermEnum
    [junit] Tests run: 1, Failures: 0, Errors: 0, Time elapsed: 0.594 sec

    [junit] Testsuite: org.apache.lucene.index.TestTermVectorsReader
    [junit] Tests run: 5, Failures: 0, Errors: 0, Time elapsed: 0.338 sec

    [junit] Testsuite: org.apache.lucene.index.TestTermVectorsWriter
    [junit] Tests run: 5, Failures: 0, Errors: 0, Time elapsed: 0.358 sec

    [junit] Testsuite: org.apache.lucene.index.TestTermdocPerf
    [junit] Tests run: 1, Failures: 0, Errors: 0, Time elapsed: 0.345 sec

    [junit] Testsuite: org.apache.lucene.index.TestWordlistLoader
    [junit] Tests run: 1, Failures: 0, Errors: 0, Time elapsed: 0.283 sec

    [junit] Testsuite: org.apache.lucene.index.store.TestRAMDirectory
    [junit] Tests run: 3, Failures: 0, Errors: 0, Time elapsed: 2.985 sec

    [junit] Testsuite: org.apache.lucene.queryParser.TestMultiAnalyzer
    [junit] Tests run: 3, Failures: 0, Errors: 0, Time elapsed: 0.353 sec

    [junit] Testsuite: org.apache.lucene.queryParser.TestMultiFieldQueryParser
    [junit] Tests run: 9, Failures: 0, Errors: 0, Time elapsed: 0.469 sec

    [junit] Testsuite: org.apache.lucene.queryParser.TestQueryParser
    [junit] Tests run: 19, Failures: 0, Errors: 0, Time elapsed: 0.483 sec

    [junit] Testsuite: org.apache.lucene.search.TestBoolean2
    [junit] Tests run: 11, Failures: 0, Errors: 0, Time elapsed: 0.989 sec

    [junit] Testsuite: org.apache.lucene.search.TestBooleanMinShouldMatch
    [junit] Tests run: 14, Failures: 0, Errors: 0, Time elapsed: 1.843 sec

    [junit] Testsuite: org.apache.lucene.search.TestBooleanOr
    [junit] Tests run: 5, Failures: 0, Errors: 0, Time elapsed: 0.458 sec

    [junit] Testsuite: org.apache.lucene.search.TestBooleanPrefixQuery
    [junit] Tests run: 1, Failures: 0, Errors: 0, Time elapsed: 0.357 sec

    [junit] Testsuite: org.apache.lucene.search.TestBooleanQuery
    [junit] Tests run: 2, Failures: 0, Errors: 0, Time elapsed: 0.282 sec

    [junit] Testsuite: org.apache.lucene.search.TestBooleanScorer
    [junit] Tests run: 1, Failures: 0, Errors: 0, Time elapsed: 0.359 sec

    [junit] Testsuite: org.apache.lucene.search.TestCachingWrapperFilter
    [junit] Tests run: 1, Failures: 0, Errors: 0, Time elapsed: 0.289 sec

    [junit] Testsuite: org.apache.lucene.search.TestComplexExplanations
    [junit] Tests run: 22, Failures: 0, Errors: 0, Time elapsed: 0.668 sec

    [junit] Testsuite: org.apache.lucene.search.TestComplexExplanationsOfNonMatches
    [junit] Tests run: 22, Failures: 0, Errors: 0, Time elapsed: 0.547 sec

    [junit] Testsuite: org.apache.lucene.search.TestConstantScoreRangeQuery
    [junit] Tests run: 7, Failures: 0, Errors: 0, Time elapsed: 0.805 sec

    [junit] Testsuite: org.apache.lucene.search.TestCustomSearcherSort
    [junit] Tests run: 3, Failures: 0, Errors: 0, Time elapsed: 4.445 sec

    [junit] Testsuite: org.apache.lucene.search.TestDateFilter
    [junit] Tests run: 2, Failures: 0, Errors: 0, Time elapsed: 0.419 sec

    [junit] Testsuite: org.apache.lucene.search.TestDisjunctionMaxQuery
    [junit] Tests run: 8, Failures: 0, Errors: 0, Time elapsed: 0.488 sec

    [junit] Testsuite: org.apache.lucene.search.TestDocBoost
    [junit] Tests run: 1, Failures: 0, Errors: 0, Time elapsed: 0.407 sec

    [junit] Testsuite: org.apache.lucene.search.TestExplanations
    [junit] Tests run: 1, Failures: 0, Errors: 0, Time elapsed: 0.355 sec

    [junit] Testsuite: org.apache.lucene.search.TestFilteredQuery
    [junit] Tests run: 3, Failures: 0, Errors: 0, Time elapsed: 0.593 sec

    [junit] Testsuite: org.apache.lucene.search.TestFuzzyQuery
    [junit] Tests run: 2, Failures: 0, Errors: 0, Time elapsed: 0.403 sec

    [junit] Testsuite: org.apache.lucene.search.TestMatchAllDocsQuery
    [junit] Tests run: 2, Failures: 0, Errors: 0, Time elapsed: 0.395 sec

    [junit] Testsuite: org.apache.lucene.search.TestMultiPhraseQuery
    [junit] Tests run: 3, Failures: 0, Errors: 0, Time elapsed: 0.43 sec

    [junit] Testsuite: org.apache.lucene.search.TestMultiSearcher
    [junit] Tests run: 2, Failures: 0, Errors: 0, Time elapsed: 0.488 sec

    [junit] Testsuite: org.apache.lucene.search.TestMultiSearcherRanking
    [junit] Tests run: 7, Failures: 0, Errors: 0, Time elapsed: 0.747 sec

    [junit] Testsuite: org.apache.lucene.search.TestMultiThreadTermVectors
    [junit] Tests run: 1, Failures: 0, Errors: 0, Time elapsed: 1.117 sec

    [junit] Testsuite: org.apache.lucene.search.TestNot
    [junit] Tests run: 1, Failures: 0, Errors: 0, Time elapsed: 0.464 sec

    [junit] Testsuite: org.apache.lucene.search.TestParallelMultiSearcher
    [junit] Tests run: 2, Failures: 0, Errors: 0, Time elapsed: 0.71 sec

    [junit] Testsuite: org.apache.lucene.search.TestPhrasePrefixQuery
    [junit] Tests run: 1, Failures: 0, Errors: 0, Time elapsed: 0.652 sec

    [junit] Testsuite: org.apache.lucene.search.TestPhraseQuery
    [junit] Tests run: 10, Failures: 0, Errors: 0, Time elapsed: 0.504 sec

    [junit] Testsuite: org.apache.lucene.search.TestPositionIncrement
    [junit] Tests run: 2, Failures: 0, Errors: 0, Time elapsed: 0.487 sec

    [junit] Testsuite: org.apache.lucene.search.TestPrefixFilter
    [junit] Tests run: 1, Failures: 0, Errors: 0, Time elapsed: 0.367 sec

    [junit] Testsuite: org.apache.lucene.search.TestPrefixQuery
    [junit] Tests run: 1, Failures: 0, Errors: 0, Time elapsed: 0.374 sec

    [junit] Testsuite: org.apache.lucene.search.TestQueryTermVector
    [junit] Tests run: 1, Failures: 0, Errors: 0, Time elapsed: 0.272 sec

    [junit] Testsuite: org.apache.lucene.search.TestRangeFilter
    [junit] Tests run: 3, Failures: 0, Errors: 0, Time elapsed: 0.832 sec

    [junit] Testsuite: org.apache.lucene.search.TestRangeQuery
    [junit] Tests run: 3, Failures: 0, Errors: 0, Time elapsed: 0.408 sec

    [junit] Testsuite: org.apache.lucene.search.TestRemoteSearchable
    [junit] Tests run: 5, Failures: 0, Errors: 5, Time elapsed: 1,348.53 sec

    [junit] Testcase: testTermQuery(org.apache.lucene.search.TestRemoteSearchable):	Caused
an ERROR
    [junit] Connection refused to host: 207.7.158.211; nested exception is: 
    [junit] 	java.net.ConnectException: Connection timed out
    [junit] java.rmi.ConnectException: Connection refused to host: 207.7.158.211; nested exception
is: 
    [junit] 	java.net.ConnectException: Connection timed out
    [junit] 	at sun.rmi.transport.tcp.TCPEndpoint.newSocket(TCPEndpoint.java:567)
    [junit] 	at sun.rmi.transport.tcp.TCPChannel.createConnection(TCPChannel.java:185)
    [junit] 	at sun.rmi.transport.tcp.TCPChannel.newConnection(TCPChannel.java:171)
    [junit] 	at sun.rmi.server.UnicastRef.invoke(UnicastRef.java:101)
    [junit] 	at org.apache.lucene.search.RemoteSearchable_Stub.maxDoc(Unknown Source)
    [junit] 	at org.apache.lucene.search.MultiSearcher.<init>(MultiSearcher.java:116)
    [junit] 	at org.apache.lucene.search.TestRemoteSearchable.search(TestRemoteSearchable.java:72)
    [junit] 	at org.apache.lucene.search.TestRemoteSearchable.testTermQuery(TestRemoteSearchable.java:80)
    [junit] Caused by: java.net.ConnectException: Connection timed out
    [junit] 	at java.net.PlainSocketImpl.socketConnect(Native Method)
    [junit] 	at java.net.PlainSocketImpl.doConnect(PlainSocketImpl.java:305)
    [junit] 	at java.net.PlainSocketImpl.connectToAddress(PlainSocketImpl.java:171)
    [junit] 	at java.net.PlainSocketImpl.connect(PlainSocketImpl.java:158)
    [junit] 	at java.net.Socket.connect(Socket.java:452)
    [junit] 	at java.net.Socket.connect(Socket.java:402)
    [junit] 	at java.net.Socket.<init>(Socket.java:309)
    [junit] 	at java.net.Socket.<init>(Socket.java:124)
    [junit] 	at sun.rmi.transport.proxy.RMIDirectSocketFactory.createSocket(RMIDirectSocketFactory.java:22)
    [junit] 	at sun.rmi.transport.proxy.RMIMasterSocketFactory.createSocket(RMIMasterSocketFactory.java:128)
    [junit] 	at sun.rmi.transport.tcp.TCPEndpoint.newSocket(TCPEndpoint.java:562)
    [junit] 	... 22 more


    [junit] Testcase: testBooleanQuery(org.apache.lucene.search.TestRemoteSearchable):	Caused
an ERROR
    [junit] Connection refused to host: 207.7.158.211; nested exception is: 
    [junit] 	java.net.ConnectException: Connection timed out
    [junit] java.rmi.ConnectException: Connection refused to host: 207.7.158.211; nested exception
is: 
    [junit] 	java.net.ConnectException: Connection timed out
    [junit] 	at sun.rmi.transport.tcp.TCPEndpoint.newSocket(TCPEndpoint.java:567)
    [junit] 	at sun.rmi.transport.tcp.TCPChannel.createConnection(TCPChannel.java:185)
    [junit] 	at sun.rmi.transport.tcp.TCPChannel.newConnection(TCPChannel.java:171)
    [junit] 	at sun.rmi.server.UnicastRef.invoke(UnicastRef.java:101)
    [junit] 	at org.apache.lucene.search.RemoteSearchable_Stub.maxDoc(Unknown Source)
    [junit] 	at org.apache.lucene.search.MultiSearcher.<init>(MultiSearcher.java:116)
    [junit] 	at org.apache.lucene.search.TestRemoteSearchable.search(TestRemoteSearchable.java:72)
    [junit] 	at org.apache.lucene.search.TestRemoteSearchable.testBooleanQuery(TestRemoteSearchable.java:86)
    [junit] Caused by: java.net.ConnectException: Connection timed out
    [junit] 	at java.net.PlainSocketImpl.socketConnect(Native Method)
    [junit] 	at java.net.PlainSocketImpl.doConnect(PlainSocketImpl.java:305)
    [junit] 	at java.net.PlainSocketImpl.connectToAddress(PlainSocketImpl.java:171)
    [junit] 	at java.net.PlainSocketImpl.connect(PlainSocketImpl.java:158)
    [junit] 	at java.net.Socket.connect(Socket.java:452)
    [junit] 	at java.net.Socket.connect(Socket.java:402)
    [junit] 	at java.net.Socket.<init>(Socket.java:309)
    [junit] 	at java.net.Socket.<init>(Socket.java:124)
    [junit] 	at sun.rmi.transport.proxy.RMIDirectSocketFactory.createSocket(RMIDirectSocketFactory.java:22)
    [junit] 	at sun.rmi.transport.proxy.RMIMasterSocketFactory.createSocket(RMIMasterSocketFactory.java:128)
    [junit] 	at sun.rmi.transport.tcp.TCPEndpoint.newSocket(TCPEndpoint.java:562)
    [junit] 	... 22 more


    [junit] Testcase: testPhraseQuery(org.apache.lucene.search.TestRemoteSearchable):	Caused
an ERROR
    [junit] Connection refused to host: 207.7.158.211; nested exception is: 
    [junit] 	java.net.ConnectException: Connection timed out
    [junit] java.rmi.ConnectException: Connection refused to host: 207.7.158.211; nested exception
is: 
    [junit] 	java.net.ConnectException: Connection timed out
    [junit] 	at sun.rmi.transport.tcp.TCPEndpoint.newSocket(TCPEndpoint.java:567)
    [junit] 	at sun.rmi.transport.tcp.TCPChannel.createConnection(TCPChannel.java:185)
    [junit] 	at sun.rmi.transport.tcp.TCPChannel.newConnection(TCPChannel.java:171)
    [junit] 	at sun.rmi.server.UnicastRef.invoke(UnicastRef.java:101)
    [junit] 	at org.apache.lucene.search.RemoteSearchable_Stub.maxDoc(Unknown Source)
    [junit] 	at org.apache.lucene.search.MultiSearcher.<init>(MultiSearcher.java:116)
    [junit] 	at org.apache.lucene.search.TestRemoteSearchable.search(TestRemoteSearchable.java:72)
    [junit] 	at org.apache.lucene.search.TestRemoteSearchable.testPhraseQuery(TestRemoteSearchable.java:93)
    [junit] Caused by: java.net.ConnectException: Connection timed out
    [junit] 	at java.net.PlainSocketImpl.socketConnect(Native Method)
    [junit] 	at java.net.PlainSocketImpl.doConnect(PlainSocketImpl.java:305)
    [junit] 	at java.net.PlainSocketImpl.connectToAddress(PlainSocketImpl.java:171)
    [junit] 	at java.net.PlainSocketImpl.connect(PlainSocketImpl.java:158)
    [junit] 	at java.net.Socket.connect(Socket.java:452)
    [junit] 	at java.net.Socket.connect(Socket.java:402)
    [junit] 	at java.net.Socket.<init>(Socket.java:309)
    [junit] 	at java.net.Socket.<init>(Socket.java:124)
    [junit] 	at sun.rmi.transport.proxy.RMIDirectSocketFactory.createSocket(RMIDirectSocketFactory.java:22)
    [junit] 	at sun.rmi.transport.proxy.RMIMasterSocketFactory.createSocket(RMIMasterSocketFactory.java:128)
    [junit] 	at sun.rmi.transport.tcp.TCPEndpoint.newSocket(TCPEndpoint.java:562)
    [junit] 	... 22 more


    [junit] Testcase: testQueryFilter(org.apache.lucene.search.TestRemoteSearchable):	Caused
an ERROR
    [junit] Connection refused to host: 207.7.158.211; nested exception is: 
    [junit] 	java.net.ConnectException: Connection timed out
    [junit] java.rmi.ConnectException: Connection refused to host: 207.7.158.211; nested exception
is: 
    [junit] 	java.net.ConnectException: Connection timed out
    [junit] 	at sun.rmi.transport.tcp.TCPEndpoint.newSocket(TCPEndpoint.java:567)
    [junit] 	at sun.rmi.transport.tcp.TCPChannel.createConnection(TCPChannel.java:185)
    [junit] 	at sun.rmi.transport.tcp.TCPChannel.newConnection(TCPChannel.java:171)
    [junit] 	at sun.rmi.server.UnicastRef.invoke(UnicastRef.java:101)
    [junit] 	at org.apache.lucene.search.RemoteSearchable_Stub.maxDoc(Unknown Source)
    [junit] 	at org.apache.lucene.search.MultiSearcher.<init>(MultiSearcher.java:116)
    [junit] 	at org.apache.lucene.search.TestRemoteSearchable.testQueryFilter(TestRemoteSearchable.java:100)
    [junit] Caused by: java.net.ConnectException: Connection timed out
    [junit] 	at java.net.PlainSocketImpl.socketConnect(Native Method)
    [junit] 	at java.net.PlainSocketImpl.doConnect(PlainSocketImpl.java:305)
    [junit] 	at java.net.PlainSocketImpl.connectToAddress(PlainSocketImpl.java:171)
    [junit] 	at java.net.PlainSocketImpl.connect(PlainSocketImpl.java:158)
    [junit] 	at java.net.Socket.connect(Socket.java:452)
    [junit] 	at java.net.Socket.connect(Socket.java:402)
    [junit] 	at java.net.Socket.<init>(Socket.java:309)
    [junit] 	at java.net.Socket.<init>(Socket.java:124)
    [junit] 	at sun.rmi.transport.proxy.RMIDirectSocketFactory.createSocket(RMIDirectSocketFactory.java:22)
    [junit] 	at sun.rmi.transport.proxy.RMIMasterSocketFactory.createSocket(RMIMasterSocketFactory.java:128)
    [junit] 	at sun.rmi.transport.tcp.TCPEndpoint.newSocket(TCPEndpoint.java:562)
    [junit] 	... 21 more


    [junit] Testcase: testConstantScoreQuery(org.apache.lucene.search.TestRemoteSearchable):
Caused an ERROR
    [junit] Connection refused to host: 207.7.158.211; nested exception is: 
    [junit] 	java.net.ConnectException: Connection timed out
    [junit] java.rmi.ConnectException: Connection refused to host: 207.7.158.211; nested exception
is: 
    [junit] 	java.net.ConnectException: Connection timed out
    [junit] 	at sun.rmi.transport.tcp.TCPEndpoint.newSocket(TCPEndpoint.java:567)
    [junit] 	at sun.rmi.transport.tcp.TCPChannel.createConnection(TCPChannel.java:185)
    [junit] 	at sun.rmi.transport.tcp.TCPChannel.newConnection(TCPChannel.java:171)
    [junit] 	at sun.rmi.server.UnicastRef.invoke(UnicastRef.java:101)
    [junit] 	at org.apache.lucene.search.RemoteSearchable_Stub.maxDoc(Unknown Source)
    [junit] 	at org.apache.lucene.search.MultiSearcher.<init>(MultiSearcher.java:116)
    [junit] 	at org.apache.lucene.search.TestRemoteSearchable.testConstantScoreQuery(TestRemoteSearchable.java:114)
    [junit] Caused by: java.net.ConnectException: Connection timed out
    [junit] 	at java.net.PlainSocketImpl.socketConnect(Native Method)
    [junit] 	at java.net.PlainSocketImpl.doConnect(PlainSocketImpl.java:305)
    [junit] 	at java.net.PlainSocketImpl.connectToAddress(PlainSocketImpl.java:171)
    [junit] 	at java.net.PlainSocketImpl.connect(PlainSocketImpl.java:158)
    [junit] 	at java.net.Socket.connect(Socket.java:452)
    [junit] 	at java.net.Socket.connect(Socket.java:402)
    [junit] 	at java.net.Socket.<init>(Socket.java:309)
    [junit] 	at java.net.Socket.<init>(Socket.java:124)
    [junit] 	at sun.rmi.transport.proxy.RMIDirectSocketFactory.createSocket(RMIDirectSocketFactory.java:22)
    [junit] 	at sun.rmi.transport.proxy.RMIMasterSocketFactory.createSocket(RMIMasterSocketFactory.java:128)
    [junit] 	at sun.rmi.transport.tcp.TCPEndpoint.newSocket(TCPEndpoint.java:562)
    [junit] 	... 21 more


    [junit] Test org.apache.lucene.search.TestRemoteSearchable FAILED
    [junit] Testsuite: org.apache.lucene.search.TestScorerPerf
    [junit] Tests run: 1, Failures: 0, Errors: 0, Time elapsed: 0.709 sec

    [junit] Testsuite: org.apache.lucene.search.TestSetNorm
    [junit] Tests run: 1, Failures: 0, Errors: 0, Time elapsed: 0.353 sec

    [junit] Testsuite: org.apache.lucene.search.TestSimilarity
    [junit] Tests run: 1, Failures: 0, Errors: 0, Time elapsed: 0.358 sec

    [junit] Testsuite: org.apache.lucene.search.TestSimpleExplanations
    [junit] Tests run: 53, Failures: 0, Errors: 0, Time elapsed: 0.757 sec

    [junit] Testsuite: org.apache.lucene.search.TestSimpleExplanationsOfNonMatches
    [junit] Tests run: 53, Failures: 0, Errors: 0, Time elapsed: 0.649 sec

    [junit] Testsuite: org.apache.lucene.search.TestSort
    [junit] Tests run: 17, Failures: 0, Errors: 3, Time elapsed: 899.738 sec

    [junit] Testcase: testRemoteSort(org.apache.lucene.search.TestSort):	Caused an ERROR
    [junit] Connection refused to host: 207.7.158.211; nested exception is: 
    [junit] 	java.net.ConnectException: Connection timed out
    [junit] java.rmi.ConnectException: Connection refused to host: 207.7.158.211; nested exception
is: 
    [junit] 	java.net.ConnectException: Connection timed out
    [junit] 	at sun.rmi.transport.tcp.TCPEndpoint.newSocket(TCPEndpoint.java:567)
    [junit] 	at sun.rmi.transport.tcp.TCPChannel.createConnection(TCPChannel.java:185)
    [junit] 	at sun.rmi.transport.tcp.TCPChannel.newConnection(TCPChannel.java:171)
    [junit] 	at sun.rmi.server.UnicastRef.invoke(UnicastRef.java:101)
    [junit] 	at org.apache.lucene.search.RemoteSearchable_Stub.maxDoc(Unknown Source)
    [junit] 	at org.apache.lucene.search.MultiSearcher.<init>(MultiSearcher.java:116)
    [junit] 	at org.apache.lucene.search.TestSort.testRemoteSort(TestSort.java:415)
    [junit] Caused by: java.net.ConnectException: Connection timed out
    [junit] 	at java.net.PlainSocketImpl.socketConnect(Native Method)
    [junit] 	at java.net.PlainSocketImpl.doConnect(PlainSocketImpl.java:305)
    [junit] 	at java.net.PlainSocketImpl.connectToAddress(PlainSocketImpl.java:171)
    [junit] 	at java.net.PlainSocketImpl.connect(PlainSocketImpl.java:158)
    [junit] 	at java.net.Socket.connect(Socket.java:452)
    [junit] 	at java.net.Socket.connect(Socket.java:402)
    [junit] 	at java.net.Socket.<init>(Socket.java:309)
    [junit] 	at java.net.Socket.<init>(Socket.java:124)
    [junit] 	at sun.rmi.transport.proxy.RMIDirectSocketFactory.createSocket(RMIDirectSocketFactory.java:22)
    [junit] 	at sun.rmi.transport.proxy.RMIMasterSocketFactory.createSocket(RMIMasterSocketFactory.java:128)
    [junit] 	at sun.rmi.transport.tcp.TCPEndpoint.newSocket(TCPEndpoint.java:562)
    [junit] 	... 21 more


    [junit] Testcase: testRemoteCustomSort(org.apache.lucene.search.TestSort):	Caused an ERROR
    [junit] Connection refused to host: 207.7.158.211; nested exception is: 
    [junit] 	java.net.ConnectException: Connection timed out
    [junit] java.rmi.ConnectException: Connection refused to host: 207.7.158.211; nested exception
is: 
    [junit] 	java.net.ConnectException: Connection timed out
    [junit] 	at sun.rmi.transport.tcp.TCPEndpoint.newSocket(TCPEndpoint.java:567)
    [junit] 	at sun.rmi.transport.tcp.TCPChannel.createConnection(TCPChannel.java:185)
    [junit] 	at sun.rmi.transport.tcp.TCPChannel.newConnection(TCPChannel.java:171)
    [junit] 	at sun.rmi.server.UnicastRef.invoke(UnicastRef.java:101)
    [junit] 	at org.apache.lucene.search.RemoteSearchable_Stub.maxDoc(Unknown Source)
    [junit] 	at org.apache.lucene.search.MultiSearcher.<init>(MultiSearcher.java:116)
    [junit] 	at org.apache.lucene.search.TestSort.testRemoteCustomSort(TestSort.java:422)
    [junit] Caused by: java.net.ConnectException: Connection timed out
    [junit] 	at java.net.PlainSocketImpl.socketConnect(Native Method)
    [junit] 	at java.net.PlainSocketImpl.doConnect(PlainSocketImpl.java:305)
    [junit] 	at java.net.PlainSocketImpl.connectToAddress(PlainSocketImpl.java:171)
    [junit] 	at java.net.PlainSocketImpl.connect(PlainSocketImpl.java:158)
    [junit] 	at java.net.Socket.connect(Socket.java:452)
    [junit] 	at java.net.Socket.connect(Socket.java:402)
    [junit] 	at java.net.Socket.<init>(Socket.java:309)
    [junit] 	at java.net.Socket.<init>(Socket.java:124)
    [junit] 	at sun.rmi.transport.proxy.RMIDirectSocketFactory.createSocket(RMIDirectSocketFactory.java:22)
    [junit] 	at sun.rmi.transport.proxy.RMIMasterSocketFactory.createSocket(RMIMasterSocketFactory.java:128)
    [junit] 	at sun.rmi.transport.tcp.TCPEndpoint.newSocket(TCPEndpoint.java:562)
    [junit] 	... 21 more


    [junit] Testcase: testNormalizedScores(org.apache.lucene.search.TestSort):	Caused an ERROR
    [junit] Connection refused to host: 207.7.158.211; nested exception is: 
    [junit] 	java.net.ConnectException: Connection timed out
    [junit] java.rmi.ConnectException: Connection refused to host: 207.7.158.211; nested exception
is: 
    [junit] 	java.net.ConnectException: Connection timed out
    [junit] 	at sun.rmi.transport.tcp.TCPEndpoint.newSocket(TCPEndpoint.java:567)
    [junit] 	at sun.rmi.transport.tcp.TCPChannel.createConnection(TCPChannel.java:185)
    [junit] 	at sun.rmi.transport.tcp.TCPChannel.newConnection(TCPChannel.java:171)
    [junit] 	at sun.rmi.server.UnicastRef.invoke(UnicastRef.java:101)
    [junit] 	at org.apache.lucene.search.RemoteSearchable_Stub.maxDoc(Unknown Source)
    [junit] 	at org.apache.lucene.search.MultiSearcher.<init>(MultiSearcher.java:116)
    [junit] 	at org.apache.lucene.search.TestSort.testNormalizedScores(TestSort.java:444)
    [junit] Caused by: java.net.ConnectException: Connection timed out
    [junit] 	at java.net.PlainSocketImpl.socketConnect(Native Method)
    [junit] 	at java.net.PlainSocketImpl.doConnect(PlainSocketImpl.java:305)
    [junit] 	at java.net.PlainSocketImpl.connectToAddress(PlainSocketImpl.java:171)
    [junit] 	at java.net.PlainSocketImpl.connect(PlainSocketImpl.java:158)
    [junit] 	at java.net.Socket.connect(Socket.java:452)
    [junit] 	at java.net.Socket.connect(Socket.java:402)
    [junit] 	at java.net.Socket.<init>(Socket.java:309)
    [junit] 	at java.net.Socket.<init>(Socket.java:124)
    [junit] 	at sun.rmi.transport.proxy.RMIDirectSocketFactory.createSocket(RMIDirectSocketFactory.java:22)
    [junit] 	at sun.rmi.transport.proxy.RMIMasterSocketFactory.createSocket(RMIMasterSocketFactory.java:128)
    [junit] 	at sun.rmi.transport.tcp.TCPEndpoint.newSocket(TCPEndpoint.java:562)
    [junit] 	... 21 more


    [junit] Test org.apache.lucene.search.TestSort FAILED
    [junit] Testsuite: org.apache.lucene.search.TestTermScorer
    [junit] Tests run: 4, Failures: 0, Errors: 0, Time elapsed: 0.362 sec

    [junit] Testsuite: org.apache.lucene.search.TestTermVectors
    [junit] Tests run: 5, Failures: 0, Errors: 0, Time elapsed: 4.137 sec

    [junit] Testsuite: org.apache.lucene.search.TestThreadSafe
    [junit] Tests run: 1, Failures: 0, Errors: 0, Time elapsed: 8.662 sec

    [junit] Testsuite: org.apache.lucene.search.TestWildcard
    [junit] Tests run: 3, Failures: 0, Errors: 0, Time elapsed: 0.356 sec

    [junit] Testsuite: org.apache.lucene.search.spans.TestBasics
    [junit] Tests run: 19, Failures: 0, Errors: 0, Time elapsed: 9.45 sec

    [junit] Testsuite: org.apache.lucene.search.spans.TestNearSpansOrdered
    [junit] Tests run: 10, Failures: 0, Errors: 0, Time elapsed: 0.405 sec

    [junit] Testsuite: org.apache.lucene.search.spans.TestSpanExplanations
    [junit] Tests run: 31, Failures: 0, Errors: 0, Time elapsed: 0.598 sec

    [junit] Testsuite: org.apache.lucene.search.spans.TestSpanExplanationsOfNonMatches
    [junit] Tests run: 31, Failures: 0, Errors: 0, Time elapsed: 0.555 sec

    [junit] Testsuite: org.apache.lucene.search.spans.TestSpans
    [junit] Tests run: 15, Failures: 0, Errors: 0, Time elapsed: 0.606 sec

    [junit] Testsuite: org.apache.lucene.search.spans.TestSpansAdvanced
    [junit] Tests run: 1, Failures: 0, Errors: 0, Time elapsed: 0.416 sec

    [junit] Testsuite: org.apache.lucene.search.spans.TestSpansAdvanced2
    [junit] Tests run: 4, Failures: 0, Errors: 0, Time elapsed: 0.472 sec

    [junit] Testsuite: org.apache.lucene.store.TestBufferedIndexInput
    [junit] Tests run: 3, Failures: 0, Errors: 0, Time elapsed: 1.399 sec

    [junit] Testsuite: org.apache.lucene.store.TestLock
    [junit] Tests run: 1, Failures: 0, Errors: 0, Time elapsed: 0.264 sec

    [junit] Testsuite: org.apache.lucene.store.TestLockFactory
    [junit] Tests run: 13, Failures: 0, Errors: 0, Time elapsed: 4.492 sec

    [junit] Testsuite: org.apache.lucene.util.TestBitVector
    [junit] Tests run: 5, Failures: 0, Errors: 0, Time elapsed: 0.314 sec

    [junit] Testsuite: org.apache.lucene.util.TestPriorityQueue
    [junit] Tests run: 3, Failures: 0, Errors: 0, Time elapsed: 0.29 sec

    [junit] Testsuite: org.apache.lucene.util.TestSmallFloat
    [junit] Tests run: 2, Failures: 0, Errors: 0, Time elapsed: 0.353 sec

    [junit] Testsuite: org.apache.lucene.util.TestStringHelper
    [junit] Tests run: 1, Failures: 0, Errors: 0, Time elapsed: 0.256 sec


BUILD FAILED
/tmp/lucene-nightly/common-build.xml:190: Tests failed!

Total time: 41 minutes 28 seconds



---------------------------------------------------------------------
To unsubscribe, e-mail: java-dev-unsubscribe@lucene.apache.org
For additional commands, e-mail: java-dev-help@lucene.apache.org


Mime
View raw message