lucene-commits mailing list archives

Site index · List index
Message view « Date » · « Thread »
Top « Date » · « Thread »
From build...@apache.org
Subject svn commit: r805757 - in /websites: production/lucene/content/ production/lucene/content/core/ production/lucene/content/solr/ staging/lucene/trunk/content/ staging/lucene/trunk/content/core/ staging/lucene/trunk/content/solr/
Date Wed, 22 Feb 2012 09:15:11 GMT
Author: buildbot
Date: Wed Feb 22 09:15:10 2012
New Revision: 805757

Log:
Dynamic update by buildbot for lucene

Modified:
    websites/production/lucene/content/core/index.html
    websites/production/lucene/content/index.html
    websites/production/lucene/content/solr/index.html
    websites/staging/lucene/trunk/content/core/index.html
    websites/staging/lucene/trunk/content/index.html
    websites/staging/lucene/trunk/content/solr/index.html

Modified: websites/production/lucene/content/core/index.html
==============================================================================
--- websites/production/lucene/content/core/index.html (original)
+++ websites/production/lucene/content/core/index.html Wed Feb 22 09:15:10 2012
@@ -373,30 +373,27 @@ given doc/field.</p>
     <div id="dev-mail">
       <h1>Latest Dev</h1>
       <div class="status-item">
-      <h4><a href="http://mail-archives.apache.org/mod_mbox/lucene-dev/201202.mbox/%3c1977238228.1101329890848834.JavaMail.hudson@aegis%3e">[JENKINS]
Lucene-Solr-tests-only-3.x-java7 - Build # 1814 - Failure</a></h4>
+      <h4><a href="http://mail-archives.apache.org/mod_mbox/lucene-dev/201202.mbox/%3c840663398.3404.1329898128785.JavaMail.tomcat@hel.zones.apache.org%3e">[jira]
[Commented] (LUCENE-3795) Replace spatial contrib module with LSP&#39;s spatial-lucene
module</a></h4>
         <div class="section-content">
-        Build: <a href="https://builds.apache.org/job/Lucene-Solr-tests-only-3.x-java7/1814/">https://builds.apache.org/job/Lucene-Solr-tests-only-3.x-java7/1814/</a><br
/>&nbsp;<br />1 tests failed.
-REGRESSION:  org.apache.solr.client.solrj.embedded.LargeVolumeJettyTest.testMultiThreaded<br
/>&nbsp;<br />Error Message:
-expected:<500> but was:<400><br />&nbsp;<br />Stack Trace:
-junit.framework.AssertionFailedError: expected:<500> but...</500></400></500>
+        [ <a href="https://issues.apache.org/jira/browse/LUCENE-3795?page=com.atlassian.jira.plugin.system.issuetabpanels:comment-tabpanel&focusedCommentId=13213445#comment-13213445">https://issues.apache.org/jira/browse/LUCENE-3795?page=com.atlassian.jira.plugin.system.issuetabpanels:comment-tabpanel&focusedCommentId=13213445#comment-13213445</a>
+] <br />&nbsp;<br />Chris Male commented on LUCENE-3795:
+------------------------------------<br />&nbsp;<br />bq. LSP Lucene spatial
is in as a module,...
         </div>
       
-      <h4><a href="http://mail-archives.apache.org/mod_mbox/lucene-dev/201202.mbox/%3c740164341.1041329887623109.JavaMail.hudson@aegis%3e">[JENKINS]
Lucene-Solr-tests-only-trunk - Build # 12490 - Failure</a></h4>
+      <h4><a href="http://mail-archives.apache.org/mod_mbox/lucene-dev/201202.mbox/%3c278526284.3380.1329897650651.JavaMail.tomcat@hel.zones.apache.org%3e">[jira]
[Commented] (LUCENE-3795) Replace spatial contrib module with LSP&#39;s spatial-lucene
module</a></h4>
         <div class="section-content">
-        Build: <a href="https://builds.apache.org/job/Lucene-Solr-tests-only-trunk/12490/">https://builds.apache.org/job/Lucene-Solr-tests-only-trunk/12490/</a><br
/>&nbsp;<br />1 tests failed.
-FAILED:  junit.framework.TestSuite.org.apache.solr.cloud.RecoveryZkTest<br />&nbsp;<br
/>Error Message:
-ERROR: SolrIndexSearcher opens=14 closes=13<br />&nbsp;<br />Stack Trace:
-junit.framework.AssertionFailedError: ERROR:...
+        [ <a href="https://issues.apache.org/jira/browse/LUCENE-3795?page=com.atlassian.jira.plugin.system.issuetabpanels:comment-tabpanel&focusedCommentId=13213439#comment-13213439">https://issues.apache.org/jira/browse/LUCENE-3795?page=com.atlassian.jira.plugin.system.issuetabpanels:comment-tabpanel&focusedCommentId=13213439#comment-13213439</a>
+] <br />&nbsp;<br />David Smiley commented on LUCENE-3795:
+--------------------------------------<br />&nbsp;<br />Branch Status Update:
+* LSP Lucene spatial is in...
         </div>
       
-      <h4><a href="http://mail-archives.apache.org/mod_mbox/lucene-dev/201202.mbox/%3c1559469395.1021329886669632.JavaMail.hudson@aegis%3e">[JENKINS]
Lucene-trunk - Build # 1836 - Still Failing</a></h4>
+      <h4><a href="http://mail-archives.apache.org/mod_mbox/lucene-dev/201202.mbox/%3c1977238228.1101329890848834.JavaMail.hudson@aegis%3e">[JENKINS]
Lucene-Solr-tests-only-3.x-java7 - Build # 1814 - Failure</a></h4>
         <div class="section-content">
-        Build: <a href="https://builds.apache.org/job/Lucene-trunk/1836/">https://builds.apache.org/job/Lucene-trunk/1836/</a><br
/>&nbsp;<br />1 tests failed.
-FAILED:  org.apache.lucene.search.suggest.fst.FSTCompletionTest.testMultilingualInput<br
/>&nbsp;<br />Error Message:
-expected:<[74 68 72 65 65 62 79 74 65 f0 a4 ad a2 63 68 61 72]> but was:<threebytechar><br
/>&nbsp;<br />Stack Trace:
-junit.framework.AssertionFailedError: expected:<[74 68 72 65 65 62 79 74 65 f0 a4 ad a2
-63 68 61 72]> but...</[74 68 72 65 65 62 79 74 65 f0 a4 ad a2
-63 68 61 72]></threebytechar></[74 68 72 65 65 62 79 74 65 f0 a4 ad a2 63 68
61 72]>
+        Build: <a href="https://builds.apache.org/job/Lucene-Solr-tests-only-3.x-java7/1814/">https://builds.apache.org/job/Lucene-Solr-tests-only-3.x-java7/1814/</a><br
/>&nbsp;<br />1 tests failed.
+REGRESSION:  org.apache.solr.client.solrj.embedded.LargeVolumeJettyTest.testMultiThreaded<br
/>&nbsp;<br />Error Message:
+expected:<500> but was:<400><br />&nbsp;<br />Stack Trace:
+junit.framework.AssertionFailedError: expected:<500> but...</500></400></500>
         </div>
       </div>
     </div>

Modified: websites/production/lucene/content/index.html
==============================================================================
--- websites/production/lucene/content/index.html (original)
+++ websites/production/lucene/content/index.html Wed Feb 22 09:15:10 2012
@@ -631,11 +631,11 @@ as well as new analysis capabilities.</l
         <div id="dev-mail">
           <h1>Latest Dev</h1>
           <div class="status-item">
-          <h4><a href="http://mail-archives.apache.org/mod_mbox/lucene-dev/201202.mbox/%3c1977238228.1101329890848834.JavaMail.hudson@aegis%3e">[JENKINS]
Lucene-Solr-tests-only-3.x-java7 - Build # 1814 - Failure</a></h4>
+          <h4><a href="http://mail-archives.apache.org/mod_mbox/lucene-dev/201202.mbox/%3c840663398.3404.1329898128785.JavaMail.tomcat@hel.zones.apache.org%3e">[jira]
[Commented] (LUCENE-3795) Replace spatial contrib module with LSP&#39;s spatial-lucene
module</a></h4>
           
-          <h4><a href="http://mail-archives.apache.org/mod_mbox/lucene-dev/201202.mbox/%3c740164341.1041329887623109.JavaMail.hudson@aegis%3e">[JENKINS]
Lucene-Solr-tests-only-trunk - Build # 12490 - Failure</a></h4>
+          <h4><a href="http://mail-archives.apache.org/mod_mbox/lucene-dev/201202.mbox/%3c278526284.3380.1329897650651.JavaMail.tomcat@hel.zones.apache.org%3e">[jira]
[Commented] (LUCENE-3795) Replace spatial contrib module with LSP&#39;s spatial-lucene
module</a></h4>
           
-          <h4><a href="http://mail-archives.apache.org/mod_mbox/lucene-dev/201202.mbox/%3c1559469395.1021329886669632.JavaMail.hudson@aegis%3e">[JENKINS]
Lucene-trunk - Build # 1836 - Still Failing</a></h4>
+          <h4><a href="http://mail-archives.apache.org/mod_mbox/lucene-dev/201202.mbox/%3c1977238228.1101329890848834.JavaMail.hudson@aegis%3e">[JENKINS]
Lucene-Solr-tests-only-3.x-java7 - Build # 1814 - Failure</a></h4>
           </div>
         </div>
         <div id="core-user-mail">
@@ -651,11 +651,11 @@ as well as new analysis capabilities.</l
         <div id="solr-user-mail">
           <h1>Latest Solr User</h1>
           <div class="status-item">
-          <h4><a href="http://mail-archives.apache.org/mod_mbox/lucene-solr-user/201202.mbox/%3c1329887660930-3765607.post@n3.nabble.com%3e">Re:
nutch and solr</a></h4>
+          <h4><a href="http://mail-archives.apache.org/mod_mbox/lucene-solr-user/201202.mbox/%3c4F44A706.4080707@designware.dk%3e">Re:
Unique key constraint and optimistic locking (versioning)</a></h4>
           
-          <h4><a href="http://mail-archives.apache.org/mod_mbox/lucene-solr-user/201202.mbox/%3calpine.DEB.2.00.1202211951180.25491@bester%3e">Re:
How to merge an &quot;autofacet&quot; with a predefined facet</a></h4>
+          <h4><a href="http://mail-archives.apache.org/mod_mbox/lucene-solr-user/201202.mbox/%3cCALyoB5eBw+yQY9_vUaRgCQnK91i5cPgq2GsXb_akk3DCH9F+Ng@mail.gmail.com%3e">Re:
reader/searcher refresh after replication (commit)</a></h4>
           
-          <h4><a href="http://mail-archives.apache.org/mod_mbox/lucene-solr-user/201202.mbox/%3c4F445FA0.9070005@r.email.ne.jp%3e">Re:
Fast Vector Highlighter Working for some records only</a></h4>
+          <h4><a href="http://mail-archives.apache.org/mod_mbox/lucene-solr-user/201202.mbox/%3c1329887660930-3765607.post@n3.nabble.com%3e">Re:
nutch and solr</a></h4>
           </div>
         </div>
       </div>

Modified: websites/production/lucene/content/solr/index.html
==============================================================================
--- websites/production/lucene/content/solr/index.html (original)
+++ websites/production/lucene/content/solr/index.html Wed Feb 22 09:15:10 2012
@@ -468,30 +468,27 @@ numeric fields or query relevancy scores
 
         
         <div class="status-item">
-          <h4><a href="http://mail-archives.apache.org/mod_mbox/lucene-dev/201202.mbox/%3c1977238228.1101329890848834.JavaMail.hudson@aegis%3e">[JENKINS]
Lucene-Solr-tests-only-3.x-java7 - Build # 1814 - Failure</a></h4>
+          <h4><a href="http://mail-archives.apache.org/mod_mbox/lucene-dev/201202.mbox/%3c840663398.3404.1329898128785.JavaMail.tomcat@hel.zones.apache.org%3e">[jira]
[Commented] (LUCENE-3795) Replace spatial contrib module with LSP's spatial-lucene module</a></h4>
           <div class="section-content">
-          Build: <a href="https://builds.apache.org/job/Lucene-Solr-tests-only-3.x-java7/1814/">https://builds.apache.org/job/Lucene-Solr-tests-only-3.x-java7/1814/</a><br
/>&nbsp;<br />1 tests failed.
-REGRESSION:  org.apache.solr.client.solrj.embedded.LargeVolumeJettyTest.testMultiThreaded<br
/>&nbsp;<br />Error Message:
-expected:<500> but was:<400><br />&nbsp;<br />Stack Trace:
-junit.framework.AssertionFailedError: expected:<500> but...</500></400></500>
+          [ <a href="https://issues.apache.org/jira/browse/LUCENE-3795?page=com.atlassian.jira.plugin.system.issuetabpanels:comment-tabpanel&focusedCommentId=13213445#comment-13213445">https://issues.apache.org/jira/browse/LUCENE-3795?page=com.atlassian.jira.plugin.system.issuetabpanels:comment-tabpanel&focusedCommentId=13213445#comment-13213445</a>
+] <br />&nbsp;<br />Chris Male commented on LUCENE-3795:
+------------------------------------<br />&nbsp;<br />bq. LSP Lucene spatial
is in as a module,...
             </div>
           
-          <h4><a href="http://mail-archives.apache.org/mod_mbox/lucene-dev/201202.mbox/%3c740164341.1041329887623109.JavaMail.hudson@aegis%3e">[JENKINS]
Lucene-Solr-tests-only-trunk - Build # 12490 - Failure</a></h4>
+          <h4><a href="http://mail-archives.apache.org/mod_mbox/lucene-dev/201202.mbox/%3c278526284.3380.1329897650651.JavaMail.tomcat@hel.zones.apache.org%3e">[jira]
[Commented] (LUCENE-3795) Replace spatial contrib module with LSP's spatial-lucene module</a></h4>
           <div class="section-content">
-          Build: <a href="https://builds.apache.org/job/Lucene-Solr-tests-only-trunk/12490/">https://builds.apache.org/job/Lucene-Solr-tests-only-trunk/12490/</a><br
/>&nbsp;<br />1 tests failed.
-FAILED:  junit.framework.TestSuite.org.apache.solr.cloud.RecoveryZkTest<br />&nbsp;<br
/>Error Message:
-ERROR: SolrIndexSearcher opens=14 closes=13<br />&nbsp;<br />Stack Trace:
-junit.framework.AssertionFailedError: ERROR:...
+          [ <a href="https://issues.apache.org/jira/browse/LUCENE-3795?page=com.atlassian.jira.plugin.system.issuetabpanels:comment-tabpanel&focusedCommentId=13213439#comment-13213439">https://issues.apache.org/jira/browse/LUCENE-3795?page=com.atlassian.jira.plugin.system.issuetabpanels:comment-tabpanel&focusedCommentId=13213439#comment-13213439</a>
+] <br />&nbsp;<br />David Smiley commented on LUCENE-3795:
+--------------------------------------<br />&nbsp;<br />Branch Status Update:
+* LSP Lucene spatial is in...
             </div>
           
-          <h4><a href="http://mail-archives.apache.org/mod_mbox/lucene-dev/201202.mbox/%3c1559469395.1021329886669632.JavaMail.hudson@aegis%3e">[JENKINS]
Lucene-trunk - Build # 1836 - Still Failing</a></h4>
+          <h4><a href="http://mail-archives.apache.org/mod_mbox/lucene-dev/201202.mbox/%3c1977238228.1101329890848834.JavaMail.hudson@aegis%3e">[JENKINS]
Lucene-Solr-tests-only-3.x-java7 - Build # 1814 - Failure</a></h4>
           <div class="section-content">
-          Build: <a href="https://builds.apache.org/job/Lucene-trunk/1836/">https://builds.apache.org/job/Lucene-trunk/1836/</a><br
/>&nbsp;<br />1 tests failed.
-FAILED:  org.apache.lucene.search.suggest.fst.FSTCompletionTest.testMultilingualInput<br
/>&nbsp;<br />Error Message:
-expected:<[74 68 72 65 65 62 79 74 65 f0 a4 ad a2 63 68 61 72]> but was:<threebytechar><br
/>&nbsp;<br />Stack Trace:
-junit.framework.AssertionFailedError: expected:<[74 68 72 65 65 62 79 74 65 f0 a4 ad a2
-63 68 61 72]> but...</[74 68 72 65 65 62 79 74 65 f0 a4 ad a2
-63 68 61 72]></threebytechar></[74 68 72 65 65 62 79 74 65 f0 a4 ad a2 63 68
61 72]>
+          Build: <a href="https://builds.apache.org/job/Lucene-Solr-tests-only-3.x-java7/1814/">https://builds.apache.org/job/Lucene-Solr-tests-only-3.x-java7/1814/</a><br
/>&nbsp;<br />1 tests failed.
+REGRESSION:  org.apache.solr.client.solrj.embedded.LargeVolumeJettyTest.testMultiThreaded<br
/>&nbsp;<br />Error Message:
+expected:<500> but was:<400><br />&nbsp;<br />Stack Trace:
+junit.framework.AssertionFailedError: expected:<500> but...</500></400></500>
             </div>
           
         </div>
@@ -502,24 +499,22 @@ junit.framework.AssertionFailedError: ex
 
         
         <div class="status-item">
-          <h4><a href="http://mail-archives.apache.org/mod_mbox/lucene-solr-user/201202.mbox/%3c1329887660930-3765607.post@n3.nabble.com%3e">Re:
nutch and solr</a></h4>
+          <h4><a href="http://mail-archives.apache.org/mod_mbox/lucene-solr-user/201202.mbox/%3c4F44A706.4080707@designware.dk%3e">Re:
Unique key constraint and optimistic locking (versioning)</a></h4>
           <div class="section-content">
-          Try this command.<br />&nbsp;<br /> bin/nutch crawl urls/<folder
name>/<url file>.txt -dir crawl/<folders name>
--threads 10 -depth 2 -topN 1000<br />&nbsp;<br />Your folder...</folders></url></folder>
+          Thanks a lot. We will use the UniqueKey feature and build versioning 
+ourselves. Do you think it would be a...
           </div>
           
-          <h4><a href="http://mail-archives.apache.org/mod_mbox/lucene-solr-user/201202.mbox/%3calpine.DEB.2.00.1202211951180.25491@bester%3e">Re:
How to merge an "autofacet" with a predefined facet</a></h4>
+          <h4><a href="http://mail-archives.apache.org/mod_mbox/lucene-solr-user/201202.mbox/%3cCALyoB5eBw+yQY9_vUaRgCQnK91i5cPgq2GsXb_akk3DCH9F+Ng@mail.gmail.com%3e">Re:
reader/searcher refresh after replication (commit)</a></h4>
           <div class="section-content">
-          : But i don't know if it's possible to merge this "autocreated" facet with a
-: facet already predefined ?...
+          Yes, I consciously let my slaves run away from the master in order to
+reduce update latency, but every now...
           </div>
           
-          <h4><a href="http://mail-archives.apache.org/mod_mbox/lucene-solr-user/201202.mbox/%3c4F445FA0.9070005@r.email.ne.jp%3e">Re:
Fast Vector Highlighter Working for some records only</a></h4>
+          <h4><a href="http://mail-archives.apache.org/mod_mbox/lucene-solr-user/201202.mbox/%3c1329887660930-3765607.post@n3.nabble.com%3e">Re:
nutch and solr</a></h4>
           <div class="section-content">
-          (12/02/22 11:58), dhaivat wrote:
-> Thanks for reply,
->
-> But can you please tell me why it's working for...
+          Try this command.<br />&nbsp;<br /> bin/nutch crawl urls/<folder
name>/<url file>.txt -dir crawl/<folders name>
+-threads 10 -depth 2 -topN 1000<br />&nbsp;<br />Your folder...</folders></url></folder>
           </div>
           
         </div>

Modified: websites/staging/lucene/trunk/content/core/index.html
==============================================================================
--- websites/staging/lucene/trunk/content/core/index.html (original)
+++ websites/staging/lucene/trunk/content/core/index.html Wed Feb 22 09:15:10 2012
@@ -373,30 +373,27 @@ given doc/field.</p>
     <div id="dev-mail">
       <h1>Latest Dev</h1>
       <div class="status-item">
-      <h4><a href="http://mail-archives.apache.org/mod_mbox/lucene-dev/201202.mbox/%3c1977238228.1101329890848834.JavaMail.hudson@aegis%3e">[JENKINS]
Lucene-Solr-tests-only-3.x-java7 - Build # 1814 - Failure</a></h4>
+      <h4><a href="http://mail-archives.apache.org/mod_mbox/lucene-dev/201202.mbox/%3c840663398.3404.1329898128785.JavaMail.tomcat@hel.zones.apache.org%3e">[jira]
[Commented] (LUCENE-3795) Replace spatial contrib module with LSP&#39;s spatial-lucene
module</a></h4>
         <div class="section-content">
-        Build: <a href="https://builds.apache.org/job/Lucene-Solr-tests-only-3.x-java7/1814/">https://builds.apache.org/job/Lucene-Solr-tests-only-3.x-java7/1814/</a><br
/>&nbsp;<br />1 tests failed.
-REGRESSION:  org.apache.solr.client.solrj.embedded.LargeVolumeJettyTest.testMultiThreaded<br
/>&nbsp;<br />Error Message:
-expected:<500> but was:<400><br />&nbsp;<br />Stack Trace:
-junit.framework.AssertionFailedError: expected:<500> but...</500></400></500>
+        [ <a href="https://issues.apache.org/jira/browse/LUCENE-3795?page=com.atlassian.jira.plugin.system.issuetabpanels:comment-tabpanel&focusedCommentId=13213445#comment-13213445">https://issues.apache.org/jira/browse/LUCENE-3795?page=com.atlassian.jira.plugin.system.issuetabpanels:comment-tabpanel&focusedCommentId=13213445#comment-13213445</a>
+] <br />&nbsp;<br />Chris Male commented on LUCENE-3795:
+------------------------------------<br />&nbsp;<br />bq. LSP Lucene spatial
is in as a module,...
         </div>
       
-      <h4><a href="http://mail-archives.apache.org/mod_mbox/lucene-dev/201202.mbox/%3c740164341.1041329887623109.JavaMail.hudson@aegis%3e">[JENKINS]
Lucene-Solr-tests-only-trunk - Build # 12490 - Failure</a></h4>
+      <h4><a href="http://mail-archives.apache.org/mod_mbox/lucene-dev/201202.mbox/%3c278526284.3380.1329897650651.JavaMail.tomcat@hel.zones.apache.org%3e">[jira]
[Commented] (LUCENE-3795) Replace spatial contrib module with LSP&#39;s spatial-lucene
module</a></h4>
         <div class="section-content">
-        Build: <a href="https://builds.apache.org/job/Lucene-Solr-tests-only-trunk/12490/">https://builds.apache.org/job/Lucene-Solr-tests-only-trunk/12490/</a><br
/>&nbsp;<br />1 tests failed.
-FAILED:  junit.framework.TestSuite.org.apache.solr.cloud.RecoveryZkTest<br />&nbsp;<br
/>Error Message:
-ERROR: SolrIndexSearcher opens=14 closes=13<br />&nbsp;<br />Stack Trace:
-junit.framework.AssertionFailedError: ERROR:...
+        [ <a href="https://issues.apache.org/jira/browse/LUCENE-3795?page=com.atlassian.jira.plugin.system.issuetabpanels:comment-tabpanel&focusedCommentId=13213439#comment-13213439">https://issues.apache.org/jira/browse/LUCENE-3795?page=com.atlassian.jira.plugin.system.issuetabpanels:comment-tabpanel&focusedCommentId=13213439#comment-13213439</a>
+] <br />&nbsp;<br />David Smiley commented on LUCENE-3795:
+--------------------------------------<br />&nbsp;<br />Branch Status Update:
+* LSP Lucene spatial is in...
         </div>
       
-      <h4><a href="http://mail-archives.apache.org/mod_mbox/lucene-dev/201202.mbox/%3c1559469395.1021329886669632.JavaMail.hudson@aegis%3e">[JENKINS]
Lucene-trunk - Build # 1836 - Still Failing</a></h4>
+      <h4><a href="http://mail-archives.apache.org/mod_mbox/lucene-dev/201202.mbox/%3c1977238228.1101329890848834.JavaMail.hudson@aegis%3e">[JENKINS]
Lucene-Solr-tests-only-3.x-java7 - Build # 1814 - Failure</a></h4>
         <div class="section-content">
-        Build: <a href="https://builds.apache.org/job/Lucene-trunk/1836/">https://builds.apache.org/job/Lucene-trunk/1836/</a><br
/>&nbsp;<br />1 tests failed.
-FAILED:  org.apache.lucene.search.suggest.fst.FSTCompletionTest.testMultilingualInput<br
/>&nbsp;<br />Error Message:
-expected:<[74 68 72 65 65 62 79 74 65 f0 a4 ad a2 63 68 61 72]> but was:<threebytechar><br
/>&nbsp;<br />Stack Trace:
-junit.framework.AssertionFailedError: expected:<[74 68 72 65 65 62 79 74 65 f0 a4 ad a2
-63 68 61 72]> but...</[74 68 72 65 65 62 79 74 65 f0 a4 ad a2
-63 68 61 72]></threebytechar></[74 68 72 65 65 62 79 74 65 f0 a4 ad a2 63 68
61 72]>
+        Build: <a href="https://builds.apache.org/job/Lucene-Solr-tests-only-3.x-java7/1814/">https://builds.apache.org/job/Lucene-Solr-tests-only-3.x-java7/1814/</a><br
/>&nbsp;<br />1 tests failed.
+REGRESSION:  org.apache.solr.client.solrj.embedded.LargeVolumeJettyTest.testMultiThreaded<br
/>&nbsp;<br />Error Message:
+expected:<500> but was:<400><br />&nbsp;<br />Stack Trace:
+junit.framework.AssertionFailedError: expected:<500> but...</500></400></500>
         </div>
       </div>
     </div>

Modified: websites/staging/lucene/trunk/content/index.html
==============================================================================
--- websites/staging/lucene/trunk/content/index.html (original)
+++ websites/staging/lucene/trunk/content/index.html Wed Feb 22 09:15:10 2012
@@ -631,11 +631,11 @@ as well as new analysis capabilities.</l
         <div id="dev-mail">
           <h1>Latest Dev</h1>
           <div class="status-item">
-          <h4><a href="http://mail-archives.apache.org/mod_mbox/lucene-dev/201202.mbox/%3c1977238228.1101329890848834.JavaMail.hudson@aegis%3e">[JENKINS]
Lucene-Solr-tests-only-3.x-java7 - Build # 1814 - Failure</a></h4>
+          <h4><a href="http://mail-archives.apache.org/mod_mbox/lucene-dev/201202.mbox/%3c840663398.3404.1329898128785.JavaMail.tomcat@hel.zones.apache.org%3e">[jira]
[Commented] (LUCENE-3795) Replace spatial contrib module with LSP&#39;s spatial-lucene
module</a></h4>
           
-          <h4><a href="http://mail-archives.apache.org/mod_mbox/lucene-dev/201202.mbox/%3c740164341.1041329887623109.JavaMail.hudson@aegis%3e">[JENKINS]
Lucene-Solr-tests-only-trunk - Build # 12490 - Failure</a></h4>
+          <h4><a href="http://mail-archives.apache.org/mod_mbox/lucene-dev/201202.mbox/%3c278526284.3380.1329897650651.JavaMail.tomcat@hel.zones.apache.org%3e">[jira]
[Commented] (LUCENE-3795) Replace spatial contrib module with LSP&#39;s spatial-lucene
module</a></h4>
           
-          <h4><a href="http://mail-archives.apache.org/mod_mbox/lucene-dev/201202.mbox/%3c1559469395.1021329886669632.JavaMail.hudson@aegis%3e">[JENKINS]
Lucene-trunk - Build # 1836 - Still Failing</a></h4>
+          <h4><a href="http://mail-archives.apache.org/mod_mbox/lucene-dev/201202.mbox/%3c1977238228.1101329890848834.JavaMail.hudson@aegis%3e">[JENKINS]
Lucene-Solr-tests-only-3.x-java7 - Build # 1814 - Failure</a></h4>
           </div>
         </div>
         <div id="core-user-mail">
@@ -651,11 +651,11 @@ as well as new analysis capabilities.</l
         <div id="solr-user-mail">
           <h1>Latest Solr User</h1>
           <div class="status-item">
-          <h4><a href="http://mail-archives.apache.org/mod_mbox/lucene-solr-user/201202.mbox/%3c1329887660930-3765607.post@n3.nabble.com%3e">Re:
nutch and solr</a></h4>
+          <h4><a href="http://mail-archives.apache.org/mod_mbox/lucene-solr-user/201202.mbox/%3c4F44A706.4080707@designware.dk%3e">Re:
Unique key constraint and optimistic locking (versioning)</a></h4>
           
-          <h4><a href="http://mail-archives.apache.org/mod_mbox/lucene-solr-user/201202.mbox/%3calpine.DEB.2.00.1202211951180.25491@bester%3e">Re:
How to merge an &quot;autofacet&quot; with a predefined facet</a></h4>
+          <h4><a href="http://mail-archives.apache.org/mod_mbox/lucene-solr-user/201202.mbox/%3cCALyoB5eBw+yQY9_vUaRgCQnK91i5cPgq2GsXb_akk3DCH9F+Ng@mail.gmail.com%3e">Re:
reader/searcher refresh after replication (commit)</a></h4>
           
-          <h4><a href="http://mail-archives.apache.org/mod_mbox/lucene-solr-user/201202.mbox/%3c4F445FA0.9070005@r.email.ne.jp%3e">Re:
Fast Vector Highlighter Working for some records only</a></h4>
+          <h4><a href="http://mail-archives.apache.org/mod_mbox/lucene-solr-user/201202.mbox/%3c1329887660930-3765607.post@n3.nabble.com%3e">Re:
nutch and solr</a></h4>
           </div>
         </div>
       </div>

Modified: websites/staging/lucene/trunk/content/solr/index.html
==============================================================================
--- websites/staging/lucene/trunk/content/solr/index.html (original)
+++ websites/staging/lucene/trunk/content/solr/index.html Wed Feb 22 09:15:10 2012
@@ -468,30 +468,27 @@ numeric fields or query relevancy scores
 
         
         <div class="status-item">
-          <h4><a href="http://mail-archives.apache.org/mod_mbox/lucene-dev/201202.mbox/%3c1977238228.1101329890848834.JavaMail.hudson@aegis%3e">[JENKINS]
Lucene-Solr-tests-only-3.x-java7 - Build # 1814 - Failure</a></h4>
+          <h4><a href="http://mail-archives.apache.org/mod_mbox/lucene-dev/201202.mbox/%3c840663398.3404.1329898128785.JavaMail.tomcat@hel.zones.apache.org%3e">[jira]
[Commented] (LUCENE-3795) Replace spatial contrib module with LSP's spatial-lucene module</a></h4>
           <div class="section-content">
-          Build: <a href="https://builds.apache.org/job/Lucene-Solr-tests-only-3.x-java7/1814/">https://builds.apache.org/job/Lucene-Solr-tests-only-3.x-java7/1814/</a><br
/>&nbsp;<br />1 tests failed.
-REGRESSION:  org.apache.solr.client.solrj.embedded.LargeVolumeJettyTest.testMultiThreaded<br
/>&nbsp;<br />Error Message:
-expected:<500> but was:<400><br />&nbsp;<br />Stack Trace:
-junit.framework.AssertionFailedError: expected:<500> but...</500></400></500>
+          [ <a href="https://issues.apache.org/jira/browse/LUCENE-3795?page=com.atlassian.jira.plugin.system.issuetabpanels:comment-tabpanel&focusedCommentId=13213445#comment-13213445">https://issues.apache.org/jira/browse/LUCENE-3795?page=com.atlassian.jira.plugin.system.issuetabpanels:comment-tabpanel&focusedCommentId=13213445#comment-13213445</a>
+] <br />&nbsp;<br />Chris Male commented on LUCENE-3795:
+------------------------------------<br />&nbsp;<br />bq. LSP Lucene spatial
is in as a module,...
             </div>
           
-          <h4><a href="http://mail-archives.apache.org/mod_mbox/lucene-dev/201202.mbox/%3c740164341.1041329887623109.JavaMail.hudson@aegis%3e">[JENKINS]
Lucene-Solr-tests-only-trunk - Build # 12490 - Failure</a></h4>
+          <h4><a href="http://mail-archives.apache.org/mod_mbox/lucene-dev/201202.mbox/%3c278526284.3380.1329897650651.JavaMail.tomcat@hel.zones.apache.org%3e">[jira]
[Commented] (LUCENE-3795) Replace spatial contrib module with LSP's spatial-lucene module</a></h4>
           <div class="section-content">
-          Build: <a href="https://builds.apache.org/job/Lucene-Solr-tests-only-trunk/12490/">https://builds.apache.org/job/Lucene-Solr-tests-only-trunk/12490/</a><br
/>&nbsp;<br />1 tests failed.
-FAILED:  junit.framework.TestSuite.org.apache.solr.cloud.RecoveryZkTest<br />&nbsp;<br
/>Error Message:
-ERROR: SolrIndexSearcher opens=14 closes=13<br />&nbsp;<br />Stack Trace:
-junit.framework.AssertionFailedError: ERROR:...
+          [ <a href="https://issues.apache.org/jira/browse/LUCENE-3795?page=com.atlassian.jira.plugin.system.issuetabpanels:comment-tabpanel&focusedCommentId=13213439#comment-13213439">https://issues.apache.org/jira/browse/LUCENE-3795?page=com.atlassian.jira.plugin.system.issuetabpanels:comment-tabpanel&focusedCommentId=13213439#comment-13213439</a>
+] <br />&nbsp;<br />David Smiley commented on LUCENE-3795:
+--------------------------------------<br />&nbsp;<br />Branch Status Update:
+* LSP Lucene spatial is in...
             </div>
           
-          <h4><a href="http://mail-archives.apache.org/mod_mbox/lucene-dev/201202.mbox/%3c1559469395.1021329886669632.JavaMail.hudson@aegis%3e">[JENKINS]
Lucene-trunk - Build # 1836 - Still Failing</a></h4>
+          <h4><a href="http://mail-archives.apache.org/mod_mbox/lucene-dev/201202.mbox/%3c1977238228.1101329890848834.JavaMail.hudson@aegis%3e">[JENKINS]
Lucene-Solr-tests-only-3.x-java7 - Build # 1814 - Failure</a></h4>
           <div class="section-content">
-          Build: <a href="https://builds.apache.org/job/Lucene-trunk/1836/">https://builds.apache.org/job/Lucene-trunk/1836/</a><br
/>&nbsp;<br />1 tests failed.
-FAILED:  org.apache.lucene.search.suggest.fst.FSTCompletionTest.testMultilingualInput<br
/>&nbsp;<br />Error Message:
-expected:<[74 68 72 65 65 62 79 74 65 f0 a4 ad a2 63 68 61 72]> but was:<threebytechar><br
/>&nbsp;<br />Stack Trace:
-junit.framework.AssertionFailedError: expected:<[74 68 72 65 65 62 79 74 65 f0 a4 ad a2
-63 68 61 72]> but...</[74 68 72 65 65 62 79 74 65 f0 a4 ad a2
-63 68 61 72]></threebytechar></[74 68 72 65 65 62 79 74 65 f0 a4 ad a2 63 68
61 72]>
+          Build: <a href="https://builds.apache.org/job/Lucene-Solr-tests-only-3.x-java7/1814/">https://builds.apache.org/job/Lucene-Solr-tests-only-3.x-java7/1814/</a><br
/>&nbsp;<br />1 tests failed.
+REGRESSION:  org.apache.solr.client.solrj.embedded.LargeVolumeJettyTest.testMultiThreaded<br
/>&nbsp;<br />Error Message:
+expected:<500> but was:<400><br />&nbsp;<br />Stack Trace:
+junit.framework.AssertionFailedError: expected:<500> but...</500></400></500>
             </div>
           
         </div>
@@ -502,24 +499,22 @@ junit.framework.AssertionFailedError: ex
 
         
         <div class="status-item">
-          <h4><a href="http://mail-archives.apache.org/mod_mbox/lucene-solr-user/201202.mbox/%3c1329887660930-3765607.post@n3.nabble.com%3e">Re:
nutch and solr</a></h4>
+          <h4><a href="http://mail-archives.apache.org/mod_mbox/lucene-solr-user/201202.mbox/%3c4F44A706.4080707@designware.dk%3e">Re:
Unique key constraint and optimistic locking (versioning)</a></h4>
           <div class="section-content">
-          Try this command.<br />&nbsp;<br /> bin/nutch crawl urls/<folder
name>/<url file>.txt -dir crawl/<folders name>
--threads 10 -depth 2 -topN 1000<br />&nbsp;<br />Your folder...</folders></url></folder>
+          Thanks a lot. We will use the UniqueKey feature and build versioning 
+ourselves. Do you think it would be a...
           </div>
           
-          <h4><a href="http://mail-archives.apache.org/mod_mbox/lucene-solr-user/201202.mbox/%3calpine.DEB.2.00.1202211951180.25491@bester%3e">Re:
How to merge an "autofacet" with a predefined facet</a></h4>
+          <h4><a href="http://mail-archives.apache.org/mod_mbox/lucene-solr-user/201202.mbox/%3cCALyoB5eBw+yQY9_vUaRgCQnK91i5cPgq2GsXb_akk3DCH9F+Ng@mail.gmail.com%3e">Re:
reader/searcher refresh after replication (commit)</a></h4>
           <div class="section-content">
-          : But i don't know if it's possible to merge this "autocreated" facet with a
-: facet already predefined ?...
+          Yes, I consciously let my slaves run away from the master in order to
+reduce update latency, but every now...
           </div>
           
-          <h4><a href="http://mail-archives.apache.org/mod_mbox/lucene-solr-user/201202.mbox/%3c4F445FA0.9070005@r.email.ne.jp%3e">Re:
Fast Vector Highlighter Working for some records only</a></h4>
+          <h4><a href="http://mail-archives.apache.org/mod_mbox/lucene-solr-user/201202.mbox/%3c1329887660930-3765607.post@n3.nabble.com%3e">Re:
nutch and solr</a></h4>
           <div class="section-content">
-          (12/02/22 11:58), dhaivat wrote:
-> Thanks for reply,
->
-> But can you please tell me why it's working for...
+          Try this command.<br />&nbsp;<br /> bin/nutch crawl urls/<folder
name>/<url file>.txt -dir crawl/<folders name>
+-threads 10 -depth 2 -topN 1000<br />&nbsp;<br />Your folder...</folders></url></folder>
           </div>
           
         </div>



Mime
View raw message