lucene-builds mailing list archives

Site index · List index
Message view « Date » · « Thread »
Top « Date » · « Thread »
From Apache Jenkins Server <jenk...@builds.apache.org>
Subject [JENKINS] Lucene » Lucene-Solr-Tests-8.x - Build # 2453 - Unstable!
Date Thu, 20 May 2021 21:29:04 GMT
Build: https://ci-builds.apache.org/job/Lucene/job/Lucene-Solr-Tests-8.x/2453/

1 tests failed.
FAILED:  org.apache.solr.cloud.LeaderTragicEventTest.testLeaderFailsOver

Error Message:
Error from server at https://127.0.0.1:40045/solr: Underlying core creation failed while creating collection: testLeaderFailsOver

Stack Trace:
org.apache.solr.client.solrj.impl.HttpSolrClient$RemoteSolrException: Error from server at https://127.0.0.1:40045/solr: Underlying core creation failed while creating collection: testLeaderFailsOver
	at org.apache.solr.client.solrj.impl.HttpSolrClient.executeMethod(HttpSolrClient.java:681)
	at org.apache.solr.client.solrj.impl.HttpSolrClient.request(HttpSolrClient.java:266)
	at org.apache.solr.client.solrj.impl.HttpSolrClient.request(HttpSolrClient.java:248)
	at org.apache.solr.client.solrj.impl.LBSolrClient.doRequest(LBSolrClient.java:369)
	at org.apache.solr.client.solrj.impl.LBSolrClient.request(LBSolrClient.java:297)
	at org.apache.solr.client.solrj.impl.BaseCloudSolrClient.sendRequest(BaseCloudSolrClient.java:1171)
	at org.apache.solr.client.solrj.impl.BaseCloudSolrClient.requestWithRetryOnStaleState(BaseCloudSolrClient.java:934)
	at org.apache.solr.client.solrj.impl.BaseCloudSolrClient.request(BaseCloudSolrClient.java:866)
	at org.apache.solr.client.solrj.SolrRequest.process(SolrRequest.java:214)
	at org.apache.solr.client.solrj.SolrRequest.process(SolrRequest.java:231)
	at org.apache.solr.cloud.LeaderTragicEventTest.testLeaderFailsOver(LeaderTragicEventTest.java:80)
	at sun.reflect.NativeMethodAccessorImpl.invoke0(Native Method)
	at sun.reflect.NativeMethodAccessorImpl.invoke(NativeMethodAccessorImpl.java:62)
	at sun.reflect.DelegatingMethodAccessorImpl.invoke(DelegatingMethodAccessorImpl.java:43)
	at java.lang.reflect.Method.invoke(Method.java:498)
	at com.carrotsearch.randomizedtesting.RandomizedRunner.invoke(RandomizedRunner.java:1750)
	at com.carrotsearch.randomizedtesting.RandomizedRunner$8.evaluate(RandomizedRunner.java:938)
	at com.carrotsearch.randomizedtesting.RandomizedRunner$9.evaluate(RandomizedRunner.java:974)
	at com.carrotsearch.randomizedtesting.RandomizedRunner$10.evaluate(RandomizedRunner.java:988)
	at com.carrotsearch.randomizedtesting.rules.SystemPropertiesRestoreRule$1.evaluate(SystemPropertiesRestoreRule.java:57)
	at org.junit.rules.RunRules.evaluate(RunRules.java:20)
	at org.apache.lucene.util.TestRuleSetupTeardownChained$1.evaluate(TestRuleSetupTeardownChained.java:49)
	at org.apache.lucene.util.AbstractBeforeAfterRule$1.evaluate(AbstractBeforeAfterRule.java:45)
	at org.apache.lucene.util.TestRuleThreadAndTestName$1.evaluate(TestRuleThreadAndTestName.java:48)
	at org.apache.lucene.util.TestRuleIgnoreAfterMaxFailures$1.evaluate(TestRuleIgnoreAfterMaxFailures.java:64)
	at org.apache.lucene.util.TestRuleMarkFailure$1.evaluate(TestRuleMarkFailure.java:47)
	at org.junit.rules.RunRules.evaluate(RunRules.java:20)
	at com.carrotsearch.randomizedtesting.rules.StatementAdapter.evaluate(StatementAdapter.java:36)
	at com.carrotsearch.randomizedtesting.ThreadLeakControl$StatementRunner.run(ThreadLeakControl.java:368)
	at com.carrotsearch.randomizedtesting.ThreadLeakControl.forkTimeoutingTask(ThreadLeakControl.java:817)
	at com.carrotsearch.randomizedtesting.ThreadLeakControl$3.evaluate(ThreadLeakControl.java:468)
	at com.carrotsearch.randomizedtesting.RandomizedRunner.runSingleTest(RandomizedRunner.java:947)
	at com.carrotsearch.randomizedtesting.RandomizedRunner$5.evaluate(RandomizedRunner.java:832)
	at com.carrotsearch.randomizedtesting.RandomizedRunner$6.evaluate(RandomizedRunner.java:883)
	at com.carrotsearch.randomizedtesting.RandomizedRunner$7.evaluate(RandomizedRunner.java:894)
	at com.carrotsearch.randomizedtesting.rules.StatementAdapter.evaluate(StatementAdapter.java:36)
	at com.carrotsearch.randomizedtesting.rules.SystemPropertiesRestoreRule$1.evaluate(SystemPropertiesRestoreRule.java:57)
	at org.junit.rules.RunRules.evaluate(RunRules.java:20)
	at org.apache.lucene.util.AbstractBeforeAfterRule$1.evaluate(AbstractBeforeAfterRule.java:45)
	at com.carrotsearch.randomizedtesting.rules.StatementAdapter.evaluate(StatementAdapter.java:36)
	at org.apache.lucene.util.TestRuleStoreClassName$1.evaluate(TestRuleStoreClassName.java:41)
	at com.carrotsearch.randomizedtesting.rules.NoShadowingOrOverridesOnMethodsRule$1.evaluate(NoShadowingOrOverridesOnMethodsRule.java:40)
	at com.carrotsearch.randomizedtesting.rules.NoShadowingOrOverridesOnMethodsRule$1.evaluate(NoShadowingOrOverridesOnMethodsRule.java:40)
	at com.carrotsearch.randomizedtesting.rules.StatementAdapter.evaluate(StatementAdapter.java:36)
	at com.carrotsearch.randomizedtesting.rules.StatementAdapter.evaluate(StatementAdapter.java:36)
	at com.carrotsearch.randomizedtesting.rules.StatementAdapter.evaluate(StatementAdapter.java:36)
	at org.apache.lucene.util.TestRuleAssertionsRequired$1.evaluate(TestRuleAssertionsRequired.java:53)
	at org.apache.lucene.util.TestRuleMarkFailure$1.evaluate(TestRuleMarkFailure.java:47)
	at org.apache.lucene.util.TestRuleIgnoreAfterMaxFailures$1.evaluate(TestRuleIgnoreAfterMaxFailures.java:64)
	at org.apache.lucene.util.TestRuleIgnoreTestSuites$1.evaluate(TestRuleIgnoreTestSuites.java:54)
	at org.junit.rules.RunRules.evaluate(RunRules.java:20)
	at com.carrotsearch.randomizedtesting.rules.StatementAdapter.evaluate(StatementAdapter.java:36)
	at com.carrotsearch.randomizedtesting.ThreadLeakControl$StatementRunner.run(ThreadLeakControl.java:368)
	at java.lang.Thread.run(Thread.java:748)




Build Log:
[...truncated 15001 lines...]
   [junit4] Suite: org.apache.solr.cloud.LeaderTragicEventTest
   [junit4]   2> 1371752 INFO  (SUITE-LeaderTragicEventTest-seed#[1414658EE7F6B70D]-worker) [     ] o.a.s.SolrTestCase Setting 'solr.default.confdir' system property to test-framework derived value of '/home/jenkins/jenkins-slave/workspace/Lucene/Lucene-Solr-Tests-8.x/solr/server/solr/configsets/_default/conf'
   [junit4]   2> 1371752 INFO  (SUITE-LeaderTragicEventTest-seed#[1414658EE7F6B70D]-worker) [     ] o.a.s.SolrTestCaseJ4 SecureRandom sanity checks: test.solr.allowed.securerandom=null & java.security.egd=file:/dev/./urandom
   [junit4]   2> 1371752 INFO  (SUITE-LeaderTragicEventTest-seed#[1414658EE7F6B70D]-worker) [     ] o.a.s.SolrTestCaseJ4 Created dataDir: /home/jenkins/jenkins-slave/workspace/Lucene/Lucene-Solr-Tests-8.x/solr/build/solr-core/test/J2/temp/solr.cloud.LeaderTragicEventTest_1414658EE7F6B70D-001/data-dir-147-001
   [junit4]   2> 1371753 INFO  (SUITE-LeaderTragicEventTest-seed#[1414658EE7F6B70D]-worker) [     ] o.a.s.SolrTestCaseJ4 Using PointFields (NUMERIC_POINTS_SYSPROP=true) w/NUMERIC_DOCVALUES_SYSPROP=false
   [junit4]   2> 1371753 INFO  (SUITE-LeaderTragicEventTest-seed#[1414658EE7F6B70D]-worker) [     ] o.a.s.SolrTestCaseJ4 Randomized ssl (true) and clientAuth (true) via: @org.apache.solr.util.RandomizeSSL(reason=, ssl=NaN, value=NaN, clientAuth=NaN)
   [junit4]   2> 1371754 INFO  (SUITE-LeaderTragicEventTest-seed#[1414658EE7F6B70D]-worker) [     ] o.a.s.c.MiniSolrCloudCluster Starting cluster of 2 servers in /home/jenkins/jenkins-slave/workspace/Lucene/Lucene-Solr-Tests-8.x/solr/build/solr-core/test/J2/temp/solr.cloud.LeaderTragicEventTest_1414658EE7F6B70D-001/tempDir-001
   [junit4]   2> 1371754 INFO  (SUITE-LeaderTragicEventTest-seed#[1414658EE7F6B70D]-worker) [     ] o.a.s.c.ZkTestServer STARTING ZK TEST SERVER
   [junit4]   2> 1371755 INFO  (ZkTestServer Run Thread) [     ] o.a.s.c.ZkTestServer client port: 0.0.0.0/0.0.0.0:0
   [junit4]   2> 1371755 INFO  (ZkTestServer Run Thread) [     ] o.a.s.c.ZkTestServer Starting server
   [junit4]   2> 1371755 WARN  (ZkTestServer Run Thread) [     ] o.a.z.s.ServerCnxnFactory maxCnxns is not configured, using default value 0.
   [junit4]   2> 1371855 INFO  (SUITE-LeaderTragicEventTest-seed#[1414658EE7F6B70D]-worker) [     ] o.a.s.c.ZkTestServer start zk server on port: 34483
   [junit4]   2> 1371855 INFO  (SUITE-LeaderTragicEventTest-seed#[1414658EE7F6B70D]-worker) [     ] o.a.s.c.ZkTestServer waitForServerUp: 127.0.0.1:34483
   [junit4]   2> 1371855 INFO  (SUITE-LeaderTragicEventTest-seed#[1414658EE7F6B70D]-worker) [     ] o.a.s.c.ZkTestServer parse host and port list: 127.0.0.1:34483
   [junit4]   2> 1371855 INFO  (SUITE-LeaderTragicEventTest-seed#[1414658EE7F6B70D]-worker) [     ] o.a.s.c.ZkTestServer connecting to 127.0.0.1 34483
   [junit4]   2> 1371857 INFO  (SUITE-LeaderTragicEventTest-seed#[1414658EE7F6B70D]-worker) [     ] o.a.s.c.c.ConnectionManager Waiting for client to connect to ZooKeeper
   [junit4]   2> 1371859 INFO  (zkConnectionManagerCallback-15297-thread-1) [     ] o.a.s.c.c.ConnectionManager zkClient has connected
   [junit4]   2> 1371859 INFO  (SUITE-LeaderTragicEventTest-seed#[1414658EE7F6B70D]-worker) [     ] o.a.s.c.c.ConnectionManager Client is connected to ZooKeeper
   [junit4]   2> 1371864 INFO  (SUITE-LeaderTragicEventTest-seed#[1414658EE7F6B70D]-worker) [     ] o.a.s.c.c.ConnectionManager Waiting for client to connect to ZooKeeper
   [junit4]   2> 1371871 INFO  (zkConnectionManagerCallback-15299-thread-1) [     ] o.a.s.c.c.ConnectionManager zkClient has connected
   [junit4]   2> 1371871 INFO  (SUITE-LeaderTragicEventTest-seed#[1414658EE7F6B70D]-worker) [     ] o.a.s.c.c.ConnectionManager Client is connected to ZooKeeper
   [junit4]   2> 1371871 INFO  (SUITE-LeaderTragicEventTest-seed#[1414658EE7F6B70D]-worker) [     ] o.a.s.c.c.ConnectionManager Waiting for client to connect to ZooKeeper
   [junit4]   2> 1371873 INFO  (zkConnectionManagerCallback-15301-thread-1) [     ] o.a.s.c.c.ConnectionManager zkClient has connected
   [junit4]   2> 1371873 INFO  (SUITE-LeaderTragicEventTest-seed#[1414658EE7F6B70D]-worker) [     ] o.a.s.c.c.ConnectionManager Client is connected to ZooKeeper
   [junit4]   2> 1371875 WARN  (SUITE-LeaderTragicEventTest-seed#[1414658EE7F6B70D]-worker-SendThread(127.0.0.1:34483)) [     ] o.a.z.ClientCnxn An exception was thrown while closing send thread for session 0x105427a5ea70002.
   [junit4]   2>           => EndOfStreamException: Unable to read additional data from server sessionid 0x105427a5ea70002, likely server has closed socket
   [junit4]   2> 	at org.apache.zookeeper.ClientCnxnSocketNIO.doIO(ClientCnxnSocketNIO.java:77)
   [junit4]   2> org.apache.zookeeper.ClientCnxn$EndOfStreamException: Unable to read additional data from server sessionid 0x105427a5ea70002, likely server has closed socket
   [junit4]   2> 	at org.apache.zookeeper.ClientCnxnSocketNIO.doIO(ClientCnxnSocketNIO.java:77) ~[zookeeper-3.6.2.jar:3.6.2]
   [junit4]   2> 	at org.apache.zookeeper.ClientCnxnSocketNIO.doTransport(ClientCnxnSocketNIO.java:350) ~[zookeeper-3.6.2.jar:3.6.2]
   [junit4]   2> 	at org.apache.zookeeper.ClientCnxn$SendThread.run(ClientCnxn.java:1275) [zookeeper-3.6.2.jar:3.6.2]
   [junit4]   2> 1371977 INFO  (jetty-launcher-15302-thread-1) [     ] o.a.s.c.s.e.JettySolrRunner Start Jetty (configured port=0, binding port=0)
   [junit4]   2> 1371977 INFO  (jetty-launcher-15302-thread-2) [     ] o.a.s.c.s.e.JettySolrRunner Start Jetty (configured port=0, binding port=0)
   [junit4]   2> 1371977 INFO  (jetty-launcher-15302-thread-1) [     ] o.a.s.c.s.e.JettySolrRunner Trying to start Jetty on port 0 try number 2 ...
   [junit4]   2> 1371977 INFO  (jetty-launcher-15302-thread-2) [     ] o.a.s.c.s.e.JettySolrRunner Trying to start Jetty on port 0 try number 2 ...
   [junit4]   2> 1371977 INFO  (jetty-launcher-15302-thread-1) [     ] o.e.j.s.Server jetty-9.4.34.v20201102; built: 2020-11-02T14:15:39.302Z; git: e46af88704a893fc12cb0e3bf46e2c7b48a009e7; jvm 1.8.0_281-b09
   [junit4]   2> 1371977 INFO  (jetty-launcher-15302-thread-2) [     ] o.e.j.s.Server jetty-9.4.34.v20201102; built: 2020-11-02T14:15:39.302Z; git: e46af88704a893fc12cb0e3bf46e2c7b48a009e7; jvm 1.8.0_281-b09
   [junit4]   2> 1371980 INFO  (jetty-launcher-15302-thread-2) [     ] o.e.j.s.session DefaultSessionIdManager workerName=node0
   [junit4]   2> 1371980 INFO  (jetty-launcher-15302-thread-2) [     ] o.e.j.s.session No SessionScavenger set, using defaults
   [junit4]   2> 1371980 INFO  (jetty-launcher-15302-thread-2) [     ] o.e.j.s.session node0 Scavenging every 660000ms
   [junit4]   2> 1371982 INFO  (jetty-launcher-15302-thread-1) [     ] o.e.j.s.session DefaultSessionIdManager workerName=node0
   [junit4]   2> 1371982 INFO  (jetty-launcher-15302-thread-1) [     ] o.e.j.s.session No SessionScavenger set, using defaults
   [junit4]   2> 1371982 INFO  (jetty-launcher-15302-thread-2) [     ] o.e.j.s.h.ContextHandler Started o.e.j.s.ServletContextHandler@84fd6f0{/solr,null,AVAILABLE}
   [junit4]   2> 1371982 INFO  (jetty-launcher-15302-thread-1) [     ] o.e.j.s.session node0 Scavenging every 660000ms
   [junit4]   2> 1371983 INFO  (jetty-launcher-15302-thread-1) [     ] o.e.j.s.h.ContextHandler Started o.e.j.s.ServletContextHandler@6e878945{/solr,null,AVAILABLE}
   [junit4]   2> 1371983 INFO  (jetty-launcher-15302-thread-2) [     ] o.e.j.s.AbstractConnector Started ServerConnector@5bd1121{SSL, (ssl, http/1.1)}{127.0.0.1:37659}
   [junit4]   2> 1371983 INFO  (jetty-launcher-15302-thread-2) [     ] o.e.j.s.Server Started @1372011ms
   [junit4]   2> 1371983 INFO  (jetty-launcher-15302-thread-2) [     ] o.a.s.c.s.e.JettySolrRunner Jetty properties: {hostContext=/solr, zkHost=127.0.0.1:34483/solr, hostPort=37659}
   [junit4]   2> 1371983 ERROR (jetty-launcher-15302-thread-2) [     ] o.a.s.u.StartupLoggingUtils Missing Java Option solr.log.dir. Logging may be missing or incomplete.
   [junit4]   2> 1371983 INFO  (jetty-launcher-15302-thread-2) [     ] o.a.s.s.SolrDispatchFilter Using logger factory org.apache.logging.slf4j.Log4jLoggerFactory
   [junit4]   2> 1371983 INFO  (jetty-launcher-15302-thread-2) [     ] o.a.s.s.SolrDispatchFilter  ___      _       Welcome to Apache Solr™ version 8.9.0
   [junit4]   2> 1371983 INFO  (jetty-launcher-15302-thread-2) [     ] o.a.s.s.SolrDispatchFilter / __| ___| |_ _   Starting in cloud mode on port null
   [junit4]   2> 1371983 INFO  (jetty-launcher-15302-thread-2) [     ] o.a.s.s.SolrDispatchFilter \__ \/ _ \ | '_|  Install dir: /home/jenkins/jenkins-slave/workspace/Lucene/Lucene-Solr-Tests-8.x/solr
   [junit4]   2> 1371983 INFO  (jetty-launcher-15302-thread-1) [     ] o.e.j.s.AbstractConnector Started ServerConnector@31f6de5d{SSL, (ssl, http/1.1)}{127.0.0.1:40045}
   [junit4]   2> 1371983 INFO  (jetty-launcher-15302-thread-2) [     ] o.a.s.s.SolrDispatchFilter |___/\___/_|_|    Start time: 2021-05-20T20:52:39.125Z
   [junit4]   2> 1371983 INFO  (jetty-launcher-15302-thread-1) [     ] o.e.j.s.Server Started @1372011ms
   [junit4]   2> 1371983 INFO  (jetty-launcher-15302-thread-1) [     ] o.a.s.c.s.e.JettySolrRunner Jetty properties: {hostContext=/solr, zkHost=127.0.0.1:34483/solr, hostPort=40045}
   [junit4]   2> 1371984 ERROR (jetty-launcher-15302-thread-1) [     ] o.a.s.u.StartupLoggingUtils Missing Java Option solr.log.dir. Logging may be missing or incomplete.
   [junit4]   2> 1371984 INFO  (jetty-launcher-15302-thread-1) [     ] o.a.s.s.SolrDispatchFilter Using logger factory org.apache.logging.slf4j.Log4jLoggerFactory
   [junit4]   2> 1371984 INFO  (jetty-launcher-15302-thread-1) [     ] o.a.s.s.SolrDispatchFilter  ___      _       Welcome to Apache Solr™ version 8.9.0
   [junit4]   2> 1371984 INFO  (jetty-launcher-15302-thread-1) [     ] o.a.s.s.SolrDispatchFilter / __| ___| |_ _   Starting in cloud mode on port null
   [junit4]   2> 1371984 INFO  (jetty-launcher-15302-thread-1) [     ] o.a.s.s.SolrDispatchFilter \__ \/ _ \ | '_|  Install dir: /home/jenkins/jenkins-slave/workspace/Lucene/Lucene-Solr-Tests-8.x/solr
   [junit4]   2> 1371984 INFO  (jetty-launcher-15302-thread-1) [     ] o.a.s.s.SolrDispatchFilter |___/\___/_|_|    Start time: 2021-05-20T20:52:39.126Z
   [junit4]   2> 1371984 INFO  (jetty-launcher-15302-thread-2) [     ] o.a.s.c.c.ConnectionManager Waiting for client to connect to ZooKeeper
   [junit4]   2> 1371988 INFO  (jetty-launcher-15302-thread-1) [     ] o.a.s.c.c.ConnectionManager Waiting for client to connect to ZooKeeper
   [junit4]   2> 1371990 INFO  (zkConnectionManagerCallback-15304-thread-1) [     ] o.a.s.c.c.ConnectionManager zkClient has connected
   [junit4]   2> 1371990 INFO  (jetty-launcher-15302-thread-2) [     ] o.a.s.c.c.ConnectionManager Client is connected to ZooKeeper
   [junit4]   2> 1371990 INFO  (zkConnectionManagerCallback-15306-thread-1) [     ] o.a.s.c.c.ConnectionManager zkClient has connected
   [junit4]   2> 1371990 INFO  (jetty-launcher-15302-thread-1) [     ] o.a.s.c.c.ConnectionManager Client is connected to ZooKeeper
   [junit4]   2> 1371990 INFO  (jetty-launcher-15302-thread-2) [     ] o.a.s.s.SolrDispatchFilter solr.xml found in ZooKeeper. Loading...
   [junit4]   2> 1371991 INFO  (jetty-launcher-15302-thread-1) [     ] o.a.s.s.SolrDispatchFilter solr.xml found in ZooKeeper. Loading...
   [junit4]   2> 1371994 INFO  (jetty-launcher-15302-thread-2) [     ] o.a.s.c.SolrXmlConfig Metrics collection is disabled.
   [junit4]   2> 1371994 INFO  (jetty-launcher-15302-thread-1) [     ] o.a.s.c.SolrXmlConfig Metrics collection is disabled.
   [junit4]   2> 1371995 WARN  (jetty-launcher-15302-thread-1-SendThread(127.0.0.1:34483)) [     ] o.a.z.ClientCnxn An exception was thrown while closing send thread for session 0x105427a5ea70004.
   [junit4]   2>           => EndOfStreamException: Unable to read additional data from server sessionid 0x105427a5ea70004, likely server has closed socket
   [junit4]   2> 	at org.apache.zookeeper.ClientCnxnSocketNIO.doIO(ClientCnxnSocketNIO.java:77)
   [junit4]   2> org.apache.zookeeper.ClientCnxn$EndOfStreamException: Unable to read additional data from server sessionid 0x105427a5ea70004, likely server has closed socket
   [junit4]   2> 	at org.apache.zookeeper.ClientCnxnSocketNIO.doIO(ClientCnxnSocketNIO.java:77) ~[zookeeper-3.6.2.jar:3.6.2]
   [junit4]   2> 	at org.apache.zookeeper.ClientCnxnSocketNIO.doTransport(ClientCnxnSocketNIO.java:350) ~[zookeeper-3.6.2.jar:3.6.2]
   [junit4]   2> 	at org.apache.zookeeper.ClientCnxn$SendThread.run(ClientCnxn.java:1275) [zookeeper-3.6.2.jar:3.6.2]
   [junit4]   2> 1372581 INFO  (jetty-launcher-15302-thread-1) [     ] o.a.s.h.c.HttpShardHandlerFactory Host whitelist initialized: WhitelistHostChecker [whitelistHosts=null, whitelistHostCheckingEnabled=true]
   [junit4]   2> 1372582 WARN  (jetty-launcher-15302-thread-1) [     ] o.a.s.c.s.i.Http2SolrClient Create Http2SolrClient with HTTP/1.1 transport since Java 8 or lower versions does not support SSL + HTTP/2
   [junit4]   2> 1372582 WARN  (jetty-launcher-15302-thread-1) [     ] o.e.j.u.s.S.config Trusting all certificates configured for Client@5de0343c[provider=null,keyStore=null,trustStore=null]
   [junit4]   2> 1372582 WARN  (jetty-launcher-15302-thread-1) [     ] o.e.j.u.s.S.config No Client EndPointIdentificationAlgorithm configured for Client@5de0343c[provider=null,keyStore=null,trustStore=null]
   [junit4]   2> 1372585 WARN  (jetty-launcher-15302-thread-1) [     ] o.a.s.c.s.i.Http2SolrClient Create Http2SolrClient with HTTP/1.1 transport since Java 8 or lower versions does not support SSL + HTTP/2
   [junit4]   2> 1372588 WARN  (jetty-launcher-15302-thread-1) [     ] o.e.j.u.s.S.config Trusting all certificates configured for Client@1846379c[provider=null,keyStore=null,trustStore=null]
   [junit4]   2> 1372588 WARN  (jetty-launcher-15302-thread-1) [     ] o.e.j.u.s.S.config No Client EndPointIdentificationAlgorithm configured for Client@1846379c[provider=null,keyStore=null,trustStore=null]
   [junit4]   2> 1372589 INFO  (jetty-launcher-15302-thread-1) [     ] o.a.s.c.ZkContainer Zookeeper client=127.0.0.1:34483/solr
   [junit4]   2> 1372590 INFO  (jetty-launcher-15302-thread-1) [     ] o.a.s.c.c.ConnectionManager Waiting for client to connect to ZooKeeper
   [junit4]   2> 1372592 INFO  (zkConnectionManagerCallback-15320-thread-1) [     ] o.a.s.c.c.ConnectionManager zkClient has connected
   [junit4]   2> 1372592 INFO  (jetty-launcher-15302-thread-1) [     ] o.a.s.c.c.ConnectionManager Client is connected to ZooKeeper
   [junit4]   2> 1372694 INFO  (jetty-launcher-15302-thread-1) [n:127.0.0.1:40045_solr     ] o.a.s.c.c.ConnectionManager Waiting for client to connect to ZooKeeper
   [junit4]   2> 1372695 INFO  (zkConnectionManagerCallback-15322-thread-1) [     ] o.a.s.c.c.ConnectionManager zkClient has connected
   [junit4]   2> 1372695 INFO  (jetty-launcher-15302-thread-1) [n:127.0.0.1:40045_solr     ] o.a.s.c.c.ConnectionManager Client is connected to ZooKeeper
   [junit4]   2> 1372760 WARN  (jetty-launcher-15302-thread-1) [n:127.0.0.1:40045_solr     ] o.a.s.c.ZkController Contents of zookeeper /security.json are world-readable; consider setting up ACLs as described in https://solr.apache.org/guide/zookeeper-access-control.html
   [junit4]   2> 1372769 INFO  (jetty-launcher-15302-thread-1) [n:127.0.0.1:40045_solr     ] o.a.s.c.OverseerElectionContext I am going to be the leader 127.0.0.1:40045_solr
   [junit4]   2> 1372770 INFO  (jetty-launcher-15302-thread-1) [n:127.0.0.1:40045_solr     ] o.a.s.c.Overseer Overseer (id=73538062262927366-127.0.0.1:40045_solr-n_0000000000) starting
   [junit4]   2> 1372775 INFO  (OverseerStateUpdate-73538062262927366-127.0.0.1:40045_solr-n_0000000000) [n:127.0.0.1:40045_solr     ] o.a.s.c.Overseer Starting to work on the main queue : 127.0.0.1:40045_solr
   [junit4]   2> 1372775 INFO  (jetty-launcher-15302-thread-1) [n:127.0.0.1:40045_solr     ] o.a.s.c.ZkController Register node as live in ZooKeeper:/live_nodes/127.0.0.1:40045_solr
   [junit4]   2> 1372777 INFO  (OverseerStateUpdate-73538062262927366-127.0.0.1:40045_solr-n_0000000000) [n:127.0.0.1:40045_solr     ] o.a.s.c.c.ZkStateReader Updated live nodes from ZooKeeper... (0) -> (1)
   [junit4]   2> 1372780 INFO  (jetty-launcher-15302-thread-1) [n:127.0.0.1:40045_solr     ] o.a.s.p.PackageLoader /packages.json updated to version -1
   [junit4]   2> 1372781 WARN  (jetty-launcher-15302-thread-1) [n:127.0.0.1:40045_solr     ] o.a.s.c.CoreContainer Not all security plugins configured!  authentication=disabled authorization=disabled.  Solr is only as secure as you make it. Consider configuring authentication/authorization before exposing Solr to users internal or external.  See https://s.apache.org/solrsecurity for more info
   [junit4]   2> 1372811 INFO  (jetty-launcher-15302-thread-1) [n:127.0.0.1:40045_solr     ] o.a.s.c.CorePropertiesLocator Found 0 core definitions underneath /home/jenkins/jenkins-slave/workspace/Lucene/Lucene-Solr-Tests-8.x/solr/build/solr-core/test/J2/temp/solr.cloud.LeaderTragicEventTest_1414658EE7F6B70D-001/tempDir-001/node1
   [junit4]   2> 1374057 INFO  (jetty-launcher-15302-thread-2) [     ] o.a.s.h.c.HttpShardHandlerFactory Host whitelist initialized: WhitelistHostChecker [whitelistHosts=null, whitelistHostCheckingEnabled=true]
   [junit4]   2> 1374057 WARN  (jetty-launcher-15302-thread-2) [     ] o.a.s.c.s.i.Http2SolrClient Create Http2SolrClient with HTTP/1.1 transport since Java 8 or lower versions does not support SSL + HTTP/2
   [junit4]   2> 1374058 WARN  (jetty-launcher-15302-thread-2) [     ] o.e.j.u.s.S.config Trusting all certificates configured for Client@57299cca[provider=null,keyStore=null,trustStore=null]
   [junit4]   2> 1374058 WARN  (jetty-launcher-15302-thread-2) [     ] o.e.j.u.s.S.config No Client EndPointIdentificationAlgorithm configured for Client@57299cca[provider=null,keyStore=null,trustStore=null]
   [junit4]   2> 1374060 WARN  (jetty-launcher-15302-thread-2) [     ] o.a.s.c.s.i.Http2SolrClient Create Http2SolrClient with HTTP/1.1 transport since Java 8 or lower versions does not support SSL + HTTP/2
   [junit4]   2> 1374061 WARN  (jetty-launcher-15302-thread-2) [     ] o.e.j.u.s.S.config Trusting all certificates configured for Client@636623e7[provider=null,keyStore=null,trustStore=null]
   [junit4]   2> 1374061 WARN  (jetty-launcher-15302-thread-2) [     ] o.e.j.u.s.S.config No Client EndPointIdentificationAlgorithm configured for Client@636623e7[provider=null,keyStore=null,trustStore=null]
   [junit4]   2> 1374062 INFO  (jetty-launcher-15302-thread-2) [     ] o.a.s.c.ZkContainer Zookeeper client=127.0.0.1:34483/solr
   [junit4]   2> 1374063 INFO  (jetty-launcher-15302-thread-2) [     ] o.a.s.c.c.ConnectionManager Waiting for client to connect to ZooKeeper
   [junit4]   2> 1374064 INFO  (zkConnectionManagerCallback-15340-thread-1) [     ] o.a.s.c.c.ConnectionManager zkClient has connected
   [junit4]   2> 1374064 INFO  (jetty-launcher-15302-thread-2) [     ] o.a.s.c.c.ConnectionManager Client is connected to ZooKeeper
   [junit4]   2> 1374165 INFO  (jetty-launcher-15302-thread-2) [n:127.0.0.1:37659_solr     ] o.a.s.c.c.ConnectionManager Waiting for client to connect to ZooKeeper
   [junit4]   2> 1374166 INFO  (zkConnectionManagerCallback-15342-thread-1) [     ] o.a.s.c.c.ConnectionManager zkClient has connected
   [junit4]   2> 1374166 INFO  (jetty-launcher-15302-thread-2) [n:127.0.0.1:37659_solr     ] o.a.s.c.c.ConnectionManager Client is connected to ZooKeeper
   [junit4]   2> 1374170 WARN  (jetty-launcher-15302-thread-2) [n:127.0.0.1:37659_solr     ] o.a.s.c.ZkController Contents of zookeeper /security.json are world-readable; consider setting up ACLs as described in https://solr.apache.org/guide/zookeeper-access-control.html
   [junit4]   2> 1374171 INFO  (jetty-launcher-15302-thread-2) [n:127.0.0.1:37659_solr     ] o.a.s.c.c.ZkStateReader Updated live nodes from ZooKeeper... (0) -> (1)
   [junit4]   2> 1374175 INFO  (jetty-launcher-15302-thread-2) [n:127.0.0.1:37659_solr     ] o.a.s.c.ZkController Publish node=127.0.0.1:37659_solr as DOWN
   [junit4]   2> 1374175 INFO  (jetty-launcher-15302-thread-2) [n:127.0.0.1:37659_solr     ] o.a.s.c.TransientSolrCoreCacheDefault Allocating transient cache for 2147483647 transient cores
   [junit4]   2> 1374175 INFO  (jetty-launcher-15302-thread-2) [n:127.0.0.1:37659_solr     ] o.a.s.c.ZkController Register node as live in ZooKeeper:/live_nodes/127.0.0.1:37659_solr
   [junit4]   2> 1374177 INFO  (zkCallback-15321-thread-1) [     ] o.a.s.c.c.ZkStateReader Updated live nodes from ZooKeeper... (1) -> (2)
   [junit4]   2> 1374177 INFO  (zkCallback-15341-thread-1) [     ] o.a.s.c.c.ZkStateReader Updated live nodes from ZooKeeper... (1) -> (2)
   [junit4]   2> 1374178 INFO  (jetty-launcher-15302-thread-2) [n:127.0.0.1:37659_solr     ] o.a.s.p.PackageLoader /packages.json updated to version -1
   [junit4]   2> 1374178 WARN  (jetty-launcher-15302-thread-2) [n:127.0.0.1:37659_solr     ] o.a.s.c.CoreContainer Not all security plugins configured!  authentication=disabled authorization=disabled.  Solr is only as secure as you make it. Consider configuring authentication/authorization before exposing Solr to users internal or external.  See https://s.apache.org/solrsecurity for more info
   [junit4]   2> 1374190 INFO  (jetty-launcher-15302-thread-2) [n:127.0.0.1:37659_solr     ] o.a.s.c.CorePropertiesLocator Found 0 core definitions underneath /home/jenkins/jenkins-slave/workspace/Lucene/Lucene-Solr-Tests-8.x/solr/build/solr-core/test/J2/temp/solr.cloud.LeaderTragicEventTest_1414658EE7F6B70D-001/tempDir-001/node2
   [junit4]   2> 1374196 INFO  (SUITE-LeaderTragicEventTest-seed#[1414658EE7F6B70D]-worker) [     ] o.a.s.c.MiniSolrCloudCluster waitForAllNodes: numServers=2
   [junit4]   2> 1374197 INFO  (SUITE-LeaderTragicEventTest-seed#[1414658EE7F6B70D]-worker) [     ] o.a.s.c.c.ConnectionManager Waiting for client to connect to ZooKeeper
   [junit4]   2> 1374198 INFO  (zkConnectionManagerCallback-15353-thread-1) [     ] o.a.s.c.c.ConnectionManager zkClient has connected
   [junit4]   2> 1374198 INFO  (SUITE-LeaderTragicEventTest-seed#[1414658EE7F6B70D]-worker) [     ] o.a.s.c.c.ConnectionManager Client is connected to ZooKeeper
   [junit4]   2> 1374200 INFO  (SUITE-LeaderTragicEventTest-seed#[1414658EE7F6B70D]-worker) [     ] o.a.s.c.c.ZkStateReader Updated live nodes from ZooKeeper... (0) -> (2)
   [junit4]   2> 1374201 INFO  (SUITE-LeaderTragicEventTest-seed#[1414658EE7F6B70D]-worker) [     ] o.a.s.c.s.i.ZkClientClusterStateProvider Cluster at 127.0.0.1:34483/solr ready
   [junit4]   2> 1374221 INFO  (TEST-LeaderTragicEventTest.testOtherReplicasAreNotActive-seed#[1414658EE7F6B70D]) [     ] o.a.s.SolrTestCaseJ4 ###Starting testOtherReplicasAreNotActive
   [junit4]   2> 1374263 INFO  (OverseerThreadFactory-15329-thread-1-processing-n:127.0.0.1:40045_solr) [n:127.0.0.1:40045_solr     ] o.a.s.c.a.c.CreateCollectionCmd Create collection testOtherReplicasAreNotActive
   [junit4]   2> 1374370 INFO  (OverseerStateUpdate-73538062262927366-127.0.0.1:40045_solr-n_0000000000) [n:127.0.0.1:40045_solr     ] o.a.s.c.o.SliceMutator createReplica() {
   [junit4]   2>   "core":"testOtherReplicasAreNotActive_shard1_replica_n1",
   [junit4]   2>   "node_name":"127.0.0.1:40045_solr",
   [junit4]   2>   "base_url":"https://127.0.0.1:40045/solr",
   [junit4]   2>   "collection":"testOtherReplicasAreNotActive",
   [junit4]   2>   "shard":"shard1",
   [junit4]   2>   "state":"down",
   [junit4]   2>   "type":"NRT",
   [junit4]   2>   "operation":"ADDREPLICA",
   [junit4]   2>   "waitForFinalState":"false"} 
   [junit4]   2> 1374372 INFO  (OverseerStateUpdate-73538062262927366-127.0.0.1:40045_solr-n_0000000000) [n:127.0.0.1:40045_solr     ] o.a.s.c.o.SliceMutator createReplica() {
   [junit4]   2>   "core":"testOtherReplicasAreNotActive_shard1_replica_n2",
   [junit4]   2>   "node_name":"127.0.0.1:37659_solr",
   [junit4]   2>   "base_url":"https://127.0.0.1:37659/solr",
   [junit4]   2>   "collection":"testOtherReplicasAreNotActive",
   [junit4]   2>   "shard":"shard1",
   [junit4]   2>   "state":"down",
   [junit4]   2>   "type":"NRT",
   [junit4]   2>   "operation":"ADDREPLICA",
   [junit4]   2>   "waitForFinalState":"false"} 
   [junit4]   2> 1374583 INFO  (qtp2114729431-23648) [n:127.0.0.1:40045_solr    x:testOtherReplicasAreNotActive_shard1_replica_n1 ] o.a.s.h.a.CoreAdminOperation core create command qt=/admin/cores&coreNodeName=core_node3&collection.configName=config&newCollection=true&name=testOtherReplicasAreNotActive_shard1_replica_n1&action=CREATE&numShards=1&collection=testOtherReplicasAreNotActive&shard=shard1&wt=javabin&version=2&replicaType=NRT
   [junit4]   2> 1374583 INFO  (qtp2114729431-23648) [n:127.0.0.1:40045_solr    x:testOtherReplicasAreNotActive_shard1_replica_n1 ] o.a.s.c.TransientSolrCoreCacheDefault Allocating transient cache for 2147483647 transient cores
   [junit4]   2> 1374600 INFO  (qtp2114729431-23648) [n:127.0.0.1:40045_solr c:testOtherReplicasAreNotActive s:shard1 r:core_node3 x:testOtherReplicasAreNotActive_shard1_replica_n1 ] o.a.s.c.SolrConfig Using Lucene MatchVersion: 8.9.0
   [junit4]   2> 1374602 INFO  (qtp2114729431-23648) [n:127.0.0.1:40045_solr c:testOtherReplicasAreNotActive s:shard1 r:core_node3 x:testOtherReplicasAreNotActive_shard1_replica_n1 ] o.a.s.s.IndexSchema Schema name=minimal
   [junit4]   2> 1374602 INFO  (qtp2114729431-23648) [n:127.0.0.1:40045_solr c:testOtherReplicasAreNotActive s:shard1 r:core_node3 x:testOtherReplicasAreNotActive_shard1_replica_n1 ] o.a.s.s.IndexSchema Loaded schema minimal/1.1 with uniqueid field id
   [junit4]   2> 1374602 INFO  (qtp2114729431-23648) [n:127.0.0.1:40045_solr c:testOtherReplicasAreNotActive s:shard1 r:core_node3 x:testOtherReplicasAreNotActive_shard1_replica_n1 ] o.a.s.c.CoreContainer Creating SolrCore 'testOtherReplicasAreNotActive_shard1_replica_n1' using configuration from configset config, trusted=true
   [junit4]   2> 1374603 INFO  (qtp2114729431-23648) [n:127.0.0.1:40045_solr c:testOtherReplicasAreNotActive s:shard1 r:core_node3 x:testOtherReplicasAreNotActive_shard1_replica_n1 ] o.a.s.c.SolrCore [[testOtherReplicasAreNotActive_shard1_replica_n1] ] Opening new SolrCore at [/home/jenkins/jenkins-slave/workspace/Lucene/Lucene-Solr-Tests-8.x/solr/build/solr-core/test/J2/temp/solr.cloud.LeaderTragicEventTest_1414658EE7F6B70D-001/tempDir-001/node1/testOtherReplicasAreNotActive_shard1_replica_n1], dataDir=[/home/jenkins/jenkins-slave/workspace/Lucene/Lucene-Solr-Tests-8.x/solr/build/solr-core/test/J2/temp/solr.cloud.LeaderTragicEventTest_1414658EE7F6B70D-001/tempDir-001/node1/testOtherReplicasAreNotActive_shard1_replica_n1/data/]
   [junit4]   2> 1374620 INFO  (qtp1246231586-23638) [n:127.0.0.1:37659_solr    x:testOtherReplicasAreNotActive_shard1_replica_n2 ] o.a.s.h.a.CoreAdminOperation core create command qt=/admin/cores&coreNodeName=core_node4&collection.configName=config&newCollection=true&name=testOtherReplicasAreNotActive_shard1_replica_n2&action=CREATE&numShards=1&collection=testOtherReplicasAreNotActive&shard=shard1&wt=javabin&version=2&replicaType=NRT
   [junit4]   2> 1374630 INFO  (qtp1246231586-23638) [n:127.0.0.1:37659_solr c:testOtherReplicasAreNotActive s:shard1 r:core_node4 x:testOtherReplicasAreNotActive_shard1_replica_n2 ] o.a.s.c.SolrConfig Using Lucene MatchVersion: 8.9.0
   [junit4]   2> 1374632 INFO  (qtp1246231586-23638) [n:127.0.0.1:37659_solr c:testOtherReplicasAreNotActive s:shard1 r:core_node4 x:testOtherReplicasAreNotActive_shard1_replica_n2 ] o.a.s.s.IndexSchema Schema name=minimal
   [junit4]   2> 1374632 INFO  (qtp1246231586-23638) [n:127.0.0.1:37659_solr c:testOtherReplicasAreNotActive s:shard1 r:core_node4 x:testOtherReplicasAreNotActive_shard1_replica_n2 ] o.a.s.s.IndexSchema Loaded schema minimal/1.1 with uniqueid field id
   [junit4]   2> 1374632 INFO  (qtp1246231586-23638) [n:127.0.0.1:37659_solr c:testOtherReplicasAreNotActive s:shard1 r:core_node4 x:testOtherReplicasAreNotActive_shard1_replica_n2 ] o.a.s.c.CoreContainer Creating SolrCore 'testOtherReplicasAreNotActive_shard1_replica_n2' using configuration from configset config, trusted=true
   [junit4]   2> 1374632 INFO  (qtp1246231586-23638) [n:127.0.0.1:37659_solr c:testOtherReplicasAreNotActive s:shard1 r:core_node4 x:testOtherReplicasAreNotActive_shard1_replica_n2 ] o.a.s.c.SolrCore [[testOtherReplicasAreNotActive_shard1_replica_n2] ] Opening new SolrCore at [/home/jenkins/jenkins-slave/workspace/Lucene/Lucene-Solr-Tests-8.x/solr/build/solr-core/test/J2/temp/solr.cloud.LeaderTragicEventTest_1414658EE7F6B70D-001/tempDir-001/node2/testOtherReplicasAreNotActive_shard1_replica_n2], dataDir=[/home/jenkins/jenkins-slave/workspace/Lucene/Lucene-Solr-Tests-8.x/solr/build/solr-core/test/J2/temp/solr.cloud.LeaderTragicEventTest_1414658EE7F6B70D-001/tempDir-001/node2/testOtherReplicasAreNotActive_shard1_replica_n2/data/]
   [junit4]   2> 1374634 INFO  (qtp2114729431-23648) [n:127.0.0.1:40045_solr c:testOtherReplicasAreNotActive s:shard1 r:core_node3 x:testOtherReplicasAreNotActive_shard1_replica_n1 ] o.a.s.u.UpdateHandler Using UpdateLog implementation: org.apache.solr.update.UpdateLog
   [junit4]   2> 1374634 INFO  (qtp2114729431-23648) [n:127.0.0.1:40045_solr c:testOtherReplicasAreNotActive s:shard1 r:core_node3 x:testOtherReplicasAreNotActive_shard1_replica_n1 ] o.a.s.u.UpdateLog Initializing UpdateLog: dataDir=null defaultSyncLevel=FLUSH numRecordsToKeep=100 maxNumLogsToKeep=10 numVersionBuckets=65536
   [junit4]   2> 1374635 INFO  (qtp2114729431-23648) [n:127.0.0.1:40045_solr c:testOtherReplicasAreNotActive s:shard1 r:core_node3 x:testOtherReplicasAreNotActive_shard1_replica_n1 ] o.a.s.u.CommitTracker Hard AutoCommit: disabled
   [junit4]   2> 1374635 INFO  (qtp2114729431-23648) [n:127.0.0.1:40045_solr c:testOtherReplicasAreNotActive s:shard1 r:core_node3 x:testOtherReplicasAreNotActive_shard1_replica_n1 ] o.a.s.u.CommitTracker Soft AutoCommit: disabled
   [junit4]   2> 1374636 INFO  (qtp2114729431-23648) [n:127.0.0.1:40045_solr c:testOtherReplicasAreNotActive s:shard1 r:core_node3 x:testOtherReplicasAreNotActive_shard1_replica_n1 ] o.a.s.r.ManagedResourceStorage Configured ZooKeeperStorageIO with znodeBase: /configs/config
   [junit4]   2> 1374636 INFO  (qtp2114729431-23648) [n:127.0.0.1:40045_solr c:testOtherReplicasAreNotActive s:shard1 r:core_node3 x:testOtherReplicasAreNotActive_shard1_replica_n1 ] o.a.s.r.ManagedResourceStorage Loaded null at path _rest_managed.json using ZooKeeperStorageIO:path=/configs/config
   [junit4]   2> 1374636 INFO  (qtp2114729431-23648) [n:127.0.0.1:40045_solr c:testOtherReplicasAreNotActive s:shard1 r:core_node3 x:testOtherReplicasAreNotActive_shard1_replica_n1 ] o.a.s.h.ReplicationHandler Commits will be reserved for 10000 ms
   [junit4]   2> 1374637 INFO  (qtp2114729431-23648) [n:127.0.0.1:40045_solr c:testOtherReplicasAreNotActive s:shard1 r:core_node3 x:testOtherReplicasAreNotActive_shard1_replica_n1 ] o.a.s.u.UpdateLog Could not find max version in index or recent updates, using new clock 1700312081266376704
   [junit4]   2> 1374638 INFO  (searcherExecutor-15355-thread-1-processing-n:127.0.0.1:40045_solr x:testOtherReplicasAreNotActive_shard1_replica_n1 c:testOtherReplicasAreNotActive s:shard1 r:core_node3) [n:127.0.0.1:40045_solr c:testOtherReplicasAreNotActive s:shard1 r:core_node3 x:testOtherReplicasAreNotActive_shard1_replica_n1 ] o.a.s.c.SolrCore [testOtherReplicasAreNotActive_shard1_replica_n1]  Registered new searcher autowarm time: 0 ms
   [junit4]   2> 1374642 INFO  (qtp2114729431-23648) [n:127.0.0.1:40045_solr c:testOtherReplicasAreNotActive s:shard1 r:core_node3 x:testOtherReplicasAreNotActive_shard1_replica_n1 ] o.a.s.c.ZkShardTerms Successful update of terms at /collections/testOtherReplicasAreNotActive/terms/shard1 to Terms{values={core_node3=0}, version=0}
   [junit4]   2> 1374643 INFO  (qtp2114729431-23648) [n:127.0.0.1:40045_solr c:testOtherReplicasAreNotActive s:shard1 r:core_node3 x:testOtherReplicasAreNotActive_shard1_replica_n1 ] o.a.s.c.ShardLeaderElectionContextBase make sure parent is created /collections/testOtherReplicasAreNotActive/leaders/shard1
   [junit4]   2> 1374647 INFO  (qtp2114729431-23648) [n:127.0.0.1:40045_solr c:testOtherReplicasAreNotActive s:shard1 r:core_node3 x:testOtherReplicasAreNotActive_shard1_replica_n1 ] o.a.s.c.ShardLeaderElectionContext Waiting until we see more replicas up for shard shard1: total=2 found=1 timeoute in=9999ms
   [junit4]   2> 1374658 INFO  (qtp1246231586-23638) [n:127.0.0.1:37659_solr c:testOtherReplicasAreNotActive s:shard1 r:core_node4 x:testOtherReplicasAreNotActive_shard1_replica_n2 ] o.a.s.u.UpdateHandler Using UpdateLog implementation: org.apache.solr.update.UpdateLog
   [junit4]   2> 1374658 INFO  (qtp1246231586-23638) [n:127.0.0.1:37659_solr c:testOtherReplicasAreNotActive s:shard1 r:core_node4 x:testOtherReplicasAreNotActive_shard1_replica_n2 ] o.a.s.u.UpdateLog Initializing UpdateLog: dataDir=null defaultSyncLevel=FLUSH numRecordsToKeep=100 maxNumLogsToKeep=10 numVersionBuckets=65536
   [junit4]   2> 1374659 INFO  (qtp1246231586-23638) [n:127.0.0.1:37659_solr c:testOtherReplicasAreNotActive s:shard1 r:core_node4 x:testOtherReplicasAreNotActive_shard1_replica_n2 ] o.a.s.u.CommitTracker Hard AutoCommit: disabled
   [junit4]   2> 1374659 INFO  (qtp1246231586-23638) [n:127.0.0.1:37659_solr c:testOtherReplicasAreNotActive s:shard1 r:core_node4 x:testOtherReplicasAreNotActive_shard1_replica_n2 ] o.a.s.u.CommitTracker Soft AutoCommit: disabled
   [junit4]   2> 1374660 INFO  (qtp1246231586-23638) [n:127.0.0.1:37659_solr c:testOtherReplicasAreNotActive s:shard1 r:core_node4 x:testOtherReplicasAreNotActive_shard1_replica_n2 ] o.a.s.r.ManagedResourceStorage Configured ZooKeeperStorageIO with znodeBase: /configs/config
   [junit4]   2> 1374660 INFO  (qtp1246231586-23638) [n:127.0.0.1:37659_solr c:testOtherReplicasAreNotActive s:shard1 r:core_node4 x:testOtherReplicasAreNotActive_shard1_replica_n2 ] o.a.s.r.ManagedResourceStorage Loaded null at path _rest_managed.json using ZooKeeperStorageIO:path=/configs/config
   [junit4]   2> 1374660 INFO  (qtp1246231586-23638) [n:127.0.0.1:37659_solr c:testOtherReplicasAreNotActive s:shard1 r:core_node4 x:testOtherReplicasAreNotActive_shard1_replica_n2 ] o.a.s.h.ReplicationHandler Commits will be reserved for 10000 ms
   [junit4]   2> 1374661 INFO  (qtp1246231586-23638) [n:127.0.0.1:37659_solr c:testOtherReplicasAreNotActive s:shard1 r:core_node4 x:testOtherReplicasAreNotActive_shard1_replica_n2 ] o.a.s.u.UpdateLog Could not find max version in index or recent updates, using new clock 1700312081291542528
   [junit4]   2> 1374662 INFO  (searcherExecutor-15358-thread-1-processing-n:127.0.0.1:37659_solr x:testOtherReplicasAreNotActive_shard1_replica_n2 c:testOtherReplicasAreNotActive s:shard1 r:core_node4) [n:127.0.0.1:37659_solr c:testOtherReplicasAreNotActive s:shard1 r:core_node4 x:testOtherReplicasAreNotActive_shard1_replica_n2 ] o.a.s.c.SolrCore [testOtherReplicasAreNotActive_shard1_replica_n2]  Registered new searcher autowarm time: 0 ms
   [junit4]   2> 1374667 INFO  (qtp1246231586-23638) [n:127.0.0.1:37659_solr c:testOtherReplicasAreNotActive s:shard1 r:core_node4 x:testOtherReplicasAreNotActive_shard1_replica_n2 ] o.a.s.c.ZkShardTerms Successful update of terms at /collections/testOtherReplicasAreNotActive/terms/shard1 to Terms{values={core_node3=0, core_node4=0}, version=1}
   [junit4]   2> 1374667 INFO  (qtp1246231586-23638) [n:127.0.0.1:37659_solr c:testOtherReplicasAreNotActive s:shard1 r:core_node4 x:testOtherReplicasAreNotActive_shard1_replica_n2 ] o.a.s.c.ShardLeaderElectionContextBase make sure parent is created /collections/testOtherReplicasAreNotActive/leaders/shard1
   [junit4]   2> 1375148 INFO  (qtp2114729431-23648) [n:127.0.0.1:40045_solr c:testOtherReplicasAreNotActive s:shard1 r:core_node3 x:testOtherReplicasAreNotActive_shard1_replica_n1 ] o.a.s.c.ShardLeaderElectionContext Enough replicas found to continue.
   [junit4]   2> 1375148 INFO  (qtp2114729431-23648) [n:127.0.0.1:40045_solr c:testOtherReplicasAreNotActive s:shard1 r:core_node3 x:testOtherReplicasAreNotActive_shard1_replica_n1 ] o.a.s.c.ShardLeaderElectionContext I may be the new leader - try and sync
   [junit4]   2> 1375148 INFO  (qtp2114729431-23648) [n:127.0.0.1:40045_solr c:testOtherReplicasAreNotActive s:shard1 r:core_node3 x:testOtherReplicasAreNotActive_shard1_replica_n1 ] o.a.s.c.SyncStrategy Sync replicas to https://127.0.0.1:40045/solr/testOtherReplicasAreNotActive_shard1_replica_n1/
   [junit4]   2> 1375153 INFO  (qtp2114729431-23648) [n:127.0.0.1:40045_solr c:testOtherReplicasAreNotActive s:shard1 r:core_node3 x:testOtherReplicasAreNotActive_shard1_replica_n1 ] o.a.s.u.PeerSync PeerSync: core=testOtherReplicasAreNotActive_shard1_replica_n1 url=https://127.0.0.1:40045/solr  START replicas=[https://127.0.0.1:37659/solr/testOtherReplicasAreNotActive_shard1_replica_n2/] nUpdates=100
   [junit4]   2> 1375154 INFO  (qtp2114729431-23648) [n:127.0.0.1:40045_solr c:testOtherReplicasAreNotActive s:shard1 r:core_node3 x:testOtherReplicasAreNotActive_shard1_replica_n1 ] o.a.s.u.PeerSync PeerSync: core=testOtherReplicasAreNotActive_shard1_replica_n1 url=https://127.0.0.1:40045/solr  DONE. We have no versions. sync failed.
   [junit4]   2> 1375160 INFO  (qtp1246231586-23643) [n:127.0.0.1:37659_solr c:testOtherReplicasAreNotActive s:shard1 r:core_node4 x:testOtherReplicasAreNotActive_shard1_replica_n2 ] o.a.s.c.S.Request [testOtherReplicasAreNotActive_shard1_replica_n2]  webapp=/solr path=/get params={distrib=false&qt=/get&fingerprint=false&getVersions=100&wt=javabin&version=2} status=0 QTime=0
   [junit4]   2> 1375161 INFO  (qtp2114729431-23648) [n:127.0.0.1:40045_solr c:testOtherReplicasAreNotActive s:shard1 r:core_node3 x:testOtherReplicasAreNotActive_shard1_replica_n1 ] o.a.s.c.SyncStrategy Leader's attempt to sync with shard failed, moving to the next candidate
   [junit4]   2> 1375161 INFO  (qtp2114729431-23648) [n:127.0.0.1:40045_solr c:testOtherReplicasAreNotActive s:shard1 r:core_node3 x:testOtherReplicasAreNotActive_shard1_replica_n1 ] o.a.s.c.ShardLeaderElectionContext We failed sync, but we have no versions - we can't sync in that case - we were active before, so become leader anyway
   [junit4]   2> 1375161 INFO  (qtp2114729431-23648) [n:127.0.0.1:40045_solr c:testOtherReplicasAreNotActive s:shard1 r:core_node3 x:testOtherReplicasAreNotActive_shard1_replica_n1 ] o.a.s.c.ShardLeaderElectionContextBase Creating leader registration node /collections/testOtherReplicasAreNotActive/leaders/shard1/leader after winning as /collections/testOtherReplicasAreNotActive/leader_elect/shard1/election/73538062262927366-core_node3-n_0000000000
   [junit4]   2> 1375163 INFO  (qtp2114729431-23648) [n:127.0.0.1:40045_solr c:testOtherReplicasAreNotActive s:shard1 r:core_node3 x:testOtherReplicasAreNotActive_shard1_replica_n1 ] o.a.s.c.ShardLeaderElectionContext I am the new leader: https://127.0.0.1:40045/solr/testOtherReplicasAreNotActive_shard1_replica_n1/ shard1
   [junit4]   2> 1375266 INFO  (zkCallback-15321-thread-2) [     ] o.a.s.c.c.ZkStateReader A cluster state change: [WatchedEvent state:SyncConnected type:NodeDataChanged path:/collections/testOtherReplicasAreNotActive/state.json] for collection [testOtherReplicasAreNotActive] has occurred - updating... (live nodes size: [2])
   [junit4]   2> 1375270 INFO  (qtp2114729431-23648) [n:127.0.0.1:40045_solr c:testOtherReplicasAreNotActive s:shard1 r:core_node3 x:testOtherReplicasAreNotActive_shard1_replica_n1 ] o.a.s.c.ZkController I am the leader, no recovery necessary
   [junit4]   2> 1375273 INFO  (qtp2114729431-23648) [n:127.0.0.1:40045_solr     ] o.a.s.s.HttpSolrCall [admin] webapp=null path=/admin/cores params={qt=/admin/cores&coreNodeName=core_node3&collection.configName=config&newCollection=true&name=testOtherReplicasAreNotActive_shard1_replica_n1&action=CREATE&numShards=1&collection=testOtherReplicasAreNotActive&shard=shard1&wt=javabin&version=2&replicaType=NRT} status=0 QTime=690
   [junit4]   2> 1375374 INFO  (zkCallback-15321-thread-2) [     ] o.a.s.c.c.ZkStateReader A cluster state change: [WatchedEvent state:SyncConnected type:NodeDataChanged path:/collections/testOtherReplicasAreNotActive/state.json] for collection [testOtherReplicasAreNotActive] has occurred - updating... (live nodes size: [2])
   [junit4]   2> 1375374 INFO  (zkCallback-15321-thread-1) [     ] o.a.s.c.c.ZkStateReader A cluster state change: [WatchedEvent state:SyncConnected type:NodeDataChanged path:/collections/testOtherReplicasAreNotActive/state.json] for collection [testOtherReplicasAreNotActive] has occurred - updating... (live nodes size: [2])
   [junit4]   2> 1375676 INFO  (qtp1246231586-23638) [n:127.0.0.1:37659_solr     ] o.a.s.s.HttpSolrCall [admin] webapp=null path=/admin/cores params={qt=/admin/cores&coreNodeName=core_node4&collection.configName=config&newCollection=true&name=testOtherReplicasAreNotActive_shard1_replica_n2&action=CREATE&numShards=1&collection=testOtherReplicasAreNotActive&shard=shard1&wt=javabin&version=2&replicaType=NRT} status=0 QTime=1056
   [junit4]   2> 1375680 INFO  (qtp2114729431-23639) [n:127.0.0.1:40045_solr     ] o.a.s.h.a.CollectionsHandler Wait for new collection to be active for at most 45 seconds. Check all shard replicas
   [junit4]   2> 1375775 INFO  (zkCallback-15341-thread-1) [     ] o.a.s.c.c.ZkStateReader A cluster state change: [WatchedEvent state:SyncConnected type:NodeDataChanged path:/collections/testOtherReplicasAreNotActive/state.json] for collection [testOtherReplicasAreNotActive] has occurred - updating... (live nodes size: [2])
   [junit4]   2> 1375775 INFO  (zkCallback-15341-thread-2) [     ] o.a.s.c.c.ZkStateReader A cluster state change: [WatchedEvent state:SyncConnected type:NodeDataChanged path:/collections/testOtherReplicasAreNotActive/state.json] for collection [testOtherReplicasAreNotActive] has occurred - updating... (live nodes size: [2])
   [junit4]   2> 1375776 INFO  (zkCallback-15321-thread-1) [     ] o.a.s.c.c.ZkStateReader A cluster state change: [WatchedEvent state:SyncConnected type:NodeDataChanged path:/collections/testOtherReplicasAreNotActive/state.json] for collection [testOtherReplicasAreNotActive] has occurred - updating... (live nodes size: [2])
   [junit4]   2> 1375776 INFO  (zkCallback-15321-thread-3) [     ] o.a.s.c.c.ZkStateReader A cluster state change: [WatchedEvent state:SyncConnected type:NodeDataChanged path:/collections/testOtherReplicasAreNotActive/state.json] for collection [testOtherReplicasAreNotActive] has occurred - updating... (live nodes size: [2])
   [junit4]   2> 1375777 INFO  (qtp2114729431-23639) [n:127.0.0.1:40045_solr     ] o.a.s.s.HttpSolrCall [admin] webapp=null path=/admin/collections params={collection.configName=config&name=testOtherReplicasAreNotActive&nrtReplicas=2&action=CREATE&numShards=1&wt=javabin&version=2} status=0 QTime=1517
   [junit4]   2> 1375777 INFO  (TEST-LeaderTragicEventTest.testOtherReplicasAreNotActive-seed#[1414658EE7F6B70D]) [     ] o.a.s.c.MiniSolrCloudCluster waitForActiveCollection: testOtherReplicasAreNotActive
   [junit4]   2> 1375781 INFO  (TEST-LeaderTragicEventTest.testOtherReplicasAreNotActive-seed#[1414658EE7F6B70D]) [     ] o.a.s.c.LeaderTragicEventTest Stop jetty node : https://127.0.0.1:37659/solr state:DocCollection(testOtherReplicasAreNotActive//collections/testOtherReplicasAreNotActive/state.json/5 )={
   [junit4]   2>   "pullReplicas":"0",
   [junit4]   2>   "replicationFactor":"2",
   [junit4]   2>   "shards":{"shard1":{
   [junit4]   2>       "range":"80000000-7fffffff",
   [junit4]   2>       "state":"active",
   [junit4]   2>       "replicas":{
   [junit4]   2>         "core_node3":{
   [junit4]   2>           "core":"testOtherReplicasAreNotActive_shard1_replica_n1",
   [junit4]   2>           "node_name":"127.0.0.1:40045_solr",
   [junit4]   2>           "base_url":"https://127.0.0.1:40045/solr",
   [junit4]   2>           "state":"active",
   [junit4]   2>           "type":"NRT",
   [junit4]   2>           "force_set_state":"false",
   [junit4]   2>           "leader":"true"},
   [junit4]   2>         "core_node4":{
   [junit4]   2>           "core":"testOtherReplicasAreNotActive_shard1_replica_n2",
   [junit4]   2>           "node_name":"127.0.0.1:37659_solr",
   [junit4]   2>           "base_url":"https://127.0.0.1:37659/solr",
   [junit4]   2>           "state":"active",
   [junit4]   2>           "type":"NRT",
   [junit4]   2>           "force_set_state":"false"}}}},
   [junit4]   2>   "router":{"name":"compositeId"},
   [junit4]   2>   "maxShardsPerNode":"1",
   [junit4]   2>   "autoAddReplicas":"false",
   [junit4]   2>   "nrtReplicas":"2",
   [junit4]   2>   "tlogReplicas":"0"}
   [junit4]   2> 1375781 INFO  (TEST-LeaderTragicEventTest.testOtherReplicasAreNotActive-seed#[1414658EE7F6B70D]) [     ] o.a.s.c.CoreContainer Shutting down CoreContainer instance=620028622
   [junit4]   2> 1375781 INFO  (TEST-LeaderTragicEventTest.testOtherReplicasAreNotActive-seed#[1414658EE7F6B70D]) [     ] o.a.s.c.ZkController Remove node as live in ZooKeeper:/live_nodes/127.0.0.1:37659_solr
   [junit4]   2> 1375782 INFO  (TEST-LeaderTragicEventTest.testOtherReplicasAreNotActive-seed#[1414658EE7F6B70D]) [     ] o.a.s.c.ZkController Publish this node as DOWN...
   [junit4]   2> 1375782 INFO  (TEST-LeaderTragicEventTest.testOtherReplicasAreNotActive-seed#[1414658EE7F6B70D]) [     ] o.a.s.c.ZkController Publish node=127.0.0.1:37659_solr as DOWN
   [junit4]   2> 1375783 INFO  (coreCloseExecutor-15369-thread-1) [n:127.0.0.1:37659_solr     ] o.a.s.c.SolrCore [testOtherReplicasAreNotActive_shard1_replica_n2]  CLOSING SolrCore org.apache.solr.core.SolrCore@866d9f5
   [junit4]   2> 1375784 INFO  (coreCloseExecutor-15369-thread-1) [n:127.0.0.1:37659_solr     ] o.a.s.m.SolrMetricManager Closing metric reporters for registry=solr.core.testOtherReplicasAreNotActive.shard1.replica_n2 tag=SolrCore@866d9f5
   [junit4]   2> 1375784 INFO  (coreCloseExecutor-15369-thread-1) [n:127.0.0.1:37659_solr     ] o.a.s.m.SolrMetricManager Closing metric reporters for registry=solr.collection.testOtherReplicasAreNotActive.shard1.leader tag=SolrCore@866d9f5
   [junit4]   2> 1375784 INFO  (coreCloseExecutor-15369-thread-1) [n:127.0.0.1:37659_solr     ] o.a.s.u.DirectUpdateHandler2 Committing on IndexWriter.close()  ... SKIPPED (unnecessary).
   [junit4]   2> 1375785 INFO  (TEST-LeaderTragicEventTest.testOtherReplicasAreNotActive-seed#[1414658EE7F6B70D]) [     ] o.a.s.m.SolrMetricManager Closing metric reporters for registry=solr.node tag=null
   [junit4]   2> 1375785 INFO  (TEST-LeaderTragicEventTest.testOtherReplicasAreNotActive-seed#[1414658EE7F6B70D]) [     ] o.a.s.m.SolrMetricManager Closing metric reporters for registry=solr.jvm tag=null
   [junit4]   2> 1375785 INFO  (TEST-LeaderTragicEventTest.testOtherReplicasAreNotActive-seed#[1414658EE7F6B70D]) [     ] o.a.s.m.SolrMetricManager Closing metric reporters for registry=solr.jetty tag=null
   [junit4]   2> 1375785 INFO  (TEST-LeaderTragicEventTest.testOtherReplicasAreNotActive-seed#[1414658EE7F6B70D]) [     ] o.a.s.m.SolrMetricManager Closing metric reporters for registry=solr.cluster tag=null
   [junit4]   2> 1375793 INFO  (zkCallback-15321-thread-3) [     ] o.a.s.c.c.ZkStateReader Updated live nodes from ZooKeeper... (2) -> (1)
   [junit4]   2> 1375793 INFO  (zkCallback-15352-thread-1) [     ] o.a.s.c.c.ZkStateReader Updated live nodes from ZooKeeper... (2) -> (1)
   [junit4]   2> 1375885 INFO  (zkCallback-15321-thread-1) [     ] o.a.s.c.c.ZkStateReader A cluster state change: [WatchedEvent state:SyncConnected type:NodeDataChanged path:/collections/testOtherReplicasAreNotActive/state.json] for collection [testOtherReplicasAreNotActive] has occurred - updating... (live nodes size: [1])
   [junit4]   2> 1375885 INFO  (zkCallback-15321-thread-3) [     ] o.a.s.c.c.ZkStateReader A cluster state change: [WatchedEvent state:SyncConnected type:NodeDataChanged path:/collections/testOtherReplicasAreNotActive/state.json] for collection [testOtherReplicasAreNotActive] has occurred - updating... (live nodes size: [1])
   [junit4]   2> 1375894 INFO  (TEST-LeaderTragicEventTest.testOtherReplicasAreNotActive-seed#[1414658EE7F6B70D]) [     ] o.e.j.s.AbstractConnector Stopped ServerConnector@5bd1121{SSL, (ssl, http/1.1)}{127.0.0.1:0}
   [junit4]   2> 1375895 INFO  (TEST-LeaderTragicEventTest.testOtherReplicasAreNotActive-seed#[1414658EE7F6B70D]) [     ] o.e.j.s.h.ContextHandler Stopped o.e.j.s.ServletContextHandler@84fd6f0{/solr,null,STOPPED}
   [junit4]   2> 1375895 INFO  (TEST-LeaderTragicEventTest.testOtherReplicasAreNotActive-seed#[1414658EE7F6B70D]) [     ] o.e.j.s.session node0 Stopped scavenging
   [junit4]   2> 1375895 INFO  (TEST-LeaderTragicEventTest.testOtherReplicasAreNotActive-seed#[1414658EE7F6B70D]) [     ] o.a.s.c.MiniSolrCloudCluster waitForJettyToStop: 37659
   [junit4]   2> 1375896 INFO  (TEST-LeaderTragicEventTest.testOtherReplicasAreNotActive-seed#[1414658EE7F6B70D]) [     ] o.a.s.c.SolrCloudTestCase waitForState (testOtherReplicasAreNotActive): Timeout waiting for replica get down
   [junit4]   2> 1375900 INFO  (TEST-LeaderTragicEventTest.testOtherReplicasAreNotActive-seed#[1414658EE7F6B70D]) [     ] o.a.s.c.LeaderTragicEventTest Will crash leader : core_node3:{
   [junit4]   2>   "core":"testOtherReplicasAreNotActive_shard1_replica_n1",
   [junit4]   2>   "node_name":"127.0.0.1:40045_solr",
   [junit4]   2>   "base_url":"https://127.0.0.1:40045/solr",
   [junit4]   2>   "state":"active",
   [junit4]   2>   "type":"NRT",
   [junit4]   2>   "force_set_state":"false",
   [junit4]   2>   "leader":"true"}
   [junit4]   2> 1375912 ERROR (qtp2114729431-23639) [n:127.0.0.1:40045_solr c:testOtherReplicasAreNotActive s:shard1 r:core_node3 x:testOtherReplicasAreNotActive_shard1_replica_n1 ] o.a.s.u.SolrIndexWriter Error closing IndexWriter
   [junit4]   2>           => java.lang.IllegalStateException: this writer hit an unrecoverable error; cannot flush
   [junit4]   2> 	at org.apache.lucene.index.IndexWriter.doFlush(IndexWriter.java:3894)
   [junit4]   2> java.lang.IllegalStateException: this writer hit an unrecoverable error; cannot flush
   [junit4]   2> 	at org.apache.lucene.index.IndexWriter.doFlush(IndexWriter.java:3894) ~[java/:?]
   [junit4]   2> 	at org.apache.lucene.index.IndexWriter.flush(IndexWriter.java:3886) ~[java/:?]
   [junit4]   2> 	at org.apache.lucene.index.IndexWriter.shutdown(IndexWriter.java:1235) ~[java/:?]
   [junit4]   2> 	at org.apache.lucene.index.IndexWriter.close(IndexWriter.java:1278) ~[java/:?]
   [junit4]   2> 	at org.apache.solr.update.SolrIndexWriter.close(SolrIndexWriter.java:298) ~[java/:?]
   [junit4]   2> 	at org.apache.solr.update.DefaultSolrCoreState.changeWriter(DefaultSolrCoreState.java:209) ~[java/:?]
   [junit4]   2> 	at org.apache.solr.update.DefaultSolrCoreState.newIndexWriter(DefaultSolrCoreState.java:233) ~[java/:?]
   [junit4]   2> 	at org.apache.solr.core.CoreContainer.checkTragicException(CoreContainer.java:2215) ~[java/:?]
   [junit4]   2> 	at org.apache.solr.handler.RequestHandlerBase.handleRequest(RequestHandlerBase.java:229) ~[java/:?]
   [junit4]   2> 	at org.apache.solr.core.SolrCore.execute(SolrCore.java:2637) ~[java/:?]
   [junit4]   2> 	at org.apache.solr.servlet.HttpSolrCall.execute(HttpSolrCall.java:794) ~[java/:?]
   [junit4]   2> 	at org.apache.solr.servlet.HttpSolrCall.call(HttpSolrCall.java:567) ~[java/:?]
   [junit4]   2> 	at org.apache.solr.servlet.SolrDispatchFilter.doFilter(SolrDispatchFilter.java:427) ~[java/:?]
   [junit4]   2> 	at org.apache.solr.servlet.SolrDispatchFilter.doFilter(SolrDispatchFilter.java:357) ~[java/:?]
   [junit4]   2> 	at org.eclipse.jetty.servlet.FilterHolder.doFilter(FilterHolder.java:193) ~[jetty-servlet-9.4.34.v20201102.jar:9.4.34.v20201102]
   [junit4]   2> 	at org.eclipse.jetty.servlet.ServletHandler$Chain.doFilter(ServletHandler.java:1601) ~[jetty-servlet-9.4.34.v20201102.jar:9.4.34.v20201102]
   [junit4]   2> 	at org.apache.solr.client.solrj.embedded.JettySolrRunner$DebugFilter.doFilter(JettySolrRunner.java:166) ~[java/:?]
   [junit4]   2> 	at org.eclipse.jetty.servlet.FilterHolder.doFilter(FilterHolder.java:193) ~[jetty-servlet-9.4.34.v20201102.jar:9.4.34.v20201102]
   [junit4]   2> 	at org.eclipse.jetty.servlet.ServletHandler$Chain.doFilter(ServletHandler.java:1601) ~[jetty-servlet-9.4.34.v20201102.jar:9.4.34.v20201102]
   [junit4]   2> 	at org.eclipse.jetty.servlet.ServletHandler.doHandle(ServletHandler.java:548) ~[jetty-servlet-9.4.34.v20201102.jar:9.4.34.v20201102]
   [junit4]   2> 	at org.eclipse.jetty.server.handler.ScopedHandler.nextHandle(ScopedHandler.java:233) ~[jetty-server-9.4.34.v20201102.jar:9.4.34.v20201102]
   [junit4]   2> 	at org.eclipse.jetty.server.session.SessionHandler.doHandle(SessionHandler.java:1612) ~[jetty-server-9.4.34.v20201102.jar:9.4.34.v20201102]
   [junit4]   2> 	at org.eclipse.jetty.server.handler.ScopedHandler.nextHandle(ScopedHandler.java:233) ~[jetty-server-9.4.34.v20201102.jar:9.4.34.v20201102]
   [junit4]   2> 	at org.eclipse.jetty.server.handler.ContextHandler.doHandle(ContextHandler.java:1434) ~[jetty-server-9.4.34.v20201102.jar:9.4.34.v20201102]
   [junit4]   2> 	at org.eclipse.jetty.server.handler.ScopedHandler.nextScope(ScopedHandler.java:188) ~[jetty-server-9.4.34.v20201102.jar:9.4.34.v20201102]
   [junit4]   2> 	at org.eclipse.jetty.servlet.ServletHandler.doScope(ServletHandler.java:501) ~[jetty-servlet-9.4.34.v20201102.jar:9.4.34.v20201102]
   [junit4]   2> 	at org.eclipse.jetty.server.session.SessionHandler.doScope(SessionHandler.java:1582) ~[jetty-server-9.4.34.v20201102.jar:9.4.34.v20201102]
   [junit4]   2> 	at org.eclipse.jetty.server.handler.ScopedHandler.nextScope(ScopedHandler.java:186) ~[jetty-server-9.4.34.v20201102.jar:9.4.34.v20201102]
   [junit4]   2> 	at org.eclipse.jetty.server.handler.ContextHandler.doScope(ContextHandler.java:1349) ~[jetty-server-9.4.34.v20201102.jar:9.4.34.v20201102]
   [junit4]   2> 	at org.eclipse.jetty.server.handler.ScopedHandler.handle(ScopedHandler.java:141) ~[jetty-server-9.4.34.v20201102.jar:9.4.34.v20201102]
   [junit4]   2> 	at org.eclipse.jetty.server.handler.HandlerWrapper.handle(HandlerWrapper.java:127) ~[jetty-server-9.4.34.v20201102.jar:9.4.34.v20201102]
   [junit4]   2> 	at org.eclipse.jetty.rewrite.handler.RewriteHandler.handle(RewriteHandler.java:322) ~[jetty-rewrite-9.4.34.v20201102.jar:9.4.34.v20201102]
   [junit4]   2> 	at org.eclipse.jetty.server.handler.gzip.GzipHandler.handle(GzipHandler.java:716) ~[jetty-server-9.4.34.v20201102.jar:9.4.34.v20201102]
   [junit4]   2> 	at org.eclipse.jetty.server.handler.HandlerWrapper.handle(HandlerWrapper.java:127) ~[jetty-server-9.4.34.v20201102.jar:9.4.34.v20201102]
   [junit4]   2> 	at org.eclipse.jetty.server.Server.handle(Server.java:516) ~[jetty-server-9.4.34.v20201102.jar:9.4.34.v20201102]
   [junit4]   2> 	at org.eclipse.jetty.server.HttpChannel.lambda$handle$1(HttpChannel.java:383) ~[jetty-server-9.4.34.v20201102.jar:9.4.34.v20201102]
   [junit4]   2> 	at org.eclipse.jetty.server.HttpChannel.dispatch(HttpChannel.java:556) [jetty-server-9.4.34.v20201102.jar:9.4.34.v20201102]
   [junit4]   2> 	at org.eclipse.jetty.server.HttpChannel.handle(HttpChannel.java:375) [jetty-server-9.4.34.v20201102.jar:9.4.34.v20201102]
   [junit4]   2> 	at org.eclipse.jetty.server.HttpConnection.onFillable(HttpConnection.java:273) [jetty-server-9.4.34.v20201102.jar:9.4.34.v20201102]
   [junit4]   2> 	at org.eclipse.jetty.io.AbstractConnection$ReadCallback.succeeded(AbstractConnection.java:311) [jetty-io-9.4.34.v20201102.jar:9.4.34.v20201102]
   [junit4]   2> 	at org.eclipse.jetty.io.FillInterest.fillable(FillInterest.java:105) [jetty-io-9.4.34.v20201102.jar:9.4.34.v20201102]
   [junit4]   2> 	at org.eclipse.jetty.io.ssl.SslConnection$DecryptedEndPoint.onFillable(SslConnection.java:540) [jetty-io-9.4.34.v20201102.jar:9.4.34.v20201102]
   [junit4]   2> 	at org.eclipse.jetty.io.ssl.SslConnection.onFillable(SslConnection.java:395) [jetty-io-9.4.34.v20201102.jar:9.4.34.v20201102]
   [junit4]   2> 	at org.eclipse.jetty.io.ssl.SslConnection$2.succeeded(SslConnection.java:161) [jetty-io-9.4.34.v20201102.jar:9.4.34.v20201102]
   [junit4]   2> 	at org.eclipse.jetty.io.FillInterest.fillable(FillInterest.java:105) [jetty-io-9.4.34.v20201102.jar:9.4.34.v20201102]
   [junit4]   2> 	at org.eclipse.jetty.io.ChannelEndPoint$1.run(ChannelEndPoint.java:104) [jetty-io-9.4.34.v20201102.jar:9.4.34.v20201102]
   [junit4]   2> 	at org.eclipse.jetty.util.thread.QueuedThreadPool.runJob(QueuedThreadPool.java:773) [jetty-util-9.4.34.v20201102.jar:9.4.34.v20201102]
   [junit4]   2> 	at org.eclipse.jetty.util.thread.QueuedThreadPool$Runner.run(QueuedThreadPool.java:905) [jetty-util-9.4.34.v20201102.jar:9.4.34.v20201102]
   [junit4]   2> 	at java.lang.Thread.run(Thread.java:748) [?:1.8.0_281]
   [junit4]   2> Caused by: java.lang.Exception: injected tragedy
   [junit4]   2> 	at org.apache.solr.util.TestInjection.injectLeaderTragedy(TestInjection.java:364) ~[java/:?]
   [junit4]   2> 	at org.apache.solr.handler.RequestHandlerBase.handleRequest(RequestHandlerBase.java:210) ~[java/:?]
   [junit4]   2> 	... 40 more
   [junit4]   2> 1375914 INFO  (qtp2114729431-23639) [n:127.0.0.1:40045_solr c:testOtherReplicasAreNotActive s:shard1 r:core_node3 x:testOtherReplicasAreNotActive_shard1_replica_n1 ] o.a.s.u.DefaultSolrCoreState New IndexWriter is ready to be used.
   [junit4]   2> 1375915 ERROR (qtp2114729431-23639) [n:127.0.0.1:40045_solr c:testOtherReplicasAreNotActive s:shard1 r:core_node3 x:testOtherReplicasAreNotActive_shard1_replica_n1 ] o.a.s.h.RequestHandlerBase org.apache.solr.common.SolrException: Random tragedy fail
   [junit4]   2> 	at org.apache.solr.util.TestInjection.injectLeaderTragedy(TestInjection.java:374)
   [junit4]   2> 	at org.apache.solr.handler.RequestHandlerBase.handleRequest(RequestHandlerBase.java:210)
   [junit4]   2> 	at org.apache.solr.core.SolrCore.execute(SolrCore.java:2637)
   [junit4]   2> 	at org.apache.solr.servlet.HttpSolrCall.execute(HttpSolrCall.java:794)
   [junit4]   2> 	at org.apache.solr.servlet.HttpSolrCall.call(HttpSolrCall.java:567)
   [junit4]   2> 	at org.apache.solr.servlet.SolrDispatchFilter.doFilter(SolrDispatchFilter.java:427)
   [junit4]   2> 	at org.apache.solr.servlet.SolrDispatchFilter.doFilter(SolrDispatchFilter.java:357)
   [junit4]   2> 	at org.eclipse.jetty.servlet.FilterHolder.doFilter(FilterHolder.java:193)
   [junit4]   2> 	at org.eclipse.jetty.servlet.ServletHandler$Chain.doFilter(ServletHandler.java:1601)
   [junit4]   2> 	at org.apache.solr.client.solrj.embedded.JettySolrRunner$DebugFilter.doFilter(JettySolrRunner.java:166)
   [junit4]   2> 	at org.eclipse.jetty.servlet.FilterHolder.doFilter(FilterHolder.java:193)
   [junit4]   2> 	at org.eclipse.jetty.servlet.ServletHandler$Chain.doFilter(ServletHandler.java:1601)
   [junit4]   2> 	at org.eclipse.jetty.servlet.ServletHandler.doHandle(ServletHandler.java:548)
   [junit4]   2> 	at org.eclipse.jetty.server.handler.ScopedHandler.nextHandle(ScopedHandler.java:233)
   [junit4]   2> 	at org.eclipse.jetty.server.session.SessionHandler.doHandle(SessionHandler.java:1612)
   [junit4]   2> 	at org.eclipse.jetty.server.handler.ScopedHandler.nextHandle(ScopedHandler.java:233)
   [junit4]   2> 	at org.eclipse.jetty.server.handler.ContextHandler.doHandle(ContextHandler.java:1434)
   [junit4]   2> 	at org.eclipse.jetty.server.handler.ScopedHandler.nextScope(ScopedHandler.java:188)
   [junit4]   2> 	at org.eclipse.jetty.servlet.ServletHandler.doScope(ServletHandler.java:501)
   [junit4]   2> 	at org.eclipse.jetty.server.session.SessionHandler.doScope(SessionHandler.java:1582)
   [junit4]   2> 	at org.eclipse.jetty.server.handler.ScopedHandler.nextScope(ScopedHandler.java:186)
   [junit4]   2> 	at org.eclipse.jetty.server.handler.ContextHandler.doScope(ContextHandler.java:1349)
   [junit4]   2> 	at org.eclipse.jetty.server.handler.ScopedHandler.handle(ScopedHandler.java:141)
   [junit4]   2> 	at org.eclipse.jetty.server.handler.HandlerWrapper.handle(HandlerWrapper.java:127)
   [junit4]   2> 	at org.eclipse.jetty.rewrite.handler.RewriteHandler.handle(RewriteHandler.java:322)
   [junit4]   2> 	at org.eclipse.jetty.server.handler.gzip.GzipHandler.handle(GzipHandler.java:716)
   [junit4]   2> 	at org.eclipse.jetty.server.handler.HandlerWrapper.handle(HandlerWrapper.java:127)
   [junit4]   2> 	at org.eclipse.jetty.server.Server.handle(Server.java:516)
   [junit4]   2> 	at org.eclipse.jetty.server.HttpChannel.lambda$handle$1(HttpChannel.java:383)
   [junit4]   2> 	at org.eclipse.jetty.server.HttpChannel.dispatch(HttpChannel.java:556)
   [junit4]   2> 	at org.eclipse.jetty.server.HttpChannel.handle(HttpChannel.java:375)
   [junit4]   2> 	at org.eclipse.jetty.server.HttpConnection.onFillable(HttpConnection.java:273)
   [junit4]   2> 	at org.eclipse.jetty.io.AbstractConnection$ReadCallback.succeeded(AbstractConnection.java:311)
   [junit4]   2> 	at org.eclipse.jetty.io.FillInterest.fillable(FillInterest.java:105)
   [junit4]   2> 	at org.eclipse.jetty.io.ssl.SslConnection$DecryptedEndPoint.onFillable(SslConnection.java:540)
   [junit4]   2> 	at org.eclipse.jetty.io.ssl.SslConnection.onFillable(SslConnection.java:395)
   [junit4]   2> 	at org.eclipse.jetty.io.ssl.SslConnection$2.succeeded(SslConnection.java:161)
   [junit4]   2> 	at org.eclipse.jetty.io.FillInterest.fillable(FillInterest.java:105)
   [junit4]   2> 	at org.eclipse.jetty.io.ChannelEndPoint$1.run(ChannelEndPoint.java:104)
   [junit4]   2> 	at org.eclipse.jetty.util.thread.QueuedThreadPool.runJob(QueuedThreadPool.java:773)
   [junit4]   2> 	at org.eclipse.jetty.util.thread.QueuedThreadPool$Runner.run(QueuedThreadPool.java:905)
   [junit4]   2> 	at java.lang.Thread.run(Thread.java:748)
   [junit4]   2> 
   [junit4]   2> 1375915 INFO  (qtp2114729431-23639) [n:127.0.0.1:40045_solr c:testOtherReplicasAreNotActive s:shard1 r:core_node3 x:testOtherReplicasAreNotActive_shard1_replica_n1 ] o.a.s.c.S.Request [testOtherReplicasAreNotActive_shard1_replica_n1]  webapp=/solr path=/update params={commit=true&wt=javabin&version=2} status=500 QTime=3
   [junit4]   2> 1375915 ERROR (qtp2114729431-23639) [n:127.0.0.1:40045_solr c:testOtherReplicasAreNotActive s:shard1 r:core_node3 x:testOtherReplicasAreNotActive_shard1_replica_n1 ] o.a.s.s.HttpSolrCall org.apache.solr.common.SolrException: Random tragedy fail
   [junit4]   2> 	at org.apache.solr.util.TestInjection.injectLeaderTragedy(TestInjection.java:374)
   [junit4]   2> 	at org.apache.solr.handler.RequestHandlerBase.handleRequest(RequestHandlerBase.java:210)
   [junit4]   2> 	at org.apache.solr.core.SolrCore.execute(SolrCore.java:2637)
   [junit4]   2> 	at org.apache.solr.servlet.HttpSolrCall.execute(HttpSolrCall.java:794)
   [junit4]   2> 	at org.apache.solr.servlet.HttpSolrCall.call(HttpSolrCall.java:567)
   [junit4]   2> 	at org.apache.solr.servlet.SolrDispatchFilter.doFilter(SolrDispatchFilter.java:427)
   [junit4]   2> 	at org.apache.solr.servlet.SolrDispatchFilter.doFilter(SolrDispatchFilter.java:357)
   [junit4]   2> 	at org.eclipse.jetty.servlet.FilterHolder.doFilter(FilterHolder.java:193)
   [junit4]   2> 	at org.eclipse.jetty.servlet.ServletHandler$Chain.doFilter(ServletHandler.java:1601)
   [junit4]   2> 	at org.apache.solr.client.solrj.embedded.JettySolrRunner$DebugFilter.doFilter(JettySolrRunner.java:166)
   [junit4]   2> 	at org.eclipse.jetty.servlet.FilterHolder.doFilter(FilterHolder.java:193)
   [junit4]   2> 	at org.eclipse.jetty.servlet.ServletHandler$Chain.doFilter(ServletHandler.java:1601)
   [junit4]   2> 	at org.eclipse.jetty.servlet.ServletHandler.doHandle(ServletHandler.java:548)
   [junit4]   2> 	at org.eclipse.jetty.server.handler.ScopedHandler.nextHandle(ScopedHandler.java:233)
   [junit4]   2> 	at org.eclipse.jetty.server.session.SessionHandler.doHandle(SessionHandler.java:1612)
   [junit4]   2> 	at org.eclipse.jetty.server.handler.ScopedHandler.nextHandle(ScopedHandler.java:233)
   [junit4]   2> 	at org.eclipse.jetty.server.handler.ContextHandler.doHandle(ContextHandler.java:1434)
   [junit4]   2> 	at org.eclipse.jetty.server.handler.ScopedHandler.nextScope(ScopedHandler.java:188)
   [junit4]   2> 	at org.eclipse.jetty.servlet.ServletHandler.doScope(ServletHandler.java:501)
   [junit4]   2> 	at org.eclipse.jetty.server.session.SessionHandler.doScope(SessionHandler.java:1582)
   [junit4]   2> 	at org.eclipse.jetty.server.handler.ScopedHandler.nextScope(ScopedHandler.java:186)
   [junit4]   2> 	at org.eclipse.jetty.server.handler.ContextHandler.doScope(ContextHandler.java:1349)
   [junit4]   2> 	at org.eclipse.jetty.server.handler.ScopedHandler.handle(ScopedHandler.java:141)
   [junit4]   2> 	at org.eclipse.jetty.server.handler.HandlerWrapper.handle(HandlerWrapper.java:127)
   [junit4]   2> 	at org.eclipse.jetty.rewrite.handler.RewriteHandler.handle(RewriteHandler.java:322)
   [junit4]   2> 	at org.eclipse.jetty.server.handler.gzip.GzipHandler.handle(GzipHandler.java:716)
   [junit4]   2> 	at org.eclipse.jetty.server.handler.HandlerWrapper.handle(HandlerWrapper.java:127)
   [junit4]   2> 	at org.eclipse.jetty.server.Server.handle(Server.java:516)
   [junit4]   2> 	at org.eclipse.jetty.server.HttpChannel.lambda$handle$1(HttpChannel.java:383)
   [junit4]   2> 	at org.eclipse.jetty.server.HttpChannel.dispatch(HttpChannel.java:556)
   [junit4]   2> 	at org.eclipse.jetty.server.HttpChannel.handle(HttpChannel.java:375)
   [junit4]   2> 	at org.eclipse.jetty.server.HttpConnection.onFillable(HttpConnection.java:273)
   [junit4]   2> 	at org.eclipse.jetty.io.AbstractConnection$ReadCallback.succeeded(AbstractConnection.java:311)
   [junit4]   2> 	at org.eclipse.jetty.io.FillInterest.fillable(FillInterest.java:105)
   [junit4]   2> 	at org.eclipse.jetty.io.ssl.SslConnection$DecryptedEndPoint.onFillable(SslConnection.java:540)
   [junit4]   2> 	at org.eclipse.jetty.io.ssl.SslConnection.onFillable(SslConnection.java:395)
   [junit4]   2> 	at org.eclipse.jetty.io.ssl.SslConnection$2.succeeded(SslConnection.java:161)
   [junit4]   2> 	at org.eclipse.jetty.io.FillInterest.fillable(FillInterest.java:105)
   [junit4]   2> 	at org.eclipse.jetty.io.ChannelEndPoint$1.run(ChannelEndPoint.java:104)
   [junit4]   2> 	at org.eclipse.jetty.util.thread.QueuedThreadPool.runJob(QueuedThreadPool.java:773)
   [junit4]   2> 	at org.eclipse.jetty.util.thread.QueuedThreadPool$Runner.run(QueuedThreadPool.java:905)
   [junit4]   2> 	at java.lang.Thread.run(Thread.java:748)
   [junit4]   2> 
   [junit4]   2> 1375924 INFO  (TEST-LeaderTragicEventTest.testOtherReplicasAreNotActive-seed#[1414658EE7F6B70D]) [     ] o.a.s.c.s.e.JettySolrRunner Start Jetty (configured port=0, binding port=37659)
   [junit4]   2> 1375928 INFO  (TEST-LeaderTragicEventTest.testOtherReplicasAreNotActive-seed#[1414658EE7F6B70D]) [     ] o.a.s.c.s.e.JettySolrRunner Trying to start Jetty on port 37659 try number 2 ...
   [junit4]   2> 1375928 INFO  (TEST-LeaderTragicEventTest.testOtherReplicasAreNotActive-seed#[1414658EE7F6B70D]) [     ] o.e.j.s.Server jetty-9.4.34.v20201102; built: 2020-11-02T14:15:39.302Z; git: e46af88704a893fc12cb0e3bf46e2c7b48a009e7; jvm 1.8.0_281-b09
   [junit4]   2> 1375960 INFO  (TEST-LeaderTragicEventTest.testOtherReplicasAreNotActive-seed#[1414658EE7F6B70D]) [     ] o.e.j.s.session DefaultSessionIdManager workerName=node0
   [junit4]   2> 1375960 INFO  (TEST-LeaderTragicEventTest.testOtherReplicasAreNotActive-seed#[1414658EE7F6B70D]) [     ] o.e.j.s.session No SessionScavenger set, using defaults
   [junit4]   2> 1375960 INFO  (TEST-LeaderTragicEventTest.testOtherReplicasAreNotActive-seed#[1414658EE7F6B70D]) [     ] o.e.j.s.session node0 Scavenging every 660000ms
   [junit4]   2> 1375960 INFO  (TEST-LeaderTragicEventTest.testOtherReplicasAreNotActive-seed#[1414658EE7F6B70D]) [     ] o.e.j.s.h.ContextHandler Started o.e.j.s.ServletContextHandler@20fc3908{/solr,null,AVAILABLE}
   [junit4]   2> 1375961 INFO  (TEST-LeaderTragicEventTest.testOtherReplicasAreNotActive-seed#[1414658EE7F6B70D]) [     ] o.e.j.s.AbstractConnector Started ServerConnector@35b3e7eb{SSL, (ssl, http/1.1)}{127.0.0.1:37659}
   [junit4]   2> 1375961 INFO  (TEST-LeaderTragicEventTest.testOtherReplicasAreNotActive-seed#[1414658EE7F6B70D]) [     ] o.e.j.s.Server Started @1375988ms
   [junit4]   2> 1375961 INFO  (TEST-LeaderTragicEventTest.testOtherReplicasAreNotActive-seed#[1414658EE7F6B70D]) [     ] o.a.s.c.s.e.JettySolrRunner Jetty properties: {hostContext=/solr, zkHost=127.0.0.1:34483/solr, hostPort=37659}
   [junit4]   2> 1375961 ERROR (TEST-LeaderTragicEventTest.testOtherReplicasAreNotActive-seed#[1414658EE7F6B70D]) [     ] o.a.s.u.StartupLoggingUtils Missing Java Option solr.log.dir. Logging may be missing or incomplete.
   [junit4]   2> 1375961 INFO  (TEST-LeaderTragicEventTest.testOtherReplicasAreNotActive-seed#[1414658EE7F6B70D]) [     ] o.a.s.s.SolrDispatchFilter Using logger factory org.apache.logging.slf4j.Log4jLoggerFactory
   [junit4]   2> 1375961 INFO  (TEST-LeaderTragicEventTest.testOtherReplicasAreNotActive-seed#[1414658EE7F6B70D]) [     ] o.a.s.s.SolrDispatchFilter  ___      _       Welcome to Apache Solr™ version 8.9.0
   [junit4]   2> 1375961 INFO  (TEST-LeaderTragicEventTest.testOtherReplicasAreNotActive-seed#[1414658EE7F6B70D]) [     ] o.a.s.s.SolrDispatchFilter / __| ___| |_ _   Starting in cloud mode on port null
   [junit4]   2> 1375961 INFO  (TEST-LeaderTragicEventTest.testOtherReplicasAreNotActive-seed#[1414658EE7F6B70D]) [     ] o.a.s.s.SolrDispatchFilter \__ \/ _ \ | '_|  Install dir: /home/jenkins/jenkins-slave/workspace/Lucene/Lucene-Solr-Tests-8.x/solr
   [junit4]   2> 1375961 INFO  (TEST-LeaderTragicEventTest.testOtherReplicasAreNotActive-seed#[1414658EE7F6B70D]) [     ] o.a.s.s.SolrDispatchFilter |___/\___/_|_|    Start time: 2021-05-20T20:52:43.103Z
   [junit4]   2> 1375968 INFO  (TEST-LeaderTragicEventTest.testOtherReplicasAreNotActive-seed#[1414658EE7F6B70D]) [     ] o.a.s.c.c.ConnectionManager Waiting for client to connect to ZooKeeper
   [junit4]   2> 1375975 INFO  (zkConnectionManagerCallback-15373-thread-1) [     ] o.a.s.c.c.ConnectionManager zkClient has connected
   [junit4]   2> 1375975 INFO  (TEST-LeaderTragicEventTest.testOtherReplicasAreNotActive-seed#[1414658EE7F6B70D]) [     ] o.a.s.c.c.ConnectionManager Client is connected to ZooKeeper
   [junit4]   2> 1375975 INFO  (TEST-LeaderTragicEventTest.testOtherReplicasAreNotActive-seed#[1414658EE7F6B70D]) [     ] o.a.s.s.SolrDispatchFilter solr.xml found in ZooKeeper. Loading...
   [junit4]   2> 1375978 INFO  (TEST-LeaderTragicEventTest.testOtherReplicasAreNotActive-seed#[1414658EE7F6B70D]) [     ] o.a.s.c.SolrXmlConfig Metrics collection is disabled.
   [junit4]   2> 1375981 WARN  (TEST-LeaderTragicEventTest.testOtherReplicasAreNotActive-seed#[1414658EE7F6B70D]-SendThread(127.0.0.1:34483)) [     ] o.a.z.ClientCnxn An exception was thrown while closing send thread for session 0x105427a5ea7000a.
   [junit4]   2>           => EndOfStreamException: Unable to read additional data from server sessionid 0x105427a5ea7000a, likely server has closed socket
   [junit4]   2> 	at org.apache.zookeeper.ClientCnxnSocketNIO.doIO(ClientCnxnSocketNIO.java:77)
   [junit4]   2> org.apache.zookeeper.ClientCnxn$EndOfStreamException: Unable to read additional data from server sessionid 0x105427a5ea7000a, likely server has closed socket
   [junit4]   2> 	at org.apache.zookeeper.ClientCnxnSocketNIO.doIO(ClientCnxnSocketNIO.java:77) ~[zookeeper-3.6.2.jar:3.6.2]
   [junit4]   2> 	at org.apache.zookeeper.ClientCnxnSocketNIO.doTransport(ClientCnxnSocketNIO.java:350) ~[zookeeper-3.6.2.jar:3.6.2]
   [junit4]   2> 	at org.apache.zookeeper.ClientCnxn$SendThread.run(ClientCnxn.java:1275) [zookeeper-3.6.2.jar:3.6.2]
   [junit4]   2> 1376264 INFO  (OverseerCollectionConfigSetProcessor-73538062262927366-127.0.0.1:40045_solr-n_0000000000) [n:127.0.0.1:40045_solr     ] o.a.s.c.OverseerTaskQueue Response ZK path: /overseer/collection-queue-work/qnr-0000000000 doesn't exist. Requestor may have disconnected from ZooKeeper
   [junit4]   2> 1376745 INFO  (TEST-LeaderTragicEventTest.testOtherReplicasAreNotActive-seed#[1414658EE7F6B70D]) [     ] o.a.s.h.c.HttpShardHandlerFactory Host whitelist initialized: WhitelistHostChecker [whitelistHosts=null, whitelistHostCheckingEnabled=true]
   [junit4]   2> 1376745 WARN  (TEST-LeaderTragicEventTest.testOtherReplicasAreNotActive-seed#[1414658EE7F6B70D]) [     ] o.a.s.c.s.i.Http2SolrClient Create Http2SolrClient with HTTP/1.1 transport since Java 8 or lower versions does not support SSL + HTTP/2
   [junit4]   2> 1376746 WARN  (TEST-LeaderTragicEventTest.testOtherReplicasAreNotActive-seed#[1414658EE7F6B70D]) [     ] o.e.j.u.s.S.config Trusting all certificates configured for Client@23ed3b6f[provider=null,keyStore=null,trustStore=null]
   [junit4]   2> 1376746 WARN  (TEST-LeaderTragicEventTest.testOtherReplicasAreNotActive-seed#[1414658EE7F6B70D]) [     ] o.e.j.u.s.S.config No Client EndPointIdentificationAlgorithm configured for Client@23ed3b6f[provider=null,keyStore=null,trustStore=null]
   [junit4]   2> 1376748 WARN  (TEST-LeaderTragicEventTest.testOtherReplicasAreNotActive-seed#[1414658EE7F6B70D]) [     ] o.a.s.c.s.i.Http2SolrClient Create Http2SolrClient with HTTP/1.1 transport since Java 8 or lower versions does not support SSL + HTTP/2
   [junit4]   2> 1376749 WARN  (TEST-LeaderTragicEventTest.testOtherReplicasAreNotActive-seed#[1414658EE7F6B70D]) [     ] o.e.j.u.s.S.config Trusting all certificates configured for Client@4e18f8df[provider=null,keyStore=null,trustStore=null]
   [junit4]   2> 1376749 WARN  (TEST-LeaderTragicEventTest.testOtherReplicasAreNotActive-seed#[1414658EE7F6B70D]) [     ] o.e.j.u.s.S.config No Client EndPointIdentificationAlgorithm configured for Client@4e18f8df[provider=null,keyStore=null,trustStore=null]
   [junit4]   2> 1376750 INFO  (TEST-LeaderTragicEventTest.testOtherReplicasAreNotActive-seed#[1414658EE7F6B70D]) [     ] o.a.s.c.ZkContainer Zookeeper client=127.0.0.1:34483/solr
   [junit4]   2> 1376751 INFO  (TEST-LeaderTragicEventTest.testOtherReplicasAreNotActive-seed#[1414658EE7F6B70D]) [     ] o.a.s.c.c.ConnectionManager Waiting for client to connect to ZooKeeper
   [junit4]   2> 1376752 INFO  (zkConnectionManagerCallback-15384-thread-1) [     ] o.a.s.c.c.ConnectionManager zkClient has connected
   [junit4]   2> 1376752 INFO  (TEST-LeaderTragicEventTest.testOtherReplicasAreNotActive-seed#[1414658EE7F6B70D]) [     ] o.a.s.c.c.ConnectionManager Client is connected to ZooKeeper
   [junit4]   2> 1376854 INFO  (TEST-LeaderTragicEventTest.testOtherReplicasAreNotActive-seed#[1414658EE7F6B70D]) [n:127.0.0.1:37659_solr     ] o.a.s.c.c.ConnectionManager Waiting for client to connect to ZooKeeper
   [junit4]   2> 1376855 INFO  (zkConnectionManagerCallback-15386-thread-1) [     ] o.a.s.c.c.ConnectionManager zkClient has connected
   [junit4]   2> 1376855 INFO  (TEST-LeaderTragicEventTest.testOtherReplicasAreNotActive-seed#[1414658EE7F6B70D]) [n:127.0.0.1:37659_solr     ] o.a.s.c.c.ConnectionManager Client is connected to ZooKeeper
   [junit4]   2> 1376859 WARN  (TEST-LeaderTragicEventTest.testOtherReplicasAreNotActive-seed#[1414658EE7F6B70D]) [n:127.0.0.1:37659_solr     ] o.a.s.c.ZkController Contents of zookeeper /security.json are world-readable; consider setting up ACLs as described in https://solr.apache.org/guide/zookeeper-access-control.html
   [junit4]   2> 1376859 INFO  (TEST-LeaderTragicEventTest.testOtherReplicasAreNotActive-seed#[1414658EE7F6B70D]) [n:127.0.0.1:37659_solr     ] o.a.s.c.c.ZkStateReader Updated live nodes from ZooKeeper... (0) -> (1)
   [junit4]   2> 1376863 INFO  (TEST-LeaderTragicEventTest.testOtherReplicasAreNotActive-seed#[1414658EE7F6B70D]) [n:127.0.0.1:37659_solr     ] o.a.s.c.ZkController Publish node=127.0.0.1:37659_solr as DOWN
   [junit4]   2> 1376863 INFO  (TEST-LeaderTragicEventTest.testOtherReplicasAreNotActive-seed#[1414658EE7F6B70D]) [n:127.0.0.1:37659_solr     ] o.a.s.c.TransientSolrCoreCacheDefault Allocating transient cache for 2147483647 transient cores
   [junit4]   2> 1376864 INFO  (TEST-LeaderTragicEventTest.testOtherReplicasAreNotActive-seed#[1414658EE7F6B70D]) [n:127.0.0.1:37659_solr     ] o.a.s.c.ZkController Register node as live in ZooKeeper:/live_nodes/127.0.0.1:37659_solr
   [junit4]   2> 1376865 INFO  (zkCallback-15321-thread-3) [     ] o.a.s.c.c.ZkStateReader Updated live nodes from ZooKeeper... (1) -> (2)
   [junit4]   2> 1376865 INFO  (zkCallback-15352-thread-1) [     ] o.a.s.c.c.ZkStateReader Updated live nodes from ZooKeeper... (1) -> (2)
   [junit4]   2> 1376865 INFO  (zkCallback-15385-thread-1) [     ] o.a.s.c.c.ZkStateReader Updated live nodes from ZooKeeper... (1) -> (2)
   [junit4]   2> 1376866 INFO  (TEST-LeaderTragicEventTest.testOtherReplicasAreNotActive-seed#[1414658EE7F6B70D]) [n:127.0.0.1:37659_solr     ] o.a.s.p.PackageLoader /packages.json updated to version -1
   [junit4]   2> 1376866 WARN  (TEST-LeaderTragicEventTest.testOtherReplicasAreNotActive-seed#[1414658EE7F6B70D]) [n:127.0.0.1:37659_solr     ] o.a.s.c.CoreContainer Not all security plugins configured!  authentication=disabled authorization=disabled.  Solr is only as secure as you make it. Consider configuring authentication/authorization before exposing Solr to users internal or external.  See https://s.apache.org/solrsecurity for more info
   [junit4]   2> 1376893 INFO  (TEST-LeaderTragicEventTest.testOtherReplicasAreNotActive-seed#[1414658EE7F6B70D]) [n:127.0.0.1:37659_solr     ] o.a.s.c.CorePropertiesLocator Found 1 core definitions underneath /home/jenkins/jenkins-slave/workspace/Lucene/Lucene-Solr-Tests-8.x/solr/build/solr-core/test/J2/temp/solr.cloud.LeaderTragicEventTest_1414658EE7F6B70D-001/tempDir-001/node2
   [junit4]   2> 1376893 INFO  (TEST-LeaderTragicEventTest.testOtherReplicasAreNotActive-seed#[1414658EE7F6B70D]) [n:127.0.0.1:37659_solr     ] o.a.s.c.CorePropertiesLocator Cores are: [testOtherReplicasAreNotActive_shard1_replica_n2]
   [junit4]   2> 1376902 INFO  (coreLoadExecutor-15392-thread-1-processing-n:127.0.0.1:37659_solr) [n:127.0.0.1:37659_solr     ] o.a.s.c.SolrConfig Using Lucene MatchVersion: 8.9.0
   [junit4]   2> 1376904 INFO  (coreLoadExecutor-15392-thread-1-processing-n:127.0.0.1:37659_solr) [n:127.0.0.1:37659_solr     ] o.a.s.s.IndexSchema Schema name=minimal
   [junit4]   2> 1376904 INFO  (coreLoadExecutor-15392-thread-1-processing-n:127.0.0.1:37659_solr) [n:127.0.0.1:37659_solr     ] o.a.s.s.IndexSchema Loaded schema minimal/1.1 with uniqueid field id
   [junit4]   2> 1376909 INFO  (coreLoadExecutor-15392-thread-1-processing-n:127.0.0.1:37659_solr) [n:127.0.0.1:37659_solr c:testOtherReplicasAreNotActive s:shard1 r:core_node4 x:testOtherReplicasAreNotActive_shard1_replica_n2 ] o.a.s.c.SolrConfig Using Lucene MatchVersion: 8.9.0
   [junit4]   2> 1376910 INFO  (coreLoadExecutor-15392-thread-1-processing-n:127.0.0.1:37659_solr) [n:127.0.0.1:37659_solr c:testOtherReplicasAreNotActive s:shard1 r:core_node4 x:testOtherReplicasAreNotActive_shard1_replica_n2 ] o.a.s.s.IndexSchema Schema name=minimal
   [junit4]   2> 1376910 INFO  (coreLoadExecutor-15392-thread-1-processing-n:127.0.0.1:37659_solr) [n:127.0.0.1:37659_solr c:testOtherReplicasAreNotActive s:shard1 r:core_node4 x:testOtherReplicasAreNotActive_shard1_replica_n2 ] o.a.s.s.IndexSchema Loaded schema minimal/1.1 with uniqueid field id
   [junit4]   2> 1376910 INFO  (coreLoadExecutor-15392-thread-1-processing-n:127.0.0.1:37659_solr) [n:127.0.0.1:37659_solr c:testOtherReplicasAreNotActive s:shard1 r:core_node4 x:testOtherReplicasAreNotActive_shard1_replica_n2 ] o.a.s.c.CoreContainer Creating SolrCore 'testOtherReplicasAreNotActive_shard1_replica_n2' using configuration from configset config, trusted=true
   [junit4]   2> 1376911 INFO  (coreLoadExecutor-15392-thread-1-processing-n:127.0.0.1:37659_solr) [n:127.0.0.1:37659_solr c:testOtherReplicasAreNotActive s:shard1 r:core_node4 x:testOtherReplicasAreNotActive_shard1_replica_n2 ] o.a.s.c.SolrCore [[testOtherReplicasAreNotActive_shard1_replica_n2] ] Opening new SolrCore at [/home/jenkins/jenkins-slave/workspace/Lucene/Lucene-Solr-Tests-8.x/solr/build/solr-core/test/J2/temp/solr.cloud.LeaderTragicEventTest_1414658EE7F6B70D-001/tempDir-001/node2/testOtherReplicasAreNotActive_shard1_replica_n2], dataDir=[/home/jenkins/jenkins-slave/workspace/Lucene/Lucene-Solr-Tests-8.x/solr/build/solr-core/test/J2/temp/solr.cloud.LeaderTragicEventTest_1414658EE7F6B70D-001/tempDir-001/node2/testOtherReplicasAreNotActive_shard1_replica_n2/data/]
   [junit4]   2> 1376938 INFO  (coreLoadExecutor-15392-thread-1-processing-n:127.0.0.1:37659_solr) [n:127.0.0.1:37659_solr c:testOtherReplicasAreNotActive s:shard1 r:core_node4 x:testOtherReplicasAreNotActive_shard1_replica_n2 ] o.a.s.u.UpdateHandler Using UpdateLog implementation: org.apache.solr.update.UpdateLog
   [junit4]   2> 1376938 INFO  (coreLoadExecutor-15392-thread-1-processing-n:127.0.0.1:37659_solr) [n:127.0.0.1:37659_solr c:testOtherReplicasAreNotActive s:shard1 r:core_node4 x:testOtherReplicasAreNotActive_shard1_replica_n2 ] o.a.s.u.UpdateLog Initializing UpdateLog: dataDir=null defaultSyncLevel=FLUSH numRecordsToKeep=100 maxNumLogsToKeep=10 numVersionBuckets=65536
   [junit4]   2> 1376938 INFO  (coreLoadExecutor-15392-thread-1-processing-n:127.0.0.1:37659_solr) [n:127.0.0.1:37659_solr c:testOtherReplicasAreNotActive s:shard1 r:core_node4 x:testOtherReplicasAreNotActive_shard1_replica_n2 ] o.a.s.u.CommitTracker Hard AutoCommit: disabled
   [junit4]   2> 1376938 INFO  (coreLoadExecutor-15392-thread-1-processing-n:127.0.0.1:37659_solr) [n:127.0.0.1:37659_solr c:testOtherReplicasAreNotActive s:shard1 r:core_node4 x:testOtherReplicasAreNotActive_shard1_replica_n2 ] o.a.s.u.CommitTracker Soft AutoCommit: disabled
   [junit4]   2> 1376939 INFO  (coreLoadExecutor-15392-thread-1-processing-n:127.0.0.1:37659_solr) [n:127.0.0.1:37659_solr c:testOtherReplicasAreNotActive s:shard1 r:core_node4 x:testOtherReplicasAreNotActive_shard1_replica_n2 ] o.a.s.r.ManagedResourceStorage Configured ZooKeeperStorageIO with znodeBase: /configs/config
   [junit4]   2> 1376940 INFO  (coreLoadExecutor-15392-thread-1-processing-n:127.0.0.1:37659_solr) [n:127.0.0.1:37659_solr c:testOtherReplicasAreNotActive s:shard1 r:core_node4 x:testOtherReplicasAreNotActive_shard1_replica_n2 ] o.a.s.r.ManagedResourceStorage Loaded null at path _rest_managed.json using ZooKeeperStorageIO:path=/configs/config
   [junit4]   2> 1376940 INFO  (coreLoadExecutor-15392-thread-1-processing-n:127.0.0.1:37659_solr) [n:127.0.0.1:37659_solr c:testOtherReplicasAreNotActive s:shard1 r:core_node4 x:testOtherReplicasAreNotActive_shard1_replica_n2 ] o.a.s.h.ReplicationHandler Commits will be reserved for 10000 ms
   [junit4]   2> 1376940 INFO  (coreLoadExecutor-15392-thread-1-processing-n:127.0.0.1:37659_solr) [n:127.0.0.1:37659_solr c:testOtherReplicasAreNotActive s:shard1 r:core_node4 x:testOtherReplicasAreNotActive_shard1_replica_n2 ] o.a.s.u.UpdateLog Could not find max version in index or recent updates, using new clock 1700312083681247232
   [junit4]   2> 1376942 INFO  (searcherExecutor-15394-thread-1-processing-n:127.0.0.1:37659_solr x:testOtherReplicasAreNotActive_shard1_replica_n2 c:testOtherReplicasAreNotActive s:shard1 r:core_node4) [n:127.0.0.1:37659_solr c:testOtherReplicasAreNotActive s:shard1 r:core_node4 x:testOtherReplicasAreNotActive_shard1_replica_n2 ] o.a.s.c.SolrCore [testOtherReplicasAreNotActive_shard1_replica_n2]  Registered new searcher autowarm time: 0 ms
   [junit4]   2> 1376942 INFO  (TEST-LeaderTragicEventTest.testOtherReplicasAreNotActive-seed#[1414658EE7F6B70D]) [     ] o.a.s.c.MiniSolrCloudCluster waitForNode: 127.0.0.1:37659_solr
   [junit4]   2> 1376943 INFO  (TEST-LeaderTragicEventTest.testOtherReplicasAreNotActive-seed#[1414658EE7F6B70D]) [     ] o.a.s.SolrTestCaseJ4 ###Ending testOtherReplicasAreNotActive
   [junit4]   2> 1376946 INFO  (coreZkRegister-15374-thread-1-processing-n:127.0.0.1:37659_solr) [n:127.0.0.1:37659_solr c:testOtherReplicasAreNotActive s:shard1 r:core_node4 x:testOtherReplicasAreNotActive_shard1_replica_n2 ] o.a.s.c.ShardLeaderElectionContextBase make sure parent is created /collections/testOtherReplicasAreNotActive/leaders/shard1
   [junit4]   2> 1376956 INFO  (coreZkRegister-15374-thread-1-processing-n:127.0.

[...truncated too long message...]

[junit4]   2> 1387892 INFO  (OverseerAutoScalingTriggerThread-73538062262927366-127.0.0.1:40045_solr-n_0000000000) [     ] o.a.s.c.a.OverseerTriggerThread OverseerTriggerThread woken up but we are closed, exiting.
   [junit4]   2> 1387893 INFO  (closeThreadPool-15415-thread-1) [     ] o.a.s.c.Overseer Overseer (id=73538062262927366-127.0.0.1:40045_solr-n_0000000000) closing
   [junit4]   2> 1387990 WARN  (jetty-launcher-15302-thread-1-SendThread(127.0.0.1:34483)) [     ] o.a.z.ClientCnxn An exception was thrown while closing send thread for session 0x105427a5ea70006.
   [junit4]   2>           => EndOfStreamException: Unable to read additional data from server sessionid 0x105427a5ea70006, likely server has closed socket
   [junit4]   2> 	at org.apache.zookeeper.ClientCnxnSocketNIO.doIO(ClientCnxnSocketNIO.java:77)
   [junit4]   2> org.apache.zookeeper.ClientCnxn$EndOfStreamException: Unable to read additional data from server sessionid 0x105427a5ea70006, likely server has closed socket
   [junit4]   2> 	at org.apache.zookeeper.ClientCnxnSocketNIO.doIO(ClientCnxnSocketNIO.java:77) ~[zookeeper-3.6.2.jar:3.6.2]
   [junit4]   2> 	at org.apache.zookeeper.ClientCnxnSocketNIO.doTransport(ClientCnxnSocketNIO.java:350) ~[zookeeper-3.6.2.jar:3.6.2]
   [junit4]   2> 	at org.apache.zookeeper.ClientCnxn$SendThread.run(ClientCnxn.java:1275) [zookeeper-3.6.2.jar:3.6.2]
   [junit4]   2> 1387990 INFO  (jetty-closer-15405-thread-2) [     ] o.e.j.s.AbstractConnector Stopped ServerConnector@35b3e7eb{SSL, (ssl, http/1.1)}{127.0.0.1:37659}
   [junit4]   2> 1387991 INFO  (jetty-closer-15405-thread-2) [     ] o.e.j.s.h.ContextHandler Stopped o.e.j.s.ServletContextHandler@20fc3908{/solr,null,STOPPED}
   [junit4]   2> 1387991 INFO  (jetty-closer-15405-thread-2) [     ] o.e.j.s.session node0 Stopped scavenging
   [junit4]   2> 1388090 INFO  (jetty-closer-15405-thread-1) [     ] o.a.s.c.Overseer Overseer (id=73538062262927366-127.0.0.1:40045_solr-n_0000000000) closing
   [junit4]   2> 1388091 INFO  (jetty-closer-15405-thread-1) [     ] o.e.j.s.AbstractConnector Stopped ServerConnector@31f6de5d{SSL, (ssl, http/1.1)}{127.0.0.1:0}
   [junit4]   2> 1388092 INFO  (jetty-closer-15405-thread-1) [     ] o.e.j.s.h.ContextHandler Stopped o.e.j.s.ServletContextHandler@6e878945{/solr,null,STOPPED}
   [junit4]   2> 1388092 INFO  (jetty-closer-15405-thread-1) [     ] o.e.j.s.session node0 Stopped scavenging
   [junit4]   2> 1388092 INFO  (SUITE-LeaderTragicEventTest-seed#[1414658EE7F6B70D]-worker) [     ] o.a.s.c.ZkTestServer Shutting down ZkTestServer.
   [junit4]   2> 1388093 WARN  (SUITE-LeaderTragicEventTest-seed#[1414658EE7F6B70D]-worker-SendThread(127.0.0.1:34483)) [     ] o.a.z.ClientCnxn An exception was thrown while closing send thread for session 0x105427a5ea70000.
   [junit4]   2>           => EndOfStreamException: Unable to read additional data from server sessionid 0x105427a5ea70000, likely server has closed socket
   [junit4]   2> 	at org.apache.zookeeper.ClientCnxnSocketNIO.doIO(ClientCnxnSocketNIO.java:77)
   [junit4]   2> org.apache.zookeeper.ClientCnxn$EndOfStreamException: Unable to read additional data from server sessionid 0x105427a5ea70000, likely server has closed socket
   [junit4]   2> 	at org.apache.zookeeper.ClientCnxnSocketNIO.doIO(ClientCnxnSocketNIO.java:77) ~[zookeeper-3.6.2.jar:3.6.2]
   [junit4]   2> 	at org.apache.zookeeper.ClientCnxnSocketNIO.doTransport(ClientCnxnSocketNIO.java:350) ~[zookeeper-3.6.2.jar:3.6.2]
   [junit4]   2> 	at org.apache.zookeeper.ClientCnxn$SendThread.run(ClientCnxn.java:1275) [zookeeper-3.6.2.jar:3.6.2]
   [junit4]   2> 1388295 WARN  (ZkTestServer Run Thread) [     ] o.a.s.c.ZkTestServer Watch limit violations: 
   [junit4]   2> Maximum concurrent create/delete watches above limit:
   [junit4]   2> 
   [junit4]   2> 	9	/solr/collections/testOtherReplicasAreNotActive/terms/shard1
   [junit4]   2> 	8	/solr/collections/testOtherReplicasAreNotActive/state.json
   [junit4]   2> 	4	/solr/aliases.json
   [junit4]   2> 	4	/solr/collections/testLeaderFailsOver/state.json
   [junit4]   2> 	4	/solr/configs/config
   [junit4]   2> 	3	/solr/collections/testLeaderFailsOver/terms/shard1
   [junit4]   2> 	3	/solr/packages.json
   [junit4]   2> 	3	/solr/security.json
   [junit4]   2> 
   [junit4]   2> Maximum concurrent data watches above limit:
   [junit4]   2> 
   [junit4]   2> 	29	/solr/collections/testOtherReplicasAreNotActive/state.json
   [junit4]   2> 	4	/solr/collections/testLeaderFailsOver/state.json
   [junit4]   2> 	4	/solr/clusterstate.json
   [junit4]   2> 	4	/solr/clusterprops.json
   [junit4]   2> 	2	/solr/collections/testOtherReplicasAreNotActive/leader_elect/shard1/election/73538062262927366-core_node3-n_0000000000
   [junit4]   2> 	2	/solr/overseer_elect/election/73538062262927366-127.0.0.1:40045_solr-n_0000000000
   [junit4]   2> 
   [junit4]   2> Maximum concurrent children watches above limit:
   [junit4]   2> 
   [junit4]   2> 	42	/solr/overseer/queue
   [junit4]   2> 	16	/solr/collections
   [junit4]   2> 	15	/solr/overseer/collection-queue-work
   [junit4]   2> 	14	/solr/collections/testOtherReplicasAreNotActive/state.json
   [junit4]   2> 	13	/solr/live_nodes
   [junit4]   2> 	4	/solr/collections/testLeaderFailsOver/state.json
   [junit4]   2> 
   [junit4]   2> 1388297 INFO  (SUITE-LeaderTragicEventTest-seed#[1414658EE7F6B70D]-worker) [     ] o.a.s.c.ZkTestServer waitForServerDown: 127.0.0.1:34483
   [junit4]   2> 1388297 INFO  (SUITE-LeaderTragicEventTest-seed#[1414658EE7F6B70D]-worker) [     ] o.a.s.c.ZkTestServer parse host and port list: 127.0.0.1:34483
   [junit4]   2> 1388297 INFO  (SUITE-LeaderTragicEventTest-seed#[1414658EE7F6B70D]-worker) [     ] o.a.s.c.ZkTestServer connecting to 127.0.0.1 34483
   [junit4]   2> NOTE: leaving temporary files on disk at: /home/jenkins/jenkins-slave/workspace/Lucene/Lucene-Solr-Tests-8.x/solr/build/solr-core/test/J2/temp/solr.cloud.LeaderTragicEventTest_1414658EE7F6B70D-001
   [junit4]   2> NOTE: test params are: codec=Asserting(Lucene87): {}, docValues:{}, maxPointsInLeafNode=1226, maxMBSortInHeap=5.397892031448214, sim=Asserting(RandomSimilarity(queryNorm=false): {}), locale=mk, timezone=Pacific/Johnston
   [junit4]   2> NOTE: Linux 5.4.0-45-generic amd64/Oracle Corporation 1.8.0_281 (64-bit)/cpus=4,threads=1,free=144212864,total=506986496
   [junit4]   2> NOTE: All tests run in this JVM: [TestDocumentBuilder, TestCloudInspectUtil, PreAnalyzedFieldTest, TestExpandComponent, InfixSuggestersTest, TestScoreJoinQPNoScore, SolrCloudExampleTest, NestedAtomicUpdateTest, CdcrVersionReplicationTest, Tagger2Test, CoreAdminCreateDiscoverTest, TestFieldTypeCollectionResource, TestXmlQParserPlugin, FastVectorHighlighterTest, TestExportWriter, TestSolrCoreSnapshots, SearchRateTriggerTest, TestPayloadScoreQParserPlugin, TestNamedUpdateProcessors, SpellingQueryConverterTest, TestSlowCompositeReaderWrapper, SegmentsInfoRequestHandlerTest, TestRandomDVFaceting, TestCustomStream, TestCloudJSONFacetJoinDomain, TestQuerySenderListener, TestFieldCacheSort, AddSchemaFieldsUpdateProcessorFactoryTest, ChaosMonkeyNothingIsSafeWithPullReplicasTest, TestSolrCloudWithKerberosAlt, TriggerEventQueueTest, NodeLostTriggerIntegrationTest, TestPullReplicaWithAuth, TestZkChroot, TestReqParamsAPI, MetricTriggerIntegrationTest, BlockDirectoryTest, VMParamsZkACLAndCredentialsProvidersTest, TestLegacyFieldCache, TestMultiWordSynonyms, TestTermsQParserPlugin, TestConfigsApi, TestSolrIndexConfig, TestRealTimeGet, ClassificationUpdateProcessorFactoryTest, CurrencyFieldTypeTest, UUIDFieldTest, TestSchemaSimilarityResource, MetricsConfigTest, TestTestInjection, SimpleFacetsTest, TestRTGBase, OverseerModifyCollectionTest, URLClassifyProcessorTest, TestExtendedDismaxParser, TestPushWriter, MetricsHandlerTest, TestReloadDeadlock, TestInPlaceUpdatesStandalone, TestSimComputePlanAction, SolrLogPostToolTest, XMLAtomicUpdateMultivalueTest, TransactionLogTest, TestSimUtils, TestDocTermOrds, TestAnalyzedSuggestions, MoveReplicaTest, SolrIndexMetricsTest, CoreMergeIndexesAdminHandlerTest, ClusterStateUpdateTest, TestCryptoKeys, CloudMLTQParserTest, InfoHandlerTest, SolrInfoBeanTest, CursorMarkTest, TestDefaultStatsCache, DistributedSpellCheckComponentTest, SolrRequestParserTest, ZkDynamicConfigTest, CdcrBootstrapTest, CollectionsAPIAsyncDistributedZkTest, TestCSVLoader, XmlUpdateRequestHandlerTest, SolrMetricReporterTest, FieldMutatingUpdateProcessorTest, MigrateRouteKeyTest, SynonymTokenizerTest, DistribJoinFromCollectionTest, IndexSchemaRuntimeFieldTest, JWTIssuerConfigTest, TestComponentsName, PeerSyncReplicationTest, HighlighterWithoutStoredIdTest, TestSortableTextField, TestShortCircuitedRequests, DistributedDebugComponentTest, TestLeaderElectionWithEmptyReplica, TestStressThreadBackup, TestSnapshotCoreBackup, TestNumericRangeQuery64, DistributedMLTComponentTest, SolrJmxReporterTest, ZookeeperReadAPITest, TestSha256AuthenticationProvider, TestFiltering, TestWordDelimiterFilterFactory, ActionThrottleTest, TestDownShardTolerantSearch, TestSolrCloudWithHadoopAuthPlugin, TestLMDirichletSimilarityFactory, DocumentAnalysisRequestHandlerTest, TestSimNodeLostTrigger, TestFuzzyAnalyzedSuggestions, TestJsonFacetRefinement, AnalysisAfterCoreReloadTest, BasicFunctionalityTest, ConvertedLegacyTest, CursorPagingTest, DisMaxRequestHandlerTest, DistributedIntervalFacetingTest, EchoParamsTest, SolrTestCaseJ4Test, TestCrossCoreJoin, TestCursorMarkWithoutUniqueKey, TestDistributedGrouping, TestGroupingSearch, TestSimpleTrackingShardHandler, TestSolrCoreProperties, TestTolerantSearch, TestTrie, PathHierarchyTokenizerFactoryTest, ProtectedTermFilterFactoryTest, TestCharFilters, TestLuceneIndexBackCompat, AssignBackwardCompatibilityTest, ChaosMonkeySafeLeaderTest, CleanupOldIndexTest, CollectionStateFormat2Test, CollectionsAPISolrJTest, HttpPartitionTest, LeaderElectionTest, LeaderTragicEventTest]
   [junit4] Completed [511/939 (1!)] on J2 in 16.76s, 2 tests, 1 error <<< FAILURES!

[...truncated 52294 lines...]

Mime
View raw message