lucene-builds mailing list archives

Site index · List index
Message view « Date » · « Thread »
Top « Date » · « Thread »
From Apache Jenkins Server <jenk...@builds.apache.org>
Subject [JENKINS] Lucene » Lucene-Solr-Tests-8.x - Build # 2294 - Unstable!
Date Tue, 04 May 2021 12:58:14 GMT
Build: https://ci-builds.apache.org/job/Lucene/job/Lucene-Solr-Tests-8.x/2294/

1 tests failed.
FAILED:  org.apache.solr.security.JWTIssuerConfigTest.jwksUrlwithHttpBehaviors

Error Message:
Expected exception SolrException but no exception was thrown

Stack Trace:
junit.framework.AssertionFailedError: Expected exception SolrException but no exception was
thrown
	at __randomizedtesting.SeedInfo.seed([D22B68E69E60D182:BD8F846CB64949C8]:0)
	at org.apache.lucene.util.LuceneTestCase.expectThrows(LuceneTestCase.java:2744)
	at org.apache.lucene.util.LuceneTestCase.expectThrows(LuceneTestCase.java:2734)
	at org.apache.solr.security.JWTIssuerConfigTest.jwksUrlwithHttpBehaviors(JWTIssuerConfigTest.java:145)
	at sun.reflect.NativeMethodAccessorImpl.invoke0(Native Method)
	at sun.reflect.NativeMethodAccessorImpl.invoke(NativeMethodAccessorImpl.java:62)
	at sun.reflect.DelegatingMethodAccessorImpl.invoke(DelegatingMethodAccessorImpl.java:43)
	at java.lang.reflect.Method.invoke(Method.java:498)
	at com.carrotsearch.randomizedtesting.RandomizedRunner.invoke(RandomizedRunner.java:1750)
	at com.carrotsearch.randomizedtesting.RandomizedRunner$8.evaluate(RandomizedRunner.java:938)
	at com.carrotsearch.randomizedtesting.RandomizedRunner$9.evaluate(RandomizedRunner.java:974)
	at com.carrotsearch.randomizedtesting.RandomizedRunner$10.evaluate(RandomizedRunner.java:988)
	at org.apache.lucene.util.TestRuleSetupTeardownChained$1.evaluate(TestRuleSetupTeardownChained.java:49)
	at org.apache.lucene.util.AbstractBeforeAfterRule$1.evaluate(AbstractBeforeAfterRule.java:45)
	at org.apache.lucene.util.TestRuleThreadAndTestName$1.evaluate(TestRuleThreadAndTestName.java:48)
	at org.apache.lucene.util.TestRuleIgnoreAfterMaxFailures$1.evaluate(TestRuleIgnoreAfterMaxFailures.java:64)
	at org.apache.lucene.util.TestRuleMarkFailure$1.evaluate(TestRuleMarkFailure.java:47)
	at org.junit.rules.RunRules.evaluate(RunRules.java:20)
	at com.carrotsearch.randomizedtesting.rules.StatementAdapter.evaluate(StatementAdapter.java:36)
	at com.carrotsearch.randomizedtesting.ThreadLeakControl$StatementRunner.run(ThreadLeakControl.java:368)
	at com.carrotsearch.randomizedtesting.ThreadLeakControl.forkTimeoutingTask(ThreadLeakControl.java:817)
	at com.carrotsearch.randomizedtesting.ThreadLeakControl$3.evaluate(ThreadLeakControl.java:468)
	at com.carrotsearch.randomizedtesting.RandomizedRunner.runSingleTest(RandomizedRunner.java:947)
	at com.carrotsearch.randomizedtesting.RandomizedRunner$5.evaluate(RandomizedRunner.java:832)
	at com.carrotsearch.randomizedtesting.RandomizedRunner$6.evaluate(RandomizedRunner.java:883)
	at com.carrotsearch.randomizedtesting.RandomizedRunner$7.evaluate(RandomizedRunner.java:894)
	at com.carrotsearch.randomizedtesting.rules.StatementAdapter.evaluate(StatementAdapter.java:36)
	at com.carrotsearch.randomizedtesting.rules.SystemPropertiesRestoreRule$1.evaluate(SystemPropertiesRestoreRule.java:57)
	at org.junit.rules.RunRules.evaluate(RunRules.java:20)
	at org.apache.lucene.util.AbstractBeforeAfterRule$1.evaluate(AbstractBeforeAfterRule.java:45)
	at com.carrotsearch.randomizedtesting.rules.StatementAdapter.evaluate(StatementAdapter.java:36)
	at org.apache.lucene.util.TestRuleStoreClassName$1.evaluate(TestRuleStoreClassName.java:41)
	at com.carrotsearch.randomizedtesting.rules.NoShadowingOrOverridesOnMethodsRule$1.evaluate(NoShadowingOrOverridesOnMethodsRule.java:40)
	at com.carrotsearch.randomizedtesting.rules.NoShadowingOrOverridesOnMethodsRule$1.evaluate(NoShadowingOrOverridesOnMethodsRule.java:40)
	at com.carrotsearch.randomizedtesting.rules.StatementAdapter.evaluate(StatementAdapter.java:36)
	at com.carrotsearch.randomizedtesting.rules.StatementAdapter.evaluate(StatementAdapter.java:36)
	at com.carrotsearch.randomizedtesting.rules.StatementAdapter.evaluate(StatementAdapter.java:36)
	at org.apache.lucene.util.TestRuleAssertionsRequired$1.evaluate(TestRuleAssertionsRequired.java:53)
	at org.apache.lucene.util.TestRuleMarkFailure$1.evaluate(TestRuleMarkFailure.java:47)
	at org.apache.lucene.util.TestRuleIgnoreAfterMaxFailures$1.evaluate(TestRuleIgnoreAfterMaxFailures.java:64)
	at org.apache.lucene.util.TestRuleIgnoreTestSuites$1.evaluate(TestRuleIgnoreTestSuites.java:54)
	at org.junit.rules.RunRules.evaluate(RunRules.java:20)
	at com.carrotsearch.randomizedtesting.rules.StatementAdapter.evaluate(StatementAdapter.java:36)
	at com.carrotsearch.randomizedtesting.ThreadLeakControl$StatementRunner.run(ThreadLeakControl.java:368)
	at java.lang.Thread.run(Thread.java:748)




Build Log:
[...truncated 16201 lines...]
   [junit4] Suite: org.apache.solr.security.JWTIssuerConfigTest
   [junit4]   2> 2260423 INFO  (SUITE-JWTIssuerConfigTest-seed#[D22B68E69E60D182]-worker)
[     ] o.a.s.SolrTestCase Setting 'solr.default.confdir' system property to test-framework
derived value of '/home/jenkins/jenkins-slave/workspace/Lucene/Lucene-Solr-Tests-8.x/solr/server/solr/configsets/_default/conf'
   [junit4]   2> NOTE: reproduce with: ant test  -Dtestcase=JWTIssuerConfigTest -Dtests.method=jwksUrlwithHttpBehaviors
-Dtests.seed=D22B68E69E60D182 -Dtests.multiplier=2 -Dtests.slow=true -Dtests.locale=sr-Latn-ME
-Dtests.timezone=Africa/Bamako -Dtests.asserts=true -Dtests.file.encoding=UTF-8
   [junit4] FAILURE 0.01s J1 | JWTIssuerConfigTest.jwksUrlwithHttpBehaviors <<<
   [junit4]    > Throwable #1: junit.framework.AssertionFailedError: Expected exception
SolrException but no exception was thrown
   [junit4]    > 	at __randomizedtesting.SeedInfo.seed([D22B68E69E60D182:BD8F846CB64949C8]:0)
   [junit4]    > 	at org.apache.lucene.util.LuceneTestCase.expectThrows(LuceneTestCase.java:2744)
   [junit4]    > 	at org.apache.lucene.util.LuceneTestCase.expectThrows(LuceneTestCase.java:2734)
   [junit4]    > 	at org.apache.solr.security.JWTIssuerConfigTest.jwksUrlwithHttpBehaviors(JWTIssuerConfigTest.java:145)
   [junit4]    > 	at java.lang.Thread.run(Thread.java:748)
   [junit4]   2> NOTE: test params are: codec=Asserting(Lucene87): {}, docValues:{}, maxPointsInLeafNode=2002,
maxMBSortInHeap=5.325597101442627, sim=Asserting(RandomSimilarity(queryNorm=false): {}), locale=sr-Latn-ME,
timezone=Africa/Bamako
   [junit4]   2> NOTE: Linux 4.15.0-142-generic amd64/Oracle Corporation 1.8.0_281 (64-bit)/cpus=4,threads=1,free=181476864,total=519045120
   [junit4]   2> NOTE: All tests run in this JVM: [CollectionsAPIAsyncDistributedZkTest,
TestLMJelinekMercerSimilarityFactory, DateFieldTest, HighlighterConfigTest, AssignBackwardCompatibilityTest,
TestTrieFacet, TestMaxScoreQueryParser, PeerSyncWithIndexFingerprintCachingTest, SampleTest,
TestStandardQParsers, StatsReloadRaceTest, TestRebalanceLeaders, RoutingToNodesWithPropertiesTest,
TestManagedSynonymFilterFactory, ShardRoutingTest, TestConfigsApi, JWTVerificationkeyResolverTest,
TestPerFieldSimilarityWithDefaultOverride, TestCloudJSONFacetSKG, TestStressThreadBackup,
UpdateLogTest, TestSimNodeLostTrigger, SolrMetricsIntegrationTest, CoreMergeIndexesAdminHandlerTest,
TestImplicitCoreProperties, TestInitQParser, HttpPartitionOnCommitTest, DistanceUnitsTest,
TestPseudoReturnFields, TestReplicaProperties, SolrPluginUtilsTest, TestBackupRepositoryFactory,
TestDocTermOrdsUninvertLimit, ResponseLogComponentTest, LeaderTragicEventTest, TestRawResponseWriter,
TestSolrCoreProperties, TestIndexingPerformance, ProtectedTermFilterFactoryTest, TestReqParamsAPI,
AuditLoggerIntegrationTest, StatsComponentTest, SolrIndexSplitterTest, ConjunctionSolrSpellCheckerTest,
TestFoldingMultitermQuery, MetricTriggerIntegrationTest, CustomHighlightComponentTest, MetricsDisabledCloudTest,
XmlUpdateRequestHandlerTest, TestMiniSolrCloudClusterSSL, TestCloudPseudoReturnFields, TestDistributedSearch,
DistributedIntervalFacetingTest, CustomCollectionTest, PrimitiveFieldTypeTest, TestClusterProperties,
DimensionalRoutedAliasUpdateProcessorTest, TestNumericTerms32, DeleteReplicaTest, TestSolrCoreSnapshots,
BasicFunctionalityTest, MetricsHistoryWithAuthIntegrationTest, ReplicationFactorTest, TestSubQueryTransformerCrossCore,
FuzzySearchTest, DocValuesNotIndexedTest, DocumentBuilderTest, TestBlendedInfixSuggestions,
BooleanFieldTest, DistributedExpandComponentTest, TestSimpleTextCodec, TestSimComputePlanAction,
ZkDynamicConfigTest, TestJsonFacets, AutoScalingHandlerTest, DistribDocExpirationUpdateProcessorTest,
CoreAdminCreateDiscoverTest, TestStressLiveNodes, TestSnapshotCoreBackup, AsyncCallRequestStatusResponseTest,
PingRequestHandlerTest, TestCustomStream, SparseHLLTest, AnalysisErrorHandlingTest, PurgeGraphTest,
FullHLLTest, ResourceLoaderTest, TestPullReplicaErrorHandling, SearchRateTriggerTest, TestHashPartitioner,
TestChildDocTransformer, TestFieldCacheSortRandom, TestSimExtremeIndexing, TestDelegationWithHadoopAuth,
IndexSchemaTest, ScriptEngineTest, TestScoreJoinQPScore, HdfsBasicDistributedZkTest, SchemaVersionSpecificBehaviorTest,
TestConfigSetsAPIZkFailure, TestZkChroot, TestReversedWildcardFilterFactory, PackageManagerCLITest,
SegmentsInfoRequestHandlerTest, ReindexCollectionTest, AggValueSourceTest, SolrCLIZkUtilsTest,
TestAuthorizationFramework, TestCSVLoader, UninvertDocValuesMergePolicyTest, TestPartialUpdateDeduplication,
ClassificationUpdateProcessorIntegrationTest, LeaderFailoverAfterPartitionTest, MoveReplicaHDFSFailoverTest,
MoveReplicaHDFSTest, MoveReplicaTest, OverseerSolrResponseTest, OverseerSolrResponseUnsafeSerializationTest,
OverseerStatusTest, RecoveryZkTest, TestAuthenticationFramework, TestCloudInspectUtil, TestCloudPhrasesIdentificationComponent,
TestConfigSetsAPIShareSchema, TestDistributedMap, TestPullReplica, TestRandomRequestDistribution,
TestSolrCloudWithSecureImpersonation, TestTolerantUpdateProcessorRandomCloud, TestWaitForStateWithJettyShutdowns,
ZkCLITest, TestCollectionsAPIViaSolrCloudCluster, HdfsAutoAddReplicasIntegrationTest, HttpTriggerListenerTest,
NodeAddedTriggerTest, NodeMarkersRegistrationTest, ScheduledMaintenanceTriggerTest, TestSimUtils,
TestSnapshotCloudManager, CdcrOpsAndBoundariesTest, CdcrReplicationHandlerTest, CdcrVersionReplicationTest,
HdfsRecoverLeaseTest, HdfsRecoveryZkTest, HdfsRestartWhileUpdatingTest, HdfsThreadLeakTest,
StressHdfsTest, ZkCollectionPropsCachingTest, ExitableDirectoryReaderTest, PluginInfoTest,
QueryResultKeyTest, TestConfigSetProperties, TestCoreContainer, TestQuerySenderListener, TestQuerySenderNoQuery,
TestSolrIndexConfig, HdfsBackupRepositoryIntegrationTest, TestReplicationHandler, TestJavabinTupleStreamParser,
TestPHPSerializedResponseWriter, TestBulkSchemaAPI, TestCollationField, TestCollationFieldDocValues,
TestManagedSchemaAPI, TestSchemalessBufferedUpdates, TestTextField, UUIDFieldTest, AnalyticsMergeStrategyTest,
MergeStrategyTest, ReturnFieldsTest, SolrIndexSearcherTest, TestAddFieldRealTimeGet, TestCollapseQParserPlugin,
TestComponentsName, TestElisionMultitermQuery, TestFilteredDocIdSet, TestIndexSearcher, TestNoOpRegenerator,
TestOverriddenPrefixQueryForCustomFieldType, TestRTGBase, TestRandomCollapseQParserPlugin,
TestReload, TestReloadDeadlock, TestSearchPerf, TestSearcherReuse, TestSimpleQParserPlugin,
TestSmileRequest, TestSolr4Spatial, TestSolr4Spatial2, TestSolrCachePerf, TestSolrCoreParser,
TestSolrFieldCacheBean, TestSolrJ, TestSolrQueryParser, TestStressUserVersions, TestSurroundQueryParser,
TestXmlQParserPlugin, TestMinMaxOnMultiValuedField, TestOrdValues, TestSortByMinMaxFunction,
DistanceFunctionTest, BlockJoinFacetDistribTest, TestNestedDocsSort, CloudMLTQParserTest,
JWTIssuerConfigTest]
   [junit4] Completed [856/937 (1!)] on J1 in 0.38s, 13 tests, 1 failure <<< FAILURES!

[...truncated 51096 lines...]

Mime
View raw message