lucene-builds mailing list archives

Site index · List index
Message view « Date » · « Thread »
Top « Date » · « Thread »
From Apache Jenkins Server <jenk...@builds.apache.org>
Subject [JENKINS] Lucene » Lucene-Solr-Tests-8.x - Build # 2177 - Unstable!
Date Fri, 23 Apr 2021 00:45:39 GMT
Build: https://ci-builds.apache.org/job/Lucene/job/Lucene-Solr-Tests-8.x/2177/

1 tests failed.
FAILED:  org.apache.solr.util.TestCircuitBreaker.testResponseWithCBTiming

Error Message:
Exception during query

Stack Trace:
java.lang.RuntimeException: Exception during query
	at __randomizedtesting.SeedInfo.seed([EF641B3816BA276F:7B8B6DAE5523D4F]:0)
	at org.apache.solr.SolrTestCaseJ4.assertQ(SolrTestCaseJ4.java:1023)
	at org.apache.solr.SolrTestCaseJ4.assertQ(SolrTestCaseJ4.java:983)
	at org.apache.solr.util.TestCircuitBreaker.testResponseWithCBTiming(TestCircuitBreaker.java:245)
	at sun.reflect.NativeMethodAccessorImpl.invoke0(Native Method)
	at sun.reflect.NativeMethodAccessorImpl.invoke(NativeMethodAccessorImpl.java:62)
	at sun.reflect.DelegatingMethodAccessorImpl.invoke(DelegatingMethodAccessorImpl.java:43)
	at java.lang.reflect.Method.invoke(Method.java:498)
	at com.carrotsearch.randomizedtesting.RandomizedRunner.invoke(RandomizedRunner.java:1750)
	at com.carrotsearch.randomizedtesting.RandomizedRunner$8.evaluate(RandomizedRunner.java:938)
	at com.carrotsearch.randomizedtesting.RandomizedRunner$9.evaluate(RandomizedRunner.java:974)
	at com.carrotsearch.randomizedtesting.RandomizedRunner$10.evaluate(RandomizedRunner.java:988)
	at com.carrotsearch.randomizedtesting.rules.SystemPropertiesRestoreRule$1.evaluate(SystemPropertiesRestoreRule.java:57)
	at org.junit.rules.RunRules.evaluate(RunRules.java:20)
	at org.apache.lucene.util.TestRuleSetupTeardownChained$1.evaluate(TestRuleSetupTeardownChained.java:49)
	at org.apache.lucene.util.AbstractBeforeAfterRule$1.evaluate(AbstractBeforeAfterRule.java:45)
	at org.apache.lucene.util.TestRuleThreadAndTestName$1.evaluate(TestRuleThreadAndTestName.java:48)
	at org.apache.lucene.util.TestRuleIgnoreAfterMaxFailures$1.evaluate(TestRuleIgnoreAfterMaxFailures.java:64)
	at org.apache.lucene.util.TestRuleMarkFailure$1.evaluate(TestRuleMarkFailure.java:47)
	at org.junit.rules.RunRules.evaluate(RunRules.java:20)
	at com.carrotsearch.randomizedtesting.rules.StatementAdapter.evaluate(StatementAdapter.java:36)
	at com.carrotsearch.randomizedtesting.ThreadLeakControl$StatementRunner.run(ThreadLeakControl.java:368)
	at com.carrotsearch.randomizedtesting.ThreadLeakControl.forkTimeoutingTask(ThreadLeakControl.java:817)
	at com.carrotsearch.randomizedtesting.ThreadLeakControl$3.evaluate(ThreadLeakControl.java:468)
	at com.carrotsearch.randomizedtesting.RandomizedRunner.runSingleTest(RandomizedRunner.java:947)
	at com.carrotsearch.randomizedtesting.RandomizedRunner$5.evaluate(RandomizedRunner.java:832)
	at com.carrotsearch.randomizedtesting.RandomizedRunner$6.evaluate(RandomizedRunner.java:883)
	at com.carrotsearch.randomizedtesting.RandomizedRunner$7.evaluate(RandomizedRunner.java:894)
	at com.carrotsearch.randomizedtesting.rules.StatementAdapter.evaluate(StatementAdapter.java:36)
	at com.carrotsearch.randomizedtesting.rules.SystemPropertiesRestoreRule$1.evaluate(SystemPropertiesRestoreRule.java:57)
	at org.junit.rules.RunRules.evaluate(RunRules.java:20)
	at org.apache.lucene.util.AbstractBeforeAfterRule$1.evaluate(AbstractBeforeAfterRule.java:45)
	at com.carrotsearch.randomizedtesting.rules.StatementAdapter.evaluate(StatementAdapter.java:36)
	at org.apache.lucene.util.TestRuleStoreClassName$1.evaluate(TestRuleStoreClassName.java:41)
	at com.carrotsearch.randomizedtesting.rules.NoShadowingOrOverridesOnMethodsRule$1.evaluate(NoShadowingOrOverridesOnMethodsRule.java:40)
	at com.carrotsearch.randomizedtesting.rules.NoShadowingOrOverridesOnMethodsRule$1.evaluate(NoShadowingOrOverridesOnMethodsRule.java:40)
	at com.carrotsearch.randomizedtesting.rules.StatementAdapter.evaluate(StatementAdapter.java:36)
	at com.carrotsearch.randomizedtesting.rules.StatementAdapter.evaluate(StatementAdapter.java:36)
	at com.carrotsearch.randomizedtesting.rules.StatementAdapter.evaluate(StatementAdapter.java:36)
	at org.apache.lucene.util.TestRuleAssertionsRequired$1.evaluate(TestRuleAssertionsRequired.java:53)
	at org.apache.lucene.util.TestRuleMarkFailure$1.evaluate(TestRuleMarkFailure.java:47)
	at org.apache.lucene.util.TestRuleIgnoreAfterMaxFailures$1.evaluate(TestRuleIgnoreAfterMaxFailures.java:64)
	at org.apache.lucene.util.TestRuleIgnoreTestSuites$1.evaluate(TestRuleIgnoreTestSuites.java:54)
	at org.junit.rules.RunRules.evaluate(RunRules.java:20)
	at com.carrotsearch.randomizedtesting.rules.StatementAdapter.evaluate(StatementAdapter.java:36)
	at com.carrotsearch.randomizedtesting.ThreadLeakControl$StatementRunner.run(ThreadLeakControl.java:368)
	at java.lang.Thread.run(Thread.java:748)
Caused by: org.apache.solr.common.SolrException: Circuit Breakers tripped Memory Circuit Breaker triggered as JVM heap usage values are greater than allocated threshold.Seen JVM heap memory usage 394382672 and allocated threshold 392822784

	at org.apache.solr.handler.component.SearchHandler.handleRequestBody(SearchHandler.java:322)
	at org.apache.solr.handler.RequestHandlerBase.handleRequest(RequestHandlerBase.java:216)
	at org.apache.solr.core.SolrCore.execute(SolrCore.java:2637)
	at org.apache.solr.util.TestHarness.query(TestHarness.java:346)
	at org.apache.solr.util.TestHarness.query(TestHarness.java:328)
	at org.apache.solr.SolrTestCaseJ4.assertQ(SolrTestCaseJ4.java:997)
	... 45 more




Build Log:
[...truncated 14926 lines...]
   [junit4] Suite: org.apache.solr.util.TestCircuitBreaker
   [junit4]   2> 1278222 INFO  (SUITE-TestCircuitBreaker-seed#[EF641B3816BA276F]-worker) [     ] o.a.s.SolrTestCase Setting 'solr.default.confdir' system property to test-framework derived value of '/home/jenkins/jenkins-slave/workspace/Lucene/Lucene-Solr-Tests-8.x/solr/server/solr/configsets/_default/conf'
   [junit4]   2> 1278223 INFO  (SUITE-TestCircuitBreaker-seed#[EF641B3816BA276F]-worker) [     ] o.a.s.SolrTestCaseJ4 Created dataDir: /home/jenkins/jenkins-slave/workspace/Lucene/Lucene-Solr-Tests-8.x/solr/build/solr-core/test/J1/temp/solr.util.TestCircuitBreaker_EF641B3816BA276F-001/data-dir-104-001
   [junit4]   2> 1278223 WARN  (SUITE-TestCircuitBreaker-seed#[EF641B3816BA276F]-worker) [     ] o.a.s.SolrTestCaseJ4 startTrackingSearchers: numOpens=1 numCloses=1
   [junit4]   2> 1278223 INFO  (SUITE-TestCircuitBreaker-seed#[EF641B3816BA276F]-worker) [     ] o.a.s.SolrTestCaseJ4 Using PointFields (NUMERIC_POINTS_SYSPROP=true) w/NUMERIC_DOCVALUES_SYSPROP=false
   [junit4]   2> 1278224 INFO  (SUITE-TestCircuitBreaker-seed#[EF641B3816BA276F]-worker) [     ] o.a.s.SolrTestCaseJ4 Randomized ssl (false) and clientAuth (false) via: @org.apache.solr.util.RandomizeSSL(reason=, ssl=NaN, value=NaN, clientAuth=NaN)
   [junit4]   2> 1278224 INFO  (SUITE-TestCircuitBreaker-seed#[EF641B3816BA276F]-worker) [     ] o.a.s.SolrTestCaseJ4 SecureRandom sanity checks: test.solr.allowed.securerandom=null & java.security.egd=file:/dev/./urandom
   [junit4]   2> 1278225 INFO  (SUITE-TestCircuitBreaker-seed#[EF641B3816BA276F]-worker) [     ] o.a.s.SolrTestCaseJ4 ####initCore
   [junit4]   2> 1278229 INFO  (SUITE-TestCircuitBreaker-seed#[EF641B3816BA276F]-worker) [     ] o.a.s.c.SolrResourceLoader Added 2 libs to classloader, from paths: [/home/jenkins/jenkins-slave/workspace/Lucene/Lucene-Solr-Tests-8.x/solr/core/src/test-files/solr/collection1/lib, /home/jenkins/jenkins-slave/workspace/Lucene/Lucene-Solr-Tests-8.x/solr/core/src/test-files/solr/collection1/lib/classes]
   [junit4]   2> 1278242 INFO  (SUITE-TestCircuitBreaker-seed#[EF641B3816BA276F]-worker) [     ] o.a.s.c.SolrConfig Using Lucene MatchVersion: 8.9.0
   [junit4]   2> 1278251 INFO  (SUITE-TestCircuitBreaker-seed#[EF641B3816BA276F]-worker) [     ] o.a.s.s.IndexSchema Schema name=test
   [junit4]   2> 1278257 INFO  (SUITE-TestCircuitBreaker-seed#[EF641B3816BA276F]-worker) [     ] o.a.s.s.IndexSchema Loaded schema test/1.0 with uniqueid field id
   [junit4]   2> 1279288 WARN  (SUITE-TestCircuitBreaker-seed#[EF641B3816BA276F]-worker) [     ] o.a.s.c.CoreContainer Unable to create [/home/jenkins/jenkins-slave/workspace/Lucene/Lucene-Solr-Tests-8.x/solr/core/src/test-files/solr/userfiles].  Features requiring this directory may fail.
   [junit4]   2>           => java.security.AccessControlException: access denied ("java.io.FilePermission" "/home/jenkins/jenkins-slave/workspace/Lucene/Lucene-Solr-Tests-8.x/solr/core/src/test-files/solr/userfiles" "write")
   [junit4]   2> 	at java.security.AccessControlContext.checkPermission(AccessControlContext.java:472)
   [junit4]   2> java.security.AccessControlException: access denied ("java.io.FilePermission" "/home/jenkins/jenkins-slave/workspace/Lucene/Lucene-Solr-Tests-8.x/solr/core/src/test-files/solr/userfiles" "write")
   [junit4]   2> 	at java.security.AccessControlContext.checkPermission(AccessControlContext.java:472) ~[?:1.8.0_281]
   [junit4]   2> 	at java.security.AccessController.checkPermission(AccessController.java:886) ~[?:1.8.0_281]
   [junit4]   2> 	at java.lang.SecurityManager.checkPermission(SecurityManager.java:549) ~[?:1.8.0_281]
   [junit4]   2> 	at java.lang.SecurityManager.checkWrite(SecurityManager.java:979) ~[?:1.8.0_281]
   [junit4]   2> 	at sun.nio.fs.UnixPath.checkWrite(UnixPath.java:801) ~[?:?]
   [junit4]   2> 	at sun.nio.fs.UnixFileSystemProvider.createDirectory(UnixFileSystemProvider.java:376) ~[?:?]
   [junit4]   2> 	at java.nio.file.Files.createDirectory(Files.java:674) ~[?:1.8.0_281]
   [junit4]   2> 	at java.nio.file.Files.createAndCheckIsDirectory(Files.java:781) ~[?:1.8.0_281]
   [junit4]   2> 	at java.nio.file.Files.createDirectories(Files.java:727) ~[?:1.8.0_281]
   [junit4]   2> 	at org.apache.solr.core.CoreContainer.<init>(CoreContainer.java:377) [java/:?]
   [junit4]   2> 	at org.apache.solr.core.CoreContainer.<init>(CoreContainer.java:342) [java/:?]
   [junit4]   2> 	at org.apache.solr.util.TestHarness.<init>(TestHarness.java:183) [java/:?]
   [junit4]   2> 	at org.apache.solr.util.TestHarness.<init>(TestHarness.java:156) [java/:?]
   [junit4]   2> 	at org.apache.solr.util.TestHarness.<init>(TestHarness.java:162) [java/:?]
   [junit4]   2> 	at org.apache.solr.util.TestHarness.<init>(TestHarness.java:112) [java/:?]
   [junit4]   2> 	at org.apache.solr.SolrTestCaseJ4.createCore(SolrTestCaseJ4.java:812) [java/:?]
   [junit4]   2> 	at org.apache.solr.SolrTestCaseJ4.initCore(SolrTestCaseJ4.java:802) [java/:?]
   [junit4]   2> 	at org.apache.solr.SolrTestCaseJ4.initCore(SolrTestCaseJ4.java:663) [java/:?]
   [junit4]   2> 	at org.apache.solr.SolrTestCaseJ4.initCore(SolrTestCaseJ4.java:652) [java/:?]
   [junit4]   2> 	at org.apache.solr.util.TestCircuitBreaker.setUpClass(TestCircuitBreaker.java:61) [test/:?]
   [junit4]   2> 	at sun.reflect.NativeMethodAccessorImpl.invoke0(Native Method) ~[?:1.8.0_281]
   [junit4]   2> 	at sun.reflect.NativeMethodAccessorImpl.invoke(NativeMethodAccessorImpl.java:62) ~[?:1.8.0_281]
   [junit4]   2> 	at sun.reflect.DelegatingMethodAccessorImpl.invoke(DelegatingMethodAccessorImpl.java:43) ~[?:1.8.0_281]
   [junit4]   2> 	at java.lang.reflect.Method.invoke(Method.java:498) ~[?:1.8.0_281]
   [junit4]   2> 	at com.carrotsearch.randomizedtesting.RandomizedRunner.invoke(RandomizedRunner.java:1750) [randomizedtesting-runner-2.7.2.jar:?]
   [junit4]   2> 	at com.carrotsearch.randomizedtesting.RandomizedRunner$6.evaluate(RandomizedRunner.java:878) [randomizedtesting-runner-2.7.2.jar:?]
   [junit4]   2> 	at com.carrotsearch.randomizedtesting.RandomizedRunner$7.evaluate(RandomizedRunner.java:894) [randomizedtesting-runner-2.7.2.jar:?]
   [junit4]   2> 	at com.carrotsearch.randomizedtesting.rules.StatementAdapter.evaluate(StatementAdapter.java:36) [randomizedtesting-runner-2.7.2.jar:?]
   [junit4]   2> 	at com.carrotsearch.randomizedtesting.rules.SystemPropertiesRestoreRule$1.evaluate(SystemPropertiesRestoreRule.java:57) [randomizedtesting-runner-2.7.2.jar:?]
   [junit4]   2> 	at org.junit.rules.RunRules.evaluate(RunRules.java:20) [junit-4.13.1.jar:4.13.1]
   [junit4]   2> 	at org.apache.lucene.util.AbstractBeforeAfterRule$1.evaluate(AbstractBeforeAfterRule.java:45) [java/:?]
   [junit4]   2> 	at com.carrotsearch.randomizedtesting.rules.StatementAdapter.evaluate(StatementAdapter.java:36) [randomizedtesting-runner-2.7.2.jar:?]
   [junit4]   2> 	at org.apache.lucene.util.TestRuleStoreClassName$1.evaluate(TestRuleStoreClassName.java:41) [java/:?]
   [junit4]   2> 	at com.carrotsearch.randomizedtesting.rules.NoShadowingOrOverridesOnMethodsRule$1.evaluate(NoShadowingOrOverridesOnMethodsRule.java:40) [randomizedtesting-runner-2.7.2.jar:?]
   [junit4]   2> 	at com.carrotsearch.randomizedtesting.rules.NoShadowingOrOverridesOnMethodsRule$1.evaluate(NoShadowingOrOverridesOnMethodsRule.java:40) [randomizedtesting-runner-2.7.2.jar:?]
   [junit4]   2> 	at com.carrotsearch.randomizedtesting.rules.StatementAdapter.evaluate(StatementAdapter.java:36) [randomizedtesting-runner-2.7.2.jar:?]
   [junit4]   2> 	at com.carrotsearch.randomizedtesting.rules.StatementAdapter.evaluate(StatementAdapter.java:36) [randomizedtesting-runner-2.7.2.jar:?]
   [junit4]   2> 	at com.carrotsearch.randomizedtesting.rules.StatementAdapter.evaluate(StatementAdapter.java:36) [randomizedtesting-runner-2.7.2.jar:?]
   [junit4]   2> 	at org.apache.lucene.util.TestRuleAssertionsRequired$1.evaluate(TestRuleAssertionsRequired.java:53) [java/:?]
   [junit4]   2> 	at org.apache.lucene.util.TestRuleMarkFailure$1.evaluate(TestRuleMarkFailure.java:47) [java/:?]
   [junit4]   2> 	at org.apache.lucene.util.TestRuleIgnoreAfterMaxFailures$1.evaluate(TestRuleIgnoreAfterMaxFailures.java:64) [java/:?]
   [junit4]   2> 	at org.apache.lucene.util.TestRuleIgnoreTestSuites$1.evaluate(TestRuleIgnoreTestSuites.java:54) [java/:?]
   [junit4]   2> 	at org.junit.rules.RunRules.evaluate(RunRules.java:20) [junit-4.13.1.jar:4.13.1]
   [junit4]   2> 	at com.carrotsearch.randomizedtesting.rules.StatementAdapter.evaluate(StatementAdapter.java:36) [randomizedtesting-runner-2.7.2.jar:?]
   [junit4]   2> 	at com.carrotsearch.randomizedtesting.ThreadLeakControl$StatementRunner.run(ThreadLeakControl.java:368) [randomizedtesting-runner-2.7.2.jar:?]
   [junit4]   2> 	at java.lang.Thread.run(Thread.java:748) [?:1.8.0_281]
   [junit4]   2> 1279289 WARN  (SUITE-TestCircuitBreaker-seed#[EF641B3816BA276F]-worker) [     ] o.a.s.f.DistribPackageStore Unable to create [/home/jenkins/jenkins-slave/workspace/Lucene/Lucene-Solr-Tests-8.x/solr/core/src/test-files/solr/filestore] directory in SOLR_HOME [/home/jenkins/jenkins-slave/workspace/Lucene/Lucene-Solr-Tests-8.x/solr/core/src/test-files/solr].  Features requiring this directory may fail.
   [junit4]   2>           => java.security.AccessControlException: access denied ("java.io.FilePermission" "/home/jenkins/jenkins-slave/workspace/Lucene/Lucene-Solr-Tests-8.x/solr/core/src/test-files/solr/filestore" "write")
   [junit4]   2> 	at java.security.AccessControlContext.checkPermission(AccessControlContext.java:472)
   [junit4]   2> java.security.AccessControlException: access denied ("java.io.FilePermission" "/home/jenkins/jenkins-slave/workspace/Lucene/Lucene-Solr-Tests-8.x/solr/core/src/test-files/solr/filestore" "write")
   [junit4]   2> 	at java.security.AccessControlContext.checkPermission(AccessControlContext.java:472) ~[?:1.8.0_281]
   [junit4]   2> 	at java.security.AccessController.checkPermission(AccessController.java:886) ~[?:1.8.0_281]
   [junit4]   2> 	at java.lang.SecurityManager.checkPermission(SecurityManager.java:549) ~[?:1.8.0_281]
   [junit4]   2> 	at java.lang.SecurityManager.checkWrite(SecurityManager.java:979) ~[?:1.8.0_281]
   [junit4]   2> 	at java.io.File.mkdir(File.java:1311) ~[?:1.8.0_281]
   [junit4]   2> 	at java.io.File.mkdirs(File.java:1343) ~[?:1.8.0_281]
   [junit4]   2> 	at org.apache.solr.filestore.DistribPackageStore.ensurePackageStoreDir(DistribPackageStore.java:561) [java/:?]
   [junit4]   2> 	at org.apache.solr.filestore.DistribPackageStore.<init>(DistribPackageStore.java:81) [java/:?]
   [junit4]   2> 	at org.apache.solr.filestore.PackageStoreAPI.<init>(PackageStoreAPI.java:78) [java/:?]
   [junit4]   2> 	at org.apache.solr.core.CoreContainer.load(CoreContainer.java:678) [java/:?]
   [junit4]   2> 	at org.apache.solr.util.TestHarness.<init>(TestHarness.java:184) [java/:?]
   [junit4]   2> 	at org.apache.solr.util.TestHarness.<init>(TestHarness.java:156) [java/:?]
   [junit4]   2> 	at org.apache.solr.util.TestHarness.<init>(TestHarness.java:162) [java/:?]
   [junit4]   2> 	at org.apache.solr.util.TestHarness.<init>(TestHarness.java:112) [java/:?]
   [junit4]   2> 	at org.apache.solr.SolrTestCaseJ4.createCore(SolrTestCaseJ4.java:812) [java/:?]
   [junit4]   2> 	at org.apache.solr.SolrTestCaseJ4.initCore(SolrTestCaseJ4.java:802) [java/:?]
   [junit4]   2> 	at org.apache.solr.SolrTestCaseJ4.initCore(SolrTestCaseJ4.java:663) [java/:?]
   [junit4]   2> 	at org.apache.solr.SolrTestCaseJ4.initCore(SolrTestCaseJ4.java:652) [java/:?]
   [junit4]   2> 	at org.apache.solr.util.TestCircuitBreaker.setUpClass(TestCircuitBreaker.java:61) [test/:?]
   [junit4]   2> 	at sun.reflect.NativeMethodAccessorImpl.invoke0(Native Method) ~[?:1.8.0_281]
   [junit4]   2> 	at sun.reflect.NativeMethodAccessorImpl.invoke(NativeMethodAccessorImpl.java:62) ~[?:1.8.0_281]
   [junit4]   2> 	at sun.reflect.DelegatingMethodAccessorImpl.invoke(DelegatingMethodAccessorImpl.java:43) ~[?:1.8.0_281]
   [junit4]   2> 	at java.lang.reflect.Method.invoke(Method.java:498) ~[?:1.8.0_281]
   [junit4]   2> 	at com.carrotsearch.randomizedtesting.RandomizedRunner.invoke(RandomizedRunner.java:1750) [randomizedtesting-runner-2.7.2.jar:?]
   [junit4]   2> 	at com.carrotsearch.randomizedtesting.RandomizedRunner$6.evaluate(RandomizedRunner.java:878) [randomizedtesting-runner-2.7.2.jar:?]
   [junit4]   2> 	at com.carrotsearch.randomizedtesting.RandomizedRunner$7.evaluate(RandomizedRunner.java:894) [randomizedtesting-runner-2.7.2.jar:?]
   [junit4]   2> 	at com.carrotsearch.randomizedtesting.rules.StatementAdapter.evaluate(StatementAdapter.java:36) [randomizedtesting-runner-2.7.2.jar:?]
   [junit4]   2> 	at com.carrotsearch.randomizedtesting.rules.SystemPropertiesRestoreRule$1.evaluate(SystemPropertiesRestoreRule.java:57) [randomizedtesting-runner-2.7.2.jar:?]
   [junit4]   2> 	at org.junit.rules.RunRules.evaluate(RunRules.java:20) [junit-4.13.1.jar:4.13.1]
   [junit4]   2> 	at org.apache.lucene.util.AbstractBeforeAfterRule$1.evaluate(AbstractBeforeAfterRule.java:45) [java/:?]
   [junit4]   2> 	at com.carrotsearch.randomizedtesting.rules.StatementAdapter.evaluate(StatementAdapter.java:36) [randomizedtesting-runner-2.7.2.jar:?]
   [junit4]   2> 	at org.apache.lucene.util.TestRuleStoreClassName$1.evaluate(TestRuleStoreClassName.java:41) [java/:?]
   [junit4]   2> 	at com.carrotsearch.randomizedtesting.rules.NoShadowingOrOverridesOnMethodsRule$1.evaluate(NoShadowingOrOverridesOnMethodsRule.java:40) [randomizedtesting-runner-2.7.2.jar:?]
   [junit4]   2> 	at com.carrotsearch.randomizedtesting.rules.NoShadowingOrOverridesOnMethodsRule$1.evaluate(NoShadowingOrOverridesOnMethodsRule.java:40) [randomizedtesting-runner-2.7.2.jar:?]
   [junit4]   2> 	at com.carrotsearch.randomizedtesting.rules.StatementAdapter.evaluate(StatementAdapter.java:36) [randomizedtesting-runner-2.7.2.jar:?]
   [junit4]   2> 	at com.carrotsearch.randomizedtesting.rules.StatementAdapter.evaluate(StatementAdapter.java:36) [randomizedtesting-runner-2.7.2.jar:?]
   [junit4]   2> 	at com.carrotsearch.randomizedtesting.rules.StatementAdapter.evaluate(StatementAdapter.java:36) [randomizedtesting-runner-2.7.2.jar:?]
   [junit4]   2> 	at org.apache.lucene.util.TestRuleAssertionsRequired$1.evaluate(TestRuleAssertionsRequired.java:53) [java/:?]
   [junit4]   2> 	at org.apache.lucene.util.TestRuleMarkFailure$1.evaluate(TestRuleMarkFailure.java:47) [java/:?]
   [junit4]   2> 	at org.apache.lucene.util.TestRuleIgnoreAfterMaxFailures$1.evaluate(TestRuleIgnoreAfterMaxFailures.java:64) [java/:?]
   [junit4]   2> 	at org.apache.lucene.util.TestRuleIgnoreTestSuites$1.evaluate(TestRuleIgnoreTestSuites.java:54) [java/:?]
   [junit4]   2> 	at org.junit.rules.RunRules.evaluate(RunRules.java:20) [junit-4.13.1.jar:4.13.1]
   [junit4]   2> 	at com.carrotsearch.randomizedtesting.rules.StatementAdapter.evaluate(StatementAdapter.java:36) [randomizedtesting-runner-2.7.2.jar:?]
   [junit4]   2> 	at com.carrotsearch.randomizedtesting.ThreadLeakControl$StatementRunner.run(ThreadLeakControl.java:368) [randomizedtesting-runner-2.7.2.jar:?]
   [junit4]   2> 	at java.lang.Thread.run(Thread.java:748) [?:1.8.0_281]
   [junit4]   2> 1279290 INFO  (SUITE-TestCircuitBreaker-seed#[EF641B3816BA276F]-worker) [     ] o.a.s.h.c.HttpShardHandlerFactory Host whitelist initialized: WhitelistHostChecker [whitelistHosts=null, whitelistHostCheckingEnabled=true]
   [junit4]   2> 1279293 WARN  (SUITE-TestCircuitBreaker-seed#[EF641B3816BA276F]-worker) [     ] o.e.j.u.s.S.config Trusting all certificates configured for Client@649ce0c6[provider=null,keyStore=null,trustStore=null]
   [junit4]   2> 1279293 WARN  (SUITE-TestCircuitBreaker-seed#[EF641B3816BA276F]-worker) [     ] o.e.j.u.s.S.config No Client EndPointIdentificationAlgorithm configured for Client@649ce0c6[provider=null,keyStore=null,trustStore=null]
   [junit4]   2> 1279296 WARN  (SUITE-TestCircuitBreaker-seed#[EF641B3816BA276F]-worker) [     ] o.e.j.u.s.S.config Trusting all certificates configured for Client@17d45b2f[provider=null,keyStore=null,trustStore=null]
   [junit4]   2> 1279296 WARN  (SUITE-TestCircuitBreaker-seed#[EF641B3816BA276F]-worker) [     ] o.e.j.u.s.S.config No Client EndPointIdentificationAlgorithm configured for Client@17d45b2f[provider=null,keyStore=null,trustStore=null]
   [junit4]   2> 1279297 WARN  (SUITE-TestCircuitBreaker-seed#[EF641B3816BA276F]-worker) [     ] o.a.s.c.CoreContainer Not all security plugins configured!  authentication=disabled authorization=disabled.  Solr is only as secure as you make it. Consider configuring authentication/authorization before exposing Solr to users internal or external.  See https://s.apache.org/solrsecurity for more info
   [junit4]   2> 1279322 INFO  (SUITE-TestCircuitBreaker-seed#[EF641B3816BA276F]-worker) [     ] o.a.s.m.r.SolrJmxReporter JMX monitoring for 'solr.node' (registry 'solr.node') enabled at server: com.sun.jmx.mbeanserver.JmxMBeanServer@7b2689ea
   [junit4]   2> 1279328 INFO  (SUITE-TestCircuitBreaker-seed#[EF641B3816BA276F]-worker) [     ] o.a.s.m.r.SolrJmxReporter JMX monitoring for 'solr.jvm' (registry 'solr.jvm') enabled at server: com.sun.jmx.mbeanserver.JmxMBeanServer@7b2689ea
   [junit4]   2> 1279328 INFO  (SUITE-TestCircuitBreaker-seed#[EF641B3816BA276F]-worker) [     ] o.a.s.m.r.SolrJmxReporter JMX monitoring for 'solr.jetty' (registry 'solr.jetty') enabled at server: com.sun.jmx.mbeanserver.JmxMBeanServer@7b2689ea
   [junit4]   2> 1279329 INFO  (coreLoadExecutor-14889-thread-1) [     ] o.a.s.c.TransientSolrCoreCacheDefault Allocating transient cache for 2147483647 transient cores
   [junit4]   2> 1279338 INFO  (coreLoadExecutor-14889-thread-1) [    x:collection1 ] o.a.s.c.SolrResourceLoader Added 2 libs to classloader, from paths: [/home/jenkins/jenkins-slave/workspace/Lucene/Lucene-Solr-Tests-8.x/solr/core/src/test-files/solr/collection1/lib, /home/jenkins/jenkins-slave/workspace/Lucene/Lucene-Solr-Tests-8.x/solr/core/src/test-files/solr/collection1/lib/classes]
   [junit4]   2> 1279362 INFO  (coreLoadExecutor-14889-thread-1) [    x:collection1 ] o.a.s.c.SolrConfig Using Lucene MatchVersion: 8.9.0
   [junit4]   2> 1279371 INFO  (coreLoadExecutor-14889-thread-1) [    x:collection1 ] o.a.s.s.IndexSchema Schema name=test
   [junit4]   2> 1279378 INFO  (coreLoadExecutor-14889-thread-1) [    x:collection1 ] o.a.s.s.IndexSchema Loaded schema test/1.0 with uniqueid field id
   [junit4]   2> 1279384 INFO  (coreLoadExecutor-14889-thread-1) [    x:collection1 ] o.a.s.c.CoreContainer Creating SolrCore 'collection1' using configuration from instancedir /home/jenkins/jenkins-slave/workspace/Lucene/Lucene-Solr-Tests-8.x/solr/core/src/test-files/solr/collection1, trusted=true
   [junit4]   2> 1279384 INFO  (coreLoadExecutor-14889-thread-1) [    x:collection1 ] o.a.s.m.r.SolrJmxReporter JMX monitoring for 'solr.core.collection1' (registry 'solr.core.collection1') enabled at server: com.sun.jmx.mbeanserver.JmxMBeanServer@7b2689ea
   [junit4]   2> 1279384 INFO  (coreLoadExecutor-14889-thread-1) [    x:collection1 ] o.a.s.c.SolrCore [[collection1] ] Opening new SolrCore at [/home/jenkins/jenkins-slave/workspace/Lucene/Lucene-Solr-Tests-8.x/solr/core/src/test-files/solr/collection1], dataDir=[/home/jenkins/jenkins-slave/workspace/Lucene/Lucene-Solr-Tests-8.x/solr/build/solr-core/test/J1/temp/solr.util.TestCircuitBreaker_EF641B3816BA276F-001/data-dir-104-001/]
   [junit4]   2> 1279385 INFO  (coreLoadExecutor-14889-thread-1) [    x:collection1 ] o.a.s.u.RandomMergePolicy RandomMergePolicy wrapping class org.apache.lucene.index.LogDocMergePolicy: [LogDocMergePolicy: minMergeSize=1000, mergeFactor=41, maxMergeSize=9223372036854775807, maxMergeSizeForForcedMerge=9223372036854775807, calibrateSizeByDeletes=true, maxMergeDocs=2147483647, maxCFSSegmentSizeMB=8.796093022207999E12, noCFSRatio=0.46270605822172395]
   [junit4]   2> 1279420 INFO  (coreLoadExecutor-14889-thread-1) [    x:collection1 ] o.a.s.u.CommitTracker Hard AutoCommit: disabled
   [junit4]   2> 1279420 INFO  (coreLoadExecutor-14889-thread-1) [    x:collection1 ] o.a.s.u.CommitTracker Soft AutoCommit: disabled
   [junit4]   2> 1279420 INFO  (coreLoadExecutor-14889-thread-1) [    x:collection1 ] o.a.s.u.RandomMergePolicy RandomMergePolicy wrapping class org.apache.lucene.index.LogByteSizeMergePolicy: [LogByteSizeMergePolicy: minMergeSize=1677721, mergeFactor=38, maxMergeSize=2147483648, maxMergeSizeForForcedMerge=9223372036854775807, calibrateSizeByDeletes=true, maxMergeDocs=2147483647, maxCFSSegmentSizeMB=8.796093022207999E12, noCFSRatio=0.4401311019076136]
   [junit4]   2> 1279421 WARN  (coreLoadExecutor-14889-thread-1) [    x:collection1 ] o.a.s.r.ManagedResourceStorage Cannot write to config directory /home/jenkins/jenkins-slave/workspace/Lucene/Lucene-Solr-Tests-8.x/solr/core/src/test-files/solr/collection1/conf ; switching to use InMemory storage instead.
   [junit4]   2> 1279422 INFO  (coreLoadExecutor-14889-thread-1) [    x:collection1 ] o.a.s.h.ReplicationHandler Commits will be reserved for 10000 ms
   [junit4]   2> 1279422 INFO  (SUITE-TestCircuitBreaker-seed#[EF641B3816BA276F]-worker) [     ] o.a.s.SolrTestCaseJ4 ####initCore end
   [junit4]   2> 1279423 INFO  (SUITE-TestCircuitBreaker-seed#[EF641B3816BA276F]-worker) [    x:collection1 ] o.a.s.u.p.LogUpdateProcessorFactory [collection1]  webapp=null path=null params={}{add=[1]} 0 0
   [junit4]   2> 1279424 INFO  (SUITE-TestCircuitBreaker-seed#[EF641B3816BA276F]-worker) [    x:collection1 ] o.a.s.u.p.LogUpdateProcessorFactory [collection1]  webapp=null path=null params={}{add=[2]} 0 0
   [junit4]   2> 1279425 INFO  (SUITE-TestCircuitBreaker-seed#[EF641B3816BA276F]-worker) [    x:collection1 ] o.a.s.u.p.LogUpdateProcessorFactory [collection1]  webapp=null path=null params={}{add=[3]} 0 0
   [junit4]   2> 1279425 INFO  (SUITE-TestCircuitBreaker-seed#[EF641B3816BA276F]-worker) [    x:collection1 ] o.a.s.u.p.LogUpdateProcessorFactory [collection1]  webapp=null path=null params={}{add=[1]} 0 0
   [junit4]   2> 1279425 INFO  (SUITE-TestCircuitBreaker-seed#[EF641B3816BA276F]-worker) [    x:collection1 ] o.a.s.u.p.LogUpdateProcessorFactory [collection1]  webapp=null path=null params={}{add=[2]} 0 0
   [junit4]   2> 1279426 INFO  (SUITE-TestCircuitBreaker-seed#[EF641B3816BA276F]-worker) [    x:collection1 ] o.a.s.u.p.LogUpdateProcessorFactory [collection1]  webapp=null path=null params={}{add=[3]} 0 0
   [junit4]   2> 1279430 INFO  (searcherExecutor-14891-thread-1-processing-x:collection1) [    x:collection1 ] o.a.s.c.SolrCore [collection1]  Registered new searcher autowarm time: 0 ms
   [junit4]   2> 1279434 INFO  (searcherExecutor-14891-thread-1-processing-x:collection1) [    x:collection1 ] o.a.s.c.SolrCore [collection1]  Registered new searcher autowarm time: 0 ms
   [junit4]   2> 1279435 INFO  (SUITE-TestCircuitBreaker-seed#[EF641B3816BA276F]-worker) [    x:collection1 ] o.a.s.u.p.LogUpdateProcessorFactory [collection1]  webapp=null path=null params={}{commit=} 0 9
   [junit4]   2> 1279436 INFO  (SUITE-TestCircuitBreaker-seed#[EF641B3816BA276F]-worker) [    x:collection1 ] o.a.s.u.p.LogUpdateProcessorFactory [collection1]  webapp=null path=null params={}{add=[1]} 0 0
   [junit4]   2> 1279436 INFO  (SUITE-TestCircuitBreaker-seed#[EF641B3816BA276F]-worker) [    x:collection1 ] o.a.s.u.p.LogUpdateProcessorFactory [collection1]  webapp=null path=null params={}{add=[2]} 0 0
   [junit4]   2> 1279436 INFO  (SUITE-TestCircuitBreaker-seed#[EF641B3816BA276F]-worker) [    x:collection1 ] o.a.s.u.p.LogUpdateProcessorFactory [collection1]  webapp=null path=null params={}{add=[3]} 0 0
   [junit4]   2> 1279437 INFO  (SUITE-TestCircuitBreaker-seed#[EF641B3816BA276F]-worker) [    x:collection1 ] o.a.s.u.p.LogUpdateProcessorFactory [collection1]  webapp=null path=null params={}{add=[1]} 0 0
   [junit4]   2> 1279437 INFO  (SUITE-TestCircuitBreaker-seed#[EF641B3816BA276F]-worker) [    x:collection1 ] o.a.s.u.p.LogUpdateProcessorFactory [collection1]  webapp=null path=null params={}{add=[2]} 0 0
   [junit4]   2> 1279437 INFO  (SUITE-TestCircuitBreaker-seed#[EF641B3816BA276F]-worker) [    x:collection1 ] o.a.s.u.p.LogUpdateProcessorFactory [collection1]  webapp=null path=null params={}{add=[3]} 0 0
   [junit4]   2> 1279442 INFO  (searcherExecutor-14891-thread-1-processing-x:collection1) [    x:collection1 ] o.a.s.c.SolrCore [collection1]  Registered new searcher autowarm time: 0 ms
   [junit4]   2> 1279443 INFO  (SUITE-TestCircuitBreaker-seed#[EF641B3816BA276F]-worker) [    x:collection1 ] o.a.s.u.p.LogUpdateProcessorFactory [collection1]  webapp=null path=null params={}{commit=} 0 5
   [junit4]   2> 1279443 INFO  (SUITE-TestCircuitBreaker-seed#[EF641B3816BA276F]-worker) [    x:collection1 ] o.a.s.u.p.LogUpdateProcessorFactory [collection1]  webapp=null path=null params={}{add=[1]} 0 0
   [junit4]   2> 1279443 INFO  (SUITE-TestCircuitBreaker-seed#[EF641B3816BA276F]-worker) [    x:collection1 ] o.a.s.u.p.LogUpdateProcessorFactory [collection1]  webapp=null path=null params={}{add=[2]} 0 0
   [junit4]   2> 1279444 INFO  (SUITE-TestCircuitBreaker-seed#[EF641B3816BA276F]-worker) [    x:collection1 ] o.a.s.u.p.LogUpdateProcessorFactory [collection1]  webapp=null path=null params={}{add=[3]} 0 0
   [junit4]   2> 1279445 INFO  (SUITE-TestCircuitBreaker-seed#[EF641B3816BA276F]-worker) [    x:collection1 ] o.a.s.u.p.LogUpdateProcessorFactory [collection1]  webapp=null path=null params={}{add=[1]} 0 0
   [junit4]   2> 1279445 INFO  (SUITE-TestCircuitBreaker-seed#[EF641B3816BA276F]-worker) [    x:collection1 ] o.a.s.u.p.LogUpdateProcessorFactory [collection1]  webapp=null path=null params={}{add=[2]} 0 0
   [junit4]   2> 1279445 INFO  (SUITE-TestCircuitBreaker-seed#[EF641B3816BA276F]-worker) [    x:collection1 ] o.a.s.u.p.LogUpdateProcessorFactory [collection1]  webapp=null path=null params={}{add=[3]} 0 0
   [junit4]   2> 1279452 INFO  (searcherExecutor-14891-thread-1-processing-x:collection1) [    x:collection1 ] o.a.s.c.SolrCore [collection1]  Registered new searcher autowarm time: 0 ms
   [junit4]   2> 1279453 INFO  (SUITE-TestCircuitBreaker-seed#[EF641B3816BA276F]-worker) [    x:collection1 ] o.a.s.u.p.LogUpdateProcessorFactory [collection1]  webapp=null path=null params={}{commit=} 0 7
   [junit4]   2> 1279454 INFO  (SUITE-TestCircuitBreaker-seed#[EF641B3816BA276F]-worker) [    x:collection1 ] o.a.s.u.p.LogUpdateProcessorFactory [collection1]  webapp=null path=null params={}{add=[1]} 0 0
   [junit4]   2> 1279454 INFO  (SUITE-TestCircuitBreaker-seed#[EF641B3816BA276F]-worker) [    x:collection1 ] o.a.s.u.p.LogUpdateProcessorFactory [collection1]  webapp=null path=null params={}{add=[2]} 0 0
   [junit4]   2> 1279454 INFO  (SUITE-TestCircuitBreaker-seed#[EF641B3816BA276F]-worker) [    x:collection1 ] o.a.s.u.p.LogUpdateProcessorFactory [collection1]  webapp=null path=null params={}{add=[3]} 0 0
   [junit4]   2> 1279454 INFO  (SUITE-TestCircuitBreaker-seed#[EF641B3816BA276F]-worker) [    x:collection1 ] o.a.s.u.p.LogUpdateProcessorFactory [collection1]  webapp=null path=null params={}{add=[1]} 0 0
   [junit4]   2> 1279455 INFO  (SUITE-TestCircuitBreaker-seed#[EF641B3816BA276F]-worker) [    x:collection1 ] o.a.s.u.p.LogUpdateProcessorFactory [collection1]  webapp=null path=null params={}{add=[2]} 0 0
   [junit4]   2> 1279455 INFO  (SUITE-TestCircuitBreaker-seed#[EF641B3816BA276F]-worker) [    x:collection1 ] o.a.s.u.p.LogUpdateProcessorFactory [collection1]  webapp=null path=null params={}{add=[3]} 0 0
   [junit4]   2> 1279461 INFO  (searcherExecutor-14891-thread-1-processing-x:collection1) [    x:collection1 ] o.a.s.c.SolrCore [collection1]  Registered new searcher autowarm time: 0 ms
   [junit4]   2> 1279461 INFO  (SUITE-TestCircuitBreaker-seed#[EF641B3816BA276F]-worker) [    x:collection1 ] o.a.s.u.p.LogUpdateProcessorFactory [collection1]  webapp=null path=null params={}{commit=} 0 6
   [junit4]   2> 1279462 INFO  (SUITE-TestCircuitBreaker-seed#[EF641B3816BA276F]-worker) [    x:collection1 ] o.a.s.u.p.LogUpdateProcessorFactory [collection1]  webapp=null path=null params={}{add=[1]} 0 0
   [junit4]   2> 1279462 INFO  (SUITE-TestCircuitBreaker-seed#[EF641B3816BA276F]-worker) [    x:collection1 ] o.a.s.u.p.LogUpdateProcessorFactory [collection1]  webapp=null path=null params={}{add=[2]} 0 0
   [junit4]   2> 1279463 INFO  (SUITE-TestCircuitBreaker-seed#[EF641B3816BA276F]-worker) [    x:collection1 ] o.a.s.u.p.LogUpdateProcessorFactory [collection1]  webapp=null path=null params={}{add=[3]} 0 0
   [junit4]   2> 1279463 INFO  (SUITE-TestCircuitBreaker-seed#[EF641B3816BA276F]-worker) [    x:collection1 ] o.a.s.u.p.LogUpdateProcessorFactory [collection1]  webapp=null path=null params={}{add=[1]} 0 0
   [junit4]   2> 1279465 INFO  (SUITE-TestCircuitBreaker-seed#[EF641B3816BA276F]-worker) [    x:collection1 ] o.a.s.u.p.LogUpdateProcessorFactory [collection1]  webapp=null path=null params={}{add=[2]} 0 0
   [junit4]   2> 1279465 INFO  (SUITE-TestCircuitBreaker-seed#[EF641B3816BA276F]-worker) [    x:collection1 ] o.a.s.u.p.LogUpdateProcessorFactory [collection1]  webapp=null path=null params={}{add=[3]} 0 0
   [junit4]   2> 1279469 INFO  (searcherExecutor-14891-thread-1-processing-x:collection1) [    x:collection1 ] o.a.s.c.SolrCore [collection1]  Registered new searcher autowarm time: 0 ms
   [junit4]   2> 1279470 INFO  (SUITE-TestCircuitBreaker-seed#[EF641B3816BA276F]-worker) [    x:collection1 ] o.a.s.u.p.LogUpdateProcessorFactory [collection1]  webapp=null path=null params={}{commit=} 0 4
   [junit4]   2> 1279471 INFO  (SUITE-TestCircuitBreaker-seed#[EF641B3816BA276F]-worker) [    x:collection1 ] o.a.s.u.p.LogUpdateProcessorFactory [collection1]  webapp=null path=null params={}{add=[1]} 0 0
   [junit4]   2> 1279471 INFO  (SUITE-TestCircuitBreaker-seed#[EF641B3816BA276F]-worker) [    x:collection1 ] o.a.s.u.p.LogUpdateProcessorFactory [collection1]  webapp=null path=null params={}{add=[2]} 0 0
   [junit4]   2> 1279471 INFO  (SUITE-TestCircuitBreaker-seed#[EF641B3816BA276F]-worker) [    x:collection1 ] o.a.s.u.p.LogUpdateProcessorFactory [collection1]  webapp=null path=null params={}{add=[3]} 0 0
   [junit4]   2> 1279472 INFO  (SUITE-TestCircuitBreaker-seed#[EF641B3816BA276F]-worker) [    x:collection1 ] o.a.s.u.p.LogUpdateProcessorFactory [collection1]  webapp=null path=null params={}{add=[1]} 0 0
   [junit4]   2> 1279472 INFO  (SUITE-TestCircuitBreaker-seed#[EF641B3816BA276F]-worker) [    x:collection1 ] o.a.s.u.p.LogUpdateProcessorFactory [collection1]  webapp=null path=null params={}{add=[2]} 0 0
   [junit4]   2> 1279472 INFO  (SUITE-TestCircuitBreaker-seed#[EF641B3816BA276F]-worker) [    x:collection1 ] o.a.s.u.p.LogUpdateProcessorFactory [collection1]  webapp=null path=null params={}{add=[3]} 0 0
   [junit4]   2> 1279478 INFO  (searcherExecutor-14891-thread-1-processing-x:collection1) [    x:collection1 ] o.a.s.c.SolrCore [collection1]  Registered new searcher autowarm time: 0 ms
   [junit4]   2> 1279479 INFO  (SUITE-TestCircuitBreaker-seed#[EF641B3816BA276F]-worker) [    x:collection1 ] o.a.s.u.p.LogUpdateProcessorFactory [collection1]  webapp=null path=null params={}{commit=} 0 6
   [junit4]   2> 1279479 INFO  (SUITE-TestCircuitBreaker-seed#[EF641B3816BA276F]-worker) [    x:collection1 ] o.a.s.u.p.LogUpdateProcessorFactory [collection1]  webapp=null path=null params={}{add=[1]} 0 0
   [junit4]   2> 1279479 INFO  (SUITE-TestCircuitBreaker-seed#[EF641B3816BA276F]-worker) [    x:collection1 ] o.a.s.u.p.LogUpdateProcessorFactory [collection1]  webapp=null path=null params={}{add=[2]} 0 0
   [junit4]   2> 1279480 INFO  (SUITE-TestCircuitBreaker-seed#[EF641B3816BA276F]-worker) [    x:collection1 ] o.a.s.u.p.LogUpdateProcessorFactory [collection1]  webapp=null path=null params={}{add=[3]} 0 0
   [junit4]   2> 1279480 INFO  (SUITE-TestCircuitBreaker-seed#[EF641B3816BA276F]-worker) [    x:collection1 ] o.a.s.u.p.LogUpdateProcessorFactory [collection1]  webapp=null path=null params={}{add=[1]} 0 0
   [junit4]   2> 1279480 INFO  (SUITE-TestCircuitBreaker-seed#[EF641B3816BA276F]-worker) [    x:collection1 ] o.a.s.u.p.LogUpdateProcessorFactory [collection1]  webapp=null path=null params={}{add=[2]} 0 0
   [junit4]   2> 1279480 INFO  (SUITE-TestCircuitBreaker-seed#[EF641B3816BA276F]-worker) [    x:collection1 ] o.a.s.u.p.LogUpdateProcessorFactory [collection1]  webapp=null path=null params={}{add=[3]} 0 0
   [junit4]   2> 1279486 INFO  (searcherExecutor-14891-thread-1-processing-x:collection1) [    x:collection1 ] o.a.s.c.SolrCore [collection1]  Registered new searcher autowarm time: 0 ms
   [junit4]   2> 1279486 INFO  (SUITE-TestCircuitBreaker-seed#[EF641B3816BA276F]-worker) [    x:collection1 ] o.a.s.u.p.LogUpdateProcessorFactory [collection1]  webapp=null path=null params={}{commit=} 0 5
   [junit4]   2> 1279486 INFO  (SUITE-TestCircuitBreaker-seed#[EF641B3816BA276F]-worker) [    x:collection1 ] o.a.s.u.p.LogUpdateProcessorFactory [collection1]  webapp=null path=null params={}{add=[1]} 0 0
   [junit4]   2> 1279487 INFO  (SUITE-TestCircuitBreaker-seed#[EF641B3816BA276F]-worker) [    x:collection1 ] o.a.s.u.p.LogUpdateProcessorFactory [collection1]  webapp=null path=null params={}{add=[2]} 0 0
   [junit4]   2> 1279487 INFO  (SUITE-TestCircuitBreaker-seed#[EF641B3816BA276F]-worker) [    x:collection1 ] o.a.s.u.p.LogUpdateProcessorFactory [collection1]  webapp=null path=null params={}{add=[3]} 0 0
   [junit4]   2> 1279487 INFO  (SUITE-TestCircuitBreaker-seed#[EF641B3816BA276F]-worker) [    x:collection1 ] o.a.s.u.p.LogUpdateProcessorFactory [collection1]  webapp=null path=null params={}{add=[1]} 0 0
   [junit4]   2> 1279487 INFO  (SUITE-TestCircuitBreaker-seed#[EF641B3816BA276F]-worker) [    x:collection1 ] o.a.s.u.p.LogUpdateProcessorFactory [collection1]  webapp=null path=null params={}{add=[2]} 0 0
   [junit4]   2> 1279488 INFO  (SUITE-TestCircuitBreaker-seed#[EF641B3816BA276F]-worker) [    x:collection1 ] o.a.s.u.p.LogUpdateProcessorFactory [collection1]  webapp=null path=null params={}{add=[3]} 0 0
   [junit4]   2> 1279505 INFO  (searcherExecutor-14891-thread-1-processing-x:collection1) [    x:collection1 ] o.a.s.c.SolrCore [collection1]  Registered new searcher autowarm time: 0 ms
   [junit4]   2> 1279505 INFO  (SUITE-TestCircuitBreaker-seed#[EF641B3816BA276F]-worker) [    x:collection1 ] o.a.s.u.p.LogUpdateProcessorFactory [collection1]  webapp=null path=null params={}{commit=} 0 17
   [junit4]   2> 1279506 INFO  (SUITE-TestCircuitBreaker-seed#[EF641B3816BA276F]-worker) [    x:collection1 ] o.a.s.u.p.LogUpdateProcessorFactory [collection1]  webapp=null path=null params={}{add=[1]} 0 0
   [junit4]   2> 1279506 INFO  (SUITE-TestCircuitBreaker-seed#[EF641B3816BA276F]-worker) [    x:collection1 ] o.a.s.u.p.LogUpdateProcessorFactory [collection1]  webapp=null path=null params={}{add=[2]} 0 0
   [junit4]   2> 1279506 INFO  (SUITE-TestCircuitBreaker-seed#[EF641B3816BA276F]-worker) [    x:collection1 ] o.a.s.u.p.LogUpdateProcessorFactory [collection1]  webapp=null path=null params={}{add=[3]} 0 0
   [junit4]   2> 1279507 INFO  (SUITE-TestCircuitBreaker-seed#[EF641B3816BA276F]-worker) [    x:collection1 ] o.a.s.u.p.LogUpdateProcessorFactory [collection1]  webapp=null path=null params={}{add=[1]} 0 0
   [junit4]   2> 1279507 INFO  (SUITE-TestCircuitBreaker-seed#[EF641B3816BA276F]-worker) [    x:collection1 ] o.a.s.u.p.LogUpdateProcessorFactory [collection1]  webapp=null path=null params={}{add=[2]} 0 0
   [junit4]   2> 1279507 INFO  (SUITE-TestCircuitBreaker-seed#[EF641B3816BA276F]-worker) [    x:collection1 ] o.a.s.u.p.LogUpdateProcessorFactory [collection1]  webapp=null path=null params={}{add=[3]} 0 0
   [junit4]   2> 1279512 INFO  (searcherExecutor-14891-thread-1-processing-x:collection1) [    x:collection1 ] o.a.s.c.SolrCore [collection1]  Registered new searcher autowarm time: 0 ms
   [junit4]   2> 1279512 INFO  (SUITE-TestCircuitBreaker-seed#[EF641B3816BA276F]-worker) [    x:collection1 ] o.a.s.u.p.LogUpdateProcessorFactory [collection1]  webapp=null path=null params={}{commit=} 0 4
   [junit4]   2> 1279512 INFO  (SUITE-TestCircuitBreaker-seed#[EF641B3816BA276F]-worker) [    x:collection1 ] o.a.s.u.p.LogUpdateProcessorFactory [collection1]  webapp=null path=null params={}{add=[1]} 0 0
   [junit4]   2> 1279513 INFO  (SUITE-TestCircuitBreaker-seed#[EF641B3816BA276F]-worker) [    x:collection1 ] o.a.s.u.p.LogUpdateProcessorFactory [collection1]  webapp=null path=null params={}{add=[2]} 0 0
   [junit4]   2> 1279513 INFO  (SUITE-TestCircuitBreaker-seed#[EF641B3816BA276F]-worker) [    x:collection1 ] o.a.s.u.p.LogUpdateProcessorFactory [collection1]  webapp=null path=null params={}{add=[3]} 0 0
   [junit4]   2> 1279513 INFO  (SUITE-TestCircuitBreaker-seed#[EF641B3816BA276F]-worker) [    x:collection1 ] o.a.s.u.p.LogUpdateProcessorFactory [collection1]  webapp=null path=null params={}{add=[1]} 0 0
   [junit4]   2> 1279513 INFO  (SUITE-TestCircuitBreaker-seed#[EF641B3816BA276F]-worker) [    x:collection1 ] o.a.s.u.p.LogUpdateProcessorFactory [collection1]  webapp=null path=null params={}{add=[2]} 0 0
   [junit4]   2> 1279514 INFO  (SUITE-TestCircuitBreaker-seed#[EF641B3816BA276F]-worker) [    x:collection1 ] o.a.s.u.p.LogUpdateProcessorFactory [collection1]  webapp=null path=null params={}{add=[3]} 0 0
   [junit4]   2> 1279518 INFO  (searcherExecutor-14891-thread-1-processing-x:collection1) [    x:collection1 ] o.a.s.c.SolrCore [collection1]  Registered new searcher autowarm time: 0 ms
   [junit4]   2> 1279518 INFO  (SUITE-TestCircuitBreaker-seed#[EF641B3816BA276F]-worker) [    x:collection1 ] o.a.s.u.p.LogUpdateProcessorFactory [collection1]  webapp=null path=null params={}{commit=} 0 4
   [junit4]   2> 1279519 INFO  (SUITE-TestCircuitBreaker-seed#[EF641B3816BA276F]-worker) [    x:collection1 ] o.a.s.u.p.LogUpdateProcessorFactory [collection1]  webapp=null path=null params={}{add=[1]} 0 0
   [junit4]   2> 1279519 INFO  (SUITE-TestCircuitBreaker-seed#[EF641B3816BA276F]-worker) [    x:collection1 ] o.a.s.u.p.LogUpdateProcessorFactory [collection1]  webapp=null path=null params={}{add=[2]} 0 0
   [junit4]   2> 1279519 INFO  (SUITE-TestCircuitBreaker-seed#[EF641B3816BA276F]-worker) [    x:collection1 ] o.a.s.u.p.LogUpdateProcessorFactory [collection1]  webapp=null path=null params={}{add=[3]} 0 0
   [junit4]   2> 1279520 INFO  (SUITE-TestCircuitBreaker-seed#[EF641B3816BA276F]-worker) [    x:collection1 ] o.a.s.u.p.LogUpdateProcessorFactory [collection1]  webapp=null path=null params={}{add=[1]} 0 0
   [junit4]   2> 1279520 INFO  (SUITE-TestCircuitBreaker-seed#[EF641B3816BA276F]-worker) [    x:collection1 ] o.a.s.u.p.LogUpdateProcessorFactory [collection1]  webapp=null path=null params={}{add=[2]} 0 0
   [junit4]   2> 1279520 INFO  (SUITE-TestCircuitBreaker-seed#[EF641B3816BA276F]-worker) [    x:collection1 ] o.a.s.u.p.LogUpdateProcessorFactory [collection1]  webapp=null path=null params={}{add=[3]} 0 0
   [junit4]   2> 1279525 INFO  (searcherExecutor-14891-thread-1-processing-x:collection1) [    x:collection1 ] o.a.s.c.SolrCore [collection1]  Registered new searcher autowarm time: 0 ms
   [junit4]   2> 1279525 INFO  (SUITE-TestCircuitBreaker-seed#[EF641B3816BA276F]-worker) [    x:collection1 ] o.a.s.u.p.LogUpdateProcessorFactory [collection1]  webapp=null path=null params={}{commit=} 0 4
   [junit4]   2> 1279525 INFO  (SUITE-TestCircuitBreaker-seed#[EF641B3816BA276F]-worker) [    x:collection1 ] o.a.s.u.p.LogUpdateProcessorFactory [collection1]  webapp=null path=null params={}{add=[1]} 0 0
   [junit4]   2> 1279526 INFO  (SUITE-TestCircuitBreaker-seed#[EF641B3816BA276F]-worker) [    x:collection1 ] o.a.s.u.p.LogUpdateProcessorFactory [collection1]  webapp=null path=null params={}{add=[2]} 0 0
   [junit4]   2> 1279526 INFO  (SUITE-TestCircuitBreaker-seed#[EF641B3816BA276F]-worker) [    x:collection1 ] o.a.s.u.p.LogUpdateProcessorFactory [collection1]  webapp=null path=null params={}{add=[3]} 0 0
   [junit4]   2> 1279526 INFO  (SUITE-TestCircuitBreaker-seed#[EF641B3816BA276F]-worker) [    x:collection1 ] o.a.s.u.p.LogUpdateProcessorFactory [collection1]  webapp=null path=null params={}{add=[1]} 0 0
   [junit4]   2> 1279526 INFO  (SUITE-TestCircuitBreaker-seed#[EF641B3816BA276F]-worker) [    x:collection1 ] o.a.s.u.p.LogUpdateProcessorFactory [collection1]  webapp=null path=null params={}{add=[2]} 0 0
   [junit4]   2> 1279527 INFO  (SUITE-TestCircuitBreaker-seed#[EF641B3816BA276F]-worker) [    x:collection1 ] o.a.s.u.p.LogUpdateProcessorFactory [collection1]  webapp=null path=null params={}{add=[3]} 0 0
   [junit4]   2> 1279531 INFO  (searcherExecutor-14891-thread-1-processing-x:collection1) [    x:collection1 ] o.a.s.c.SolrCore [collection1]  Registered new searcher autowarm time: 0 ms
   [junit4]   2> 1279531 INFO  (SUITE-TestCircuitBreaker-seed#[EF641B3816BA276F]-worker) [    x:collection1 ] o.a.s.u.p.LogUpdateProcessorFactory [collection1]  webapp=null path=null params={}{commit=} 0 4
   [junit4]   2> 1279532 INFO  (SUITE-TestCircuitBreaker-seed#[EF641B3816BA276F]-worker) [    x:collection1 ] o.a.s.u.p.LogUpdateProcessorFactory [collection1]  webapp=null path=null params={}{add=[1]} 0 0
   [junit4]   2> 1279532 INFO  (SUITE-TestCircuitBreaker-seed#[EF641B3816BA276F]-worker) [    x:collection1 ] o.a.s.u.p.LogUpdateProcessorFactory [collection1]  webapp=null path=null params={}{add=[2]} 0 0
   [junit4]   2> 1279532 INFO  (SUITE-TestCircuitBreaker-seed#[EF641B3816BA276F]-worker) [    x:collection1 ] o.a.s.u.p.LogUpdateProcessorFactory [collection1]  webapp=null path=null params={}{add=[3]} 0 0
   [junit4]   2> 1279533 INFO  (SUITE-TestCircuitBreaker-seed#[EF641B3816BA276F]-worker) [    x:collection1 ] o.a.s.u.p.LogUpdateProcessorFactory [collection1]  webapp=null path=null params={}{add=[1]} 0 0
   [junit4]   2> 1279533 INFO  (SUITE-TestCircuitBreaker-seed#[EF641B3816BA276F]-worker) [    x:collection1 ] o.a.s.u.p.LogUpdateProcessorFactory [collection1]  webapp=null path=null params={}{add=[2]} 0 0
   [junit4]   2> 1279533 INFO  (SUITE-TestCircuitBreaker-seed#[EF641B3816BA276F]-worker) [    x:collection1 ] o.a.s.u.p.LogUpdateProcessorFactory [collection1]  webapp=null path=null params={}{add=[3]} 0 0
   [junit4]   2> 1279538 INFO  (searcherExecutor-14891-thread-1-processing-x:collection1) [    x:collection1 ] o.a.s.c.SolrCore [collection1]  Registered new searcher autowarm time: 0 ms
   [junit4]   2> 1279538 INFO  (SUITE-TestCircuitBreaker-seed#[EF641B3816BA276F]-worker) [    x:collection1 ] o.a.s.u.p.LogUpdateProcessorFactory [collection1]  webapp=null path=null params={}{commit=} 0 4
   [junit4]   2> 1279538 INFO  (SUITE-TestCircuitBreaker-seed#[EF641B3816BA276F]-worker) [    x:collection1 ] o.a.s.u.p.LogUpdateProcessorFactory [collection1]  webapp=null path=null params={}{add=[1]} 0 0
   [junit4]   2> 1279539 INFO  (SUITE-TestCircuitBreaker-seed#[EF641B3816BA276F]-worker) [    x:collection1 ] o.a.s.u.p.LogUpdateProcessorFactory [collection1]  webapp=null path=null params={}{add=[2]} 0 0
   [junit4]   2> 1279539 INFO  (SUITE-TestCircuitBreaker-seed#[EF641B3816BA276F]-worker) [    x:collection1 ] o.a.s.u.p.LogUpdateProcessorFactory [collection1]  webapp=null path=null params={}{add=[3]} 0 0
   [junit4]   2> 1279539 INFO  (SUITE-TestCircuitBreaker-seed#[EF641B3816BA276F]-worker) [    x:collection1 ] o.a.s.u.p.LogUpdateProcessorFactory [collection1]  webapp=null path=null params={}{add=[1]} 0 0
   [junit4]   2> 1279539 INFO  (SUITE-TestCircuitBreaker-seed#[EF641B3816BA276F]-worker) [    x:collection1 ] o.a.s.u.p.LogUpdateProcessorFactory [collection1]  webapp=null path=null params={}{add=[2]} 0 0
   [junit4]   2> 1279540 INFO  (SUITE-TestCircuitBreaker-seed#[EF641B3816BA276F]-worker) [    x:collection1 ] o.a.s.u.p.LogUpdateProcessorFactory [collection1]  webapp=null path=null params={}{add=[3]} 0 0
   [junit4]   2> 1279544 INFO  (searcherExecutor-14891-thread-1-processing-x:collection1) [    x:collection1 ] o.a.s.c.SolrCore [collection1]  Registered new searcher autowarm time: 0 ms
   [junit4]   2> 1279544 INFO  (SUITE-TestCircuitBreaker-seed#[EF641B3816BA276F]-worker) [    x:collection1 ] o.a.s.u.p.LogUpdateProcessorFactory [collection1]  webapp=null path=null params={}{commit=} 0 4
   [junit4]   2> 1279545 INFO  (SUITE-TestCircuitBreaker-seed#[EF641B3816BA276F]-worker) [    x:collection1 ] o.a.s.u.p.LogUpdateProcessorFactory [collection1]  webapp=null path=null params={}{add=[1]} 0 0
   [junit4]   2> 1279545 INFO  (SUITE-TestCircuitBreaker-seed#[EF641B3816BA276F]-worker) [    x:collection1 ] o.a.s.u.p.LogUpdateProcessorFactory [collection1]  webapp=null path=null params={}{add=[2]} 0 0
   [junit4]   2> 1279545 INFO  (SUITE-TestCircuitBreaker-seed#[EF641B3816BA276F]-worker) [    x:collection1 ] o.a.s.u.p.LogUpdateProcessorFactory [collection1]  webapp=null path=null params={}{add=[3]} 0 0
   [junit4]   2> 1279546 INFO  (SUITE-TestCircuitBreaker-seed#[EF641B3816BA276F]-worker) [    x:collection1 ] o.a.s.u.p.LogUpdateProcessorFactory [collection1]  webapp=null path=null params={}{add=[1]} 0 0
   [junit4]   2> 1279546 INFO  (SUITE-TestCircuitBreaker-seed#[EF641B3816BA276F]-worker) [    x:collection1 ] o.a.s.u.p.LogUpdateProcessorFactory [collection1]  webapp=null path=null params={}{add=[2]} 0 0
   [junit4]   2> 1279546 INFO  (SUITE-TestCircuitBreaker-seed#[EF641B3816BA276F]-worker) [    x:collection1 ] o.a.s.u.p.LogUpdateProcessorFactory [collection1]  webapp=null path=null params={}{add=[3]} 0 0
   [junit4]   2> 1279551 INFO  (searcherExecutor-14891-thread-1-processing-x:collection1) [    x:collection1 ] o.a.s.c.SolrCore [collection1]  Registered new searcher autowarm time: 0 ms
   [junit4]   2> 1279551 INFO  (SUITE-TestCircuitBreaker-seed#[EF641B3816BA276F]-worker) [    x:collection1 ] o.a.s.u.p.LogUpdateProcessorFactory [collection1]  webapp=null path=null params={}{commit=} 0 4
   [junit4]   2> 1279551 INFO  (SUITE-TestCircuitBreaker-seed#[EF641B3816BA276F]-worker) [    x:collection1 ] o.a.s.u.p.LogUpdateProcessorFactory [collection1]  webapp=null path=null params={}{add=[1]} 0 0
   [junit4]   2> 1279551 INFO  (SUITE-TestCircuitBreaker-seed#[EF641B3816BA276F]-worker) [    x:collection1 ] o.a.s.u.p.LogUpdateProcessorFactory [collection1]  webapp=null path=null params={}{add=[2]} 0 0
   [junit4]   2> 1279552 INFO  (SUITE-TestCircuitBreaker-seed#[EF641B3816BA276F]-worker) [    x:collection1 ] o.a.s.u.p.LogUpdateProcessorFactory [collection1]  webapp=null path=null params={}{add=[3]} 0 0
   [junit4]   2> 1279552 INFO  (SUITE-TestCircuitBreaker-seed#[EF641B3816BA276F]-worker) [    x:collection1 ] o.a.s.u.p.LogUpdateProcessorFactory [collection1]  webapp=null path=null params={}{add=[1]} 0 0
   [junit4]   2> 1279552 INFO  (SUITE-TestCircuitBreaker-seed#[EF641B3816BA276F]-worker) [    x:collection1 ] o.a.s.u.p.LogUpdateProcessorFactory [collection1]  webapp=null path=null params={}{add=[2]} 0 0
   [junit4]   2> 1279553 INFO  (SUITE-TestCircuitBreaker-seed#[EF641B3816BA276F]-worker) [    x:collection1 ] o.a.s.u.p.LogUpdateProcessorFactory [collection1]  webapp=null path=null params={}{add=[3]} 0 0
   [junit4]   2> 1279557 INFO  (searcherExecutor-14891-thread-1-processing-x:collection1) [    x:collection1 ] o.a.s.c.SolrCore [collection1]  Registered new searcher autowarm time: 0 ms
   [junit4]   2> 1279557 INFO  (SUITE-TestCircuitBreaker-seed#[EF641B3816BA276F]-worker) [    x:collection1 ] o.a.s.u.p.LogUpdateProcessorFactory [collection1]  webapp=null path=null params={}{commit=} 0 4
   [junit4]   2> 1279558 INFO  (SUITE-TestCircuitBreaker-seed#[EF641B3816BA276F]-worker) [    x:collection1 ] o.a.s.u.p.LogUpdateProcessorFactory [collection1]  webapp=null path=null params={}{add=[1]} 0 0
   [junit4]   2> 1279558 INFO  (SUITE-TestCircuitBreaker-seed#[EF641B3816BA276F]-worker) [    x:collection1 ] o.a.s.u.p.LogUpdateProcessorFactory [collection1]  webapp=null path=null params={}{add=[2]} 0 0
   [junit4]   2> 1279558 INFO  (SUITE-TestCircuitBreaker-seed#[EF641B3816BA276F]-worker) [    x:collection1 ] o.a.s.u.p.LogUpdateProcessorFactory [collection1]  webapp=null path=null params={}{add=[3]} 0 0
   [junit4]   2> 1279558 INFO  (SUITE-TestCircuitBreaker-seed#[EF641B3816BA276F]-worker) [    x:collection1 ] o.a.s.u.p.LogUpdateProcessorFactory [collection1]  webapp=null path=null params={}{add=[1]} 0 0
   [junit4]   2> 1279559 INFO  (SUITE-TestCircuitBreaker-seed#[EF641B3816BA276F]-worker) [    x:collection1 ] o.a.s.u.p.LogUpdateProcessorFactory [collection1]  webapp=null path=null params={}{add=[2]} 0 0
   [junit4]   2> 1279559 INFO  (SUITE-TestCircuitBreaker-seed#[EF641B3816BA276F]-worker) [    x:collection1 ] o.a.s.u.p.LogUpdateProcessorFactory [collection1]  webapp=null path=null params={}{add=[3]} 0 0
   [junit4]   2> 1279563 INFO  (searcherExecutor-14891-thread-1-processing-x:collection1) [    x:collection1 ] o.a.s.c.SolrCore [collection1]  Registered new searcher autowarm time: 0 ms
   [junit4]   2> 1279564 INFO  (SUITE-TestCircuitBreaker-seed#[EF641B3816BA276F]-worker) [    x:collection1 ] o.a.s.u.p.LogUpdateProcessorFactory [collection1]  webapp=null path=null params={}{commit=} 0 4
   [junit4]   2> 1279564 INFO  (SUITE-TestCircuitBreaker-seed#[EF641B3816BA276F]-worker) [    x:collection1 ] o.a.s.u.p.LogUpdateProcessorFactory [collection1]  webapp=null path=null params={}{add=[1]} 0 0
   [junit4]   2> 1279564 INFO  (SUITE-TestCircuitBreaker-seed#[EF641B3816BA276F]-worker) [    x:collection1 ] o.a.s.u.p.LogUpdateProcessorFactory [collection1]  webapp=null path=null params={}{add=[2]} 0 0
   [junit4]   2> 1279565 INFO  (SUITE-TestCircuitBreaker-seed#[EF641B3816BA276F]-worker) [    x:collection1 ] o.a.s.u.p.LogUpdateProcessorFactory [collection1]  webapp=null path=null params={}{add=[3]} 0 0
   [junit4]   2> 1279565 INFO  (SUITE-TestCircuitBreaker-seed#[EF641B3816BA276F]-worker) [    x:collection1 ] o.a.s.u.p.LogUpdateProcessorFactory [collection1]  webapp=null path=null params={}{add=[1]} 0 0
   [junit4]   2> 1279565 INFO  (SUITE-TestCircuitBreaker-seed#[EF641B3816BA276F]-worker) [    x:collection1 ] o.a.s.u.p.LogUpdateProcessorFactory [collection1]  webapp=null path=null params={}{add=[2]} 0 0
   [junit4]   2> 1279565 INFO  (SUITE-TestCircuitBreaker-seed#[EF641B3816BA276F]-worker) [    x:collection1 ] o.a.s.u.p.LogUpdateProcessorFactory [collection1]  webapp=null path=null params={}{add=[3]} 0 0
   [junit4]   2> 1279570 INFO  (searcherExecutor-14891-thread-1-processing-x:collection1) [    x:collection1 ] o.a.s.c.SolrCore [collection1]  Registered new searcher autowarm time: 0 ms
   [junit4]   2> 1279570 INFO  (SUITE-TestCircuitBreaker-seed#[EF641B3816BA276F]-worker) [    x:collection1 ] o.a.s.u.p.LogUpdateProcessorFactory [collection1]  webapp=null path=null params={}{commit=} 0 4
   [junit4]   2> 1279571 INFO  (SUITE-TestCircuitBreaker-seed#[EF641B3816BA276F]-worker) [    x:collection1 ] o.a.s.u.p.LogUpdateProcessorFactory [collection1]  webapp=null path=null params={}{add=[1]} 0 0
   [junit4]   2> 1279571 INFO  (SUITE-TestCircuitBreaker-seed#[EF641B3816BA276F]-worker) [    x:collection1 ] o.a.s.u.p.LogUpdateProcessorFactory [collection1]  webapp=null path=null params={}{add=[2]} 0 0
   [junit4]   2> 1279571 INFO  (SUITE-TestCircuitBreaker-seed#[EF641B3816BA276F]-worker) [    x:collection1 ] o.a.s.u.p.LogUpdateProcessorFactory [collection1]  webapp=null path=null params={}{add=[3]} 0 0
   [junit4]   2> 1279571 INFO  (SUITE-TestCircuitBreaker-seed#[EF641B3816BA276F]-worker) [    x:collection1 ] o.a.s.u.p.LogUpdateProcessorFactory [collection1]  webapp=null path=null params={}{add=[1]} 0 0
   [junit4]   2> 1279572 INFO  (SUITE-TestCircuitBreaker-seed#[EF641B3816BA276F]-worker) [    x:collection1 ] o.a.s.u.p.LogUpdateProcessorFactory [collection1]  webapp=null path=null params={}{add=[2]} 0 0
   [junit4]   2> 1279572 INFO  (SUITE-TestCircuitBreaker-seed#[EF641B3816BA276F]-worker) [    x:collection1 ] o.a.s.u.p.LogUpdateProcessorFactory [collection1]  webapp=null path=null params={}{add=[3]} 0 0
   [junit4]   2> 1279577 INFO  (searcherExecutor-14891-thread-1-processing-x:collection1) [    x:collection1 ] o.a.s.c.SolrCore [collection1]  Registered new searcher autowarm time: 0 ms
   [junit4]   2> 1279577 INFO  (SUITE-TestCircuitBreaker-seed#[EF641B3816BA276F]-worker) [    x:collection1 ] o.a.s.u.p.LogUpdateProcessorFactory [collection1]  webapp=null path=null params={}{commit=} 0 4
   [junit4]   2> 1279577 INFO  (SUITE-TestCircuitBreaker-seed#[EF641B3816BA276F]-worker) [    x:collection1 ] o.a.s.u.p.LogUpdateProcessorFactory [collection1]  webapp=null path=null params={}{add=[1]} 0 0
   [junit4]   2> 1279577 INFO  (SUITE-TestCircuitBreaker-seed#[EF641B3816BA276F]-worker) [    x:collection1 ] o.a.s.u.p.LogUpdateProcessorFactory [collection1]  webapp=null path=null params={}{add=[2]} 0 0
   [junit4]   2> 1279578 INFO  (SUITE-TestCircuitBreaker-seed#[EF641B3816BA276F]-worker) [    x:collection1 ] o.a.s.u.p.LogUpdateProcessorFactory [collection1]  webapp=null path=null params={}{add=[3]} 0 0
   [junit4]   2> 1279578 INFO  (SUITE-TestCircuitBreaker-seed#[EF641B3816BA276F]-worker) [    x:collection1 ] o.a.s.u.p.LogUpdateProcessorFactory [collection1]  webapp=null path=null params={}{add=[1]} 0 0
   [junit4]   2> 1279578 INFO  (SUITE-TestCircuitBreaker-seed#[EF641B3816BA276F]-worker) [    x:collection1 ] o.a.s.u.p.LogUpdateProcessorFactory [collection1]  webapp=null path=null params={}{add=[2]} 0 0
   [junit4]   2> 1279578 INFO  (SUITE-TestCircuitBreaker-seed#[EF641B3816BA276F]-worker) [    x:collection1 ] o.a.s.u.p.LogUpdateProcessorFactory [collection1]  webapp=null path=null params={}{add=[3]} 0 0
   [junit4]   2> 1279583 INFO  (searcherExecutor-14891-thread-1-processing-x:collection1) [    x:collection1 ] o.a.s.c.SolrCore [collection1]  Registered new searcher autowarm time: 0 ms
   [junit4]   2> 1279583 INFO  (SUITE-TestCircuitBreaker-seed#[EF641B3816BA276F]-worker) [    x:collection1 ] o.a.s.u.p.LogUpdateProcessorFactory [collection1]  webapp=null path=null params={}{commit=} 0 4
   [junit4]   2> 1279587 INFO  (TEST-TestCircuitBreaker.testResponseWithCBTiming-seed#[EF641B3816BA276F]) [     ] o.a.s.SolrTestCaseJ4 ###Starting testResponseWithCBTiming
   [junit4]   2> 1279587 INFO  (TEST-TestCircuitBreaker.testResponseWithCBTiming-seed#[EF641B3816BA276F]) [     ] o.a.s.c.S.Request [collection1]  webapp=null path=null params={q=*:*&wt=xml&debugQuery=true} status=503 QTime=0
   [junit4]   2> 1279587 ERROR (TEST-TestCircuitBreaker.testResponseWithCBTiming-seed#[EF641B3816BA276F]) [     ] o.a.s.SolrTestCaseJ4 REQUEST FAILED: q=*:*&wt=xml&debugQuery=true:org.apache.solr.common.SolrException: Circuit Breakers tripped Memory Circuit Breaker triggered as JVM heap usage values are greater than allocated threshold.Seen JVM heap memory usage 394382672 and allocated threshold 392822784
   [junit4]   2> 
   [junit4]   2> 	at org.apache.solr.handler.component.SearchHandler.handleRequestBody(SearchHandler.java:322)
   [junit4]   2> 	at org.apache.solr.handler.RequestHandlerBase.handleRequest(RequestHandlerBase.java:216)
   [junit4]   2> 	at org.apache.solr.core.SolrCore.execute(SolrCore.java:2637)
   [junit4]   2> 	at org.apache.solr.util.TestHarness.query(TestHarness.java:346)
   [junit4]   2> 	at org.apache.solr.util.TestHarness.query(TestHarness.java:328)
   [junit4]   2> 	at org.apache.solr.SolrTestCaseJ4.assertQ(SolrTestCaseJ4.java:997)
   [junit4]   2> 	at org.apache.solr.SolrTestCaseJ4.assertQ(SolrTestCaseJ4.java:983)
   [junit4]   2> 	at org.apache.solr.util.TestCircuitBreaker.testResponseWithCBTiming(TestCircuitBreaker.java:245)
   [junit4]   2> 	at sun.reflect.NativeMethodAccessorImpl.invoke0(Native Method)
   [junit4]   2> 	at sun.reflect.NativeMethodAccessorImpl.invoke(NativeMethodAccessorImpl.java:62)
   [junit4]   2> 	at sun.reflect.DelegatingMethodAccessorImpl.invoke(DelegatingMethodAccessorImpl.java:43)
   [junit4]   2> 	at java.lang.reflect.Method.invoke(Method.java:498)
   [junit4]   2> 	at com.carrotsearch.randomizedtesting.RandomizedRunner.invoke(RandomizedRunner.java:1750)
   [junit4]   2> 	at com.carrotsearch.randomizedtesting.RandomizedRunner$8.evaluate(RandomizedRunner.java:938)
   [junit4]   2> 	at com.carrotsearch.randomizedtesting.RandomizedRunner$9.evaluate(RandomizedRunner.java:974)
   [junit4]   2> 	at com.carrotsearch.randomizedtesting.RandomizedRunner$10.evaluate(RandomizedRunner.java:988)
   [junit4]   2> 	at com.carrotsearch.randomizedtesting.rules.SystemPropertiesRestoreRule$1.evaluate(SystemPropertiesRestoreRule.java:57)
   [junit4]   2> 	at org.junit.rules.RunRules.evaluate(RunRules.java:20)
   [junit4]   2> 	at org.apache.lucene.util.TestRuleSetupTeardownChained$1.evaluate(TestRuleSetupTeardownChained.java:49)
   [junit4]   2> 	at org.apache.lucene.util.AbstractBeforeAfterRule$1.evaluate(AbstractBeforeAfterRule.java:45)
   [junit4]   2> 	at org.apache.lucene.util.TestRuleThreadAndTestName$1.evaluate(TestRuleThreadAndTestName.java:48)
   [junit4]   2> 	at org.apache.lucene.util.TestRuleIgnoreAfterMaxFailures$1.evaluate(TestRuleIgnoreAfterMaxFailures.java:64)
   [junit4]   2> 	at org.apache.lucene.util.TestRuleMarkFailure$1.evaluate(TestRuleMarkFailure.java:47)
   [junit4]   2> 	at org.junit.rules.RunRules.evaluate(RunRules.java:20)
   [junit4]   2> 	at com.carrotsearch.randomizedtesting.rules.StatementAdapter.evaluate(StatementAdapter.java:36)
   [junit4]   2> 	at com.carrotsearch.randomizedtesting.ThreadLeakControl$StatementRunner.run(ThreadLeakControl.java:368)
   [junit4]   2> 	at com.carrotsearch.randomizedtesting.ThreadLeakControl.forkTimeoutingTask(ThreadLeakControl.java:817)
   [junit4]   2> 	at com.carrotsearch.randomizedtesting.ThreadLeakControl$3.evaluate(ThreadLeakControl.java:468)
   [junit4]   2> 	at com.carrotsearch.randomizedtesting.RandomizedRunner.runSingleTest(RandomizedRunner.java:947)
   [junit4]   2> 	at com.carrotsearch.randomizedtesting.RandomizedRunner$5.evaluate(RandomizedRunner.java:832)
   [junit4]   2> 	at com.carrotsearch.randomizedtesting.RandomizedRunner$6.evaluate(RandomizedRunner.java:883)
   [junit4]   2> 	at com.carrotsearch.randomizedtesting.RandomizedRunner$7.evaluate(RandomizedRunner.java:894)
   [junit4]   2> 	at com.carrotsearch.randomizedtesting.rules.StatementAdapter.evaluate(StatementAdapter.java:36)
   [junit4]   2> 	at com.carrotsearch.randomizedtesting.rules.SystemPropertiesRestoreRule$1.evaluate(SystemPropertiesRestoreRule.java:57)
   [junit4]   2> 	at org.junit.rules.RunRules.evaluate(RunRules.java:20)
   [junit4]   2> 	at org.apache.lucene.util.AbstractBeforeAfterRule$1.evaluate(AbstractBeforeAfterRule.java:45)
   [junit4]   2> 	at com.carrotsearch.randomizedtesting.rules.StatementAdapter.evaluate(StatementAdapter.java:36)
   [junit4]   2> 	at org.apache.lucene.util.TestRuleStoreClassName$1.evaluate(TestRuleStoreClassName.java:41)
   [junit4]   2> 	at com.carrotsearch.randomizedtesting.rules.NoShadowingOrOverridesOnMethodsRule$1.evaluate(NoShadowingOrOverridesOnMethodsRule.java:40)
   [junit4]   2> 	at com.carrotsearch.randomizedtesting.rules.NoShadowingOrOverridesOnMethodsRule$1.evaluate(NoShadowingOrOverridesOnMethodsRule.java:40)
   [junit4]   2> 	at com.carrotsearch.randomizedtesting.rules.StatementAdapter.evaluate(StatementAdapter.java:36)
   [junit4]   2> 	at com.carrotsearch.randomizedtesting.rules.StatementAdapter.evaluate(StatementAdapter.java:36)
   [junit4]   2> 	at com.carrotsearch.randomizedtesting.rules.StatementAdapter.evaluate(StatementAdapter.java:36)
   [junit4]   2> 	at org.apache.lucene.util.TestRuleAssertionsRequired$1.evaluate(TestRuleAssertionsRequired.java:53)
   [junit4]   2> 	at org.apache.lucene.util.TestRuleMarkFailure$1.evaluate(TestRuleMarkFailure.java:47)
   [junit4]   2> 	at org.apache.lucene.util.TestRuleIgnoreAfterMaxFailures$1.evaluate(TestRuleIgnoreAfterMaxFailures.java:64)
   [junit4]   2> 	at org.apache.lucene.util.TestRuleIgnoreTestSuites$1.evaluate(TestRuleIgnoreTestSuites.java:54)
   [junit4]   2> 	at org.junit.rules.RunRules.evaluate(RunRules.java:20)
   [junit4]   2> 	at com.carrotsearch.randomizedtesting.rules.StatementAdapter.evaluate(StatementAdapter.java:36)
   [junit4]   2> 	at com.carrotsearch.randomizedtesting.ThreadLeakControl$StatementRunner.run(ThreadLeakControl.java:368)
   [junit4]   2> 	at java.lang.Thread.run(Thread.java:748)
   [junit4]   2> 
   [junit4]   2> 1279588 INFO  (TEST-TestCircuitBreaker.testResponseWithCBTiming-seed#[EF641B3816BA276F]) [     ] o.a.s.SolrTestCaseJ4 ###Ending testResponseWithCBTiming
   [junit4]   2> NOTE: reproduce with: ant test  -Dtestcase=TestCircuitBreaker -Dtests.method=testResponseWithCBTiming -Dtests.seed=EF641B3816BA276F -Dtests.multiplier=2 -Dtests.slow=true -Dtests.locale=fr-BE -Dtests.timezone=America/Porto_Acre -Dtests.asserts=true -Dtests.file.encoding=UTF-8
   [junit4] ERROR   0.01s J1 | TestCircuitBreaker.testResponseWithCBTiming <<<
   [junit4]    > Throwable #1: java.lang.RuntimeException: Exception during query
   [junit4]    > 	at __randomizedtesting.SeedInfo.seed([EF641B3816BA276F:7B8B6DAE5523D4F]:0)
   [junit4]    > 	at org.apache.solr.SolrTestCaseJ4.assertQ(SolrTestCaseJ4.java:1023)
   [junit4]    > 	at org.apache.solr.SolrTestCaseJ4.assertQ(SolrTestCaseJ4.java:983)
   [junit4]    > 	at org.apache.solr.util.TestCircuitBreaker.testResponseWithCBTiming(TestCircuitBreaker.java:245)
   [junit4]    > 	at java.lang.Thread.run(Thread.java:748)
   [junit4]    > Caused by: org.apache.solr.common.SolrException: Circuit Breakers tripped Memory Circuit Breaker triggered as JVM heap usage values are greater than allocated threshold.Seen JVM heap memory usage 394382672 and allocated threshold 392822784
   [junit4]    > 	at org.apache.solr.handler.component.SearchHandler.handleRequestBody(SearchHandler.java:322)
   [junit4]    > 	at org.apache.solr.handler.RequestHandlerBase.handleRequest(RequestHandlerBase.java:216)
   [junit4]    > 	at org.apache.solr.core.SolrCore.execute(SolrCore.java:2637)
   [junit4]    > 	at org.apache.solr.util.TestHarness.query(TestHarness.java:346)
   [junit4]    > 	at org.apache.solr.util.TestHarness.query(TestHarness.java:328)
   [junit4]    > 	at org.apache.solr.SolrTestCaseJ4.assertQ(SolrTestCaseJ4.java:997)
   [junit4]    > 	... 45 more
   [junit4]   2> 1279594 INFO  (TEST-TestCircuitBreaker.testCBFakeMemoryPressure-seed#[EF641B3816BA276F]) [     ] o.a.s.SolrTestCaseJ4 ###Starting testCBFakeMemoryPressure
   [junit4]   2> 1279594 INFO  (TEST-TestCircuitBreaker.testCBFakeMemoryPressure-seed#[EF641B3816BA276F]) [     ] o.a.s.c.S.Request [collection1]  webapp=null path=null params={q=name:"john+smith"&qt=&start=0&rows=20&version=2.2} status=503 QTime=0
   [junit4]   2> 1279595 INFO  (TEST-TestCircuitBreaker.testCBFakeMemoryPressure-seed#[EF641B3816BA276F]) [     ] o.a.s.SolrTestCaseJ4 ###Ending testCBFakeMemoryPressure
   [junit4]   2> 1279599 INFO  (TEST-TestCircuitBreaker.testBuildingMemoryPressure-seed#[EF641B3816BA276F]) [     ] o.a.s.SolrTestCaseJ4 ###Starting testBuildingMemoryPressure
   [junit4]   2> 1279600 INFO  (TestCircuitBreaker-14895-thread-2) [     ] o.a.s.c.S.Request [collection1]  webapp=null path=null params={q=name:"john+smith"&qt=&start=0&rows=20&version=2.2} hits=0 status=0 QTime=0
   [junit4]   2> 1279601 INFO  (TestCircuitBreaker-14895-thread-1) [     ] o.a.s.c.S.Request [collection1]  webapp=null path=null params={q=name:"john+smith"&qt=&start=0&rows=20&version=2.2} hits=0 status=0 QTime=1
   [junit4]   2> 1279606 INFO  (TestCircuitBreaker-14895-thread-2) [     ] o.a.s.c.S.Request [collection1]  webapp=null path=null params={q=name:"john+smith"&qt=&start=0&rows=20&version=2.2} hits=0 status=0 QTime=0
   [junit4]   2> 1279608 INFO  (TestCircuitBreaker-14895-thread-1) [     ] o.a.s.c.S.Request [collection1]  webapp=null path=null params={q=name:"john+smith"&qt=&start=0&rows=20&version=2.2} hits=0 status=0 QTime=2
   [junit4]   2> 1279614 INFO  (TestCircuitBreaker-14895-thread-3) [     ] o.a.s.c.S.Request [collection1]  webapp=null path=null params={q=name:"john+smith"&qt=&start=0&rows=20&version=2.2} status=503 QTime=0
   [junit4]   2> 1279615 INFO  (TEST-TestCircuitBreaker.testBuildingMemoryPressure-seed#[EF641B3816BA276F]) [     ] o.a.s.SolrTestCaseJ4 ###Ending testBuildingMemoryPressure
   [junit4]   2> 1279618 INFO  (TEST-TestCircuitBreaker.testCBAlwaysTrips-seed#[EF641B3816BA276F]) [     ] o.a.s.SolrTestCaseJ4 ###Starting testCBAlwaysTrips
   [junit4]   2> 1279619 INFO  (TEST-TestCircuitBreaker.testCBAlwaysTrips-seed#[EF641B3816BA276F]) [     ] o.a.s.c.S.Request [collection1]  webapp=null path=null params={q=name:"john+smith"&qt=&start=0&rows=20&version=2.2} status=503 QTime=0
   [junit4]   2> 1279619 INFO  (TEST-TestCircuitBreaker.testCBAlwaysTrips-seed#[EF641B3816BA276F]) [     ] o.a.s.SolrTestCaseJ4 ###Ending testCBAlwaysTrips
   [junit4]   2> 1279623 INFO  (TEST-TestCircuitBreaker.testFakeCPUCircuitBreaker-seed#[EF641B3816BA276F]) [     ] o.a.s.SolrTestCaseJ4 ###Starting testFakeCPUCircuitBreaker
   [junit4]   2> 1279623 INFO  (TestCircuitBreaker-14896-thread-1) [     ] o.a.s.c.S.Request [collection1]  webapp=null path=null params={q=name:"john+smith"&qt=&start=0&rows=20&version=2.2} status=503 QTime=0
   [junit4]   2> 1279623 INFO  (TestCircuitBreaker-14896-thread-1) [     ] o.a.s.c.S.Request [collection1]  webapp=null path=null params={q=name:"john+smith"&qt=&start=0&rows=20&version=2.2} status=503 QTime=0
   [junit4]   2> 1279626 INFO  (TestCircuitBreaker-14896-thread-2) [     ] o.a.s.c.S.Request [collection1]  webapp=null path=null params={q=name:"john+smith"&qt=&start=0&rows=20&version=2.2} status=503 QTime=0
   [junit4]   2> 1279635 INFO  (TestCircuitBreaker-14896-thread-2) [     ] o.a.s.c.S.Request [collection1]  webapp=null path=null params={q=name:"john+smith"&qt=&start=0&rows=20&version=2.2} status=503 QTime=0
   [junit4]   2> 1279638 INFO  (TestCircuitBreaker-14896-thread-3) [     ] o.a.s.c.S.Request [collection1]  webapp=null path=null params={q=name:"john+smith"&qt=&start=0&rows=20&version=2.2} status=503 QTime=0
   [junit4]   2> 1279639 INFO  (TEST-TestCircuitBreaker.testFakeCPUCircuitBreaker-seed#[EF641B3816BA276F]) [     ] o.a.s.SolrTestCaseJ4 ###Ending testFakeCPUCircuitBreaker
   [junit4]   2> 1279639 INFO  (SUITE-TestCircuitBreaker-seed#[EF641B3816BA276F]-worker) [     ] o.a.s.SolrTestCaseJ4 ###deleteCore
   [junit4]   2> 1279639 INFO  (SUITE-TestCircuitBreaker-seed#[EF641B3816BA276F]-worker) [     ] o.a.s.c.CoreContainer Shutting down CoreContainer instance=297021391
   [junit4]   2> 1279639 INFO  (coreCloseExecutor-14898-thread-1) [     ] o.a.s.c.SolrCore [collection1]  CLOSING SolrCore org.apache.solr.core.SolrCore@32fcf344
   [junit4]   2> 1279639 INFO  (coreCloseExecutor-14898-thread-1) [     ] o.a.s.m.SolrMetricManager Closing metric reporters for registry=solr.core.collection1 tag=SolrCore@32fcf344
   [junit4]   2> 1279639 INFO  (coreCloseExecutor-14898-thread-1) [     ] o.a.s.m.r.SolrJmxReporter Closing reporter [org.apache.solr.metrics.reporters.SolrJmxReporter@65eebddc: rootName = null, domain = solr.core.collection1, service url = null, agent id = null] for registry solr.core.collection1/com.codahale.metrics.MetricRegistry@19b098ff
   [junit4]   2> 1279651 INFO  (coreCloseExecutor-14898-thread-1) [     ] o.a.s.u.DirectUpdateHandler2 Committing on IndexWriter.close()  ... SKIPPED (unnecessary).
   [junit4]   2> 1279652 INFO  (SUITE-TestCircuitBreaker-seed#[EF641B3816BA276F]-worker) [     ] o.a.s.m.SolrMetricManager Closing metric reporters for registry=solr.node tag=null
   [junit4]   2> 1279652 INFO  (SUITE-TestCircuitBreaker-seed#[EF641B3816BA276F]-worker) [     ] o.a.s.m.r.SolrJmxReporter Closing reporter [org.apache.solr.metrics.reporters.SolrJmxReporter@c951b0a: rootName = null, domain = solr.node, service url = null, agent id = null] for registry solr.node/com.codahale.metrics.MetricRegistry@7e1c7fdb
   [junit4]   2> 1279657 INFO  (SUITE-TestCircuitBreaker-seed#[EF641B3816BA276F]-worker) [     ] o.a.s.m.SolrMetricManager Closing metric reporters for registry=solr.jvm tag=null
   [junit4]   2> 1279657 INFO  (SUITE-TestCircuitBreaker-seed#[EF641B3816BA276F]-worker) [     ] o.a.s.m.r.SolrJmxReporter Closing reporter [org.apache.solr.metrics.reporters.SolrJmxReporter@53e0ea03: rootName = null, domain = solr.jvm, service url = null, agent id = null] for registry solr.jvm/com.codahale.metrics.MetricRegistry@1ceaccff
   [junit4]   2> 1279659 INFO  (SUITE-TestCircuitBreaker-seed#[EF641B3816BA276F]-worker) [     ] o.a.s.m.SolrMetricManager Closing metric reporters for registry=solr.jetty tag=null
   [junit4]   2> 1279659 INFO  (SUITE-TestCircuitBreaker-seed#[EF641B3816BA276F]-worker) [     ] o.a.s.m.r.SolrJmxReporter Closing reporter [org.apache.solr.metrics.reporters.SolrJmxReporter@2241045d: rootName = null, domain = solr.jetty, service url = null, agent id = null] for registry solr.jetty/com.codahale.metrics.MetricRegistry@208729ef
   [junit4]   2> NOTE: leaving temporary files on disk at: /home/jenkins/jenkins-slave/workspace/Lucene/Lucene-Solr-Tests-8.x/solr/build/solr-core/test/J1/temp/solr.util.TestCircuitBreaker_EF641B3816BA276F-001
   [junit4]   2> NOTE: test params are: codec=DummyCompressingStoredFieldsData(storedFieldsFormat=CompressingStoredFieldsFormat(compressionMode=DUMMY, chunkSize=3097, maxDocsPerChunk=419, blockShift=3), termVectorsFormat=CompressingTermVectorsFormat(compressionMode=DUMMY, chunkSize=3097, blockSize=3)), sim=Asserting(RandomSimilarity(queryNorm=true): {}), locale=fr-BE, timezone=America/Porto_Acre
   [junit4]   2> NOTE: Linux 4.15.0-112-generic amd64/Oracle Corporation 1.8.0_281 (64-bit)/cpus=4,threads=1,free=107687056,total=525336576
   [junit4]   2> NOTE: All tests run in this JVM: [BigEndianAscendingWordSerializerTest, ZkStateWriterTest, DocValuesNotIndexedTest, TestSolrCloudWithKerberosAlt, AssignBackwardCompatibilityTest, TestSweetSpotSimilarityFactory, TimeRoutedAliasUpdateProcessorTest, TestNestedUpdateProcessor, TestManagedSynonymGraphFilterFactory, SortByFunctionTest, TestRawTransformer, BJQFilterAccessibleTest, RoutingToNodesWithPropertiesTest, TestBM25SimilarityFactory, TestFieldCacheVsDocValues, TestCSVResponseWriter, TestQueryTypes, CdcrBootstrapTest, BasicFunctionalityTest, AsyncCallRequestStatusResponseTest, AutoScalingHandlerTest, ZookeeperStatusHandlerTest, TestFieldSortValues, MultiDestinationAuditLoggerTest, TestStreamBody, CoreAdminHandlerTest, TestDFRSimilarityFactory, TestJsonFacetsStatsParsing, TestSimUtils, TestCloudDeleteByQuery, TestRestoreCore, CdcrUpdateLogTest, DirectSolrSpellCheckerTest, TestManagedSchemaThreadSafety, TestOverriddenPrefixQueryForCustomFieldType, TestHashPartitioner, PurgeGraphTest, ResourceLoaderTest, StressHdfsTest, TestStressLucene, TestBulkSchemaConcurrent, LeaderTragicEventTest, TestExactSharedStatsCache, CreateRoutedAliasTest, TestMinHashQParser, DirectoryFactoriesTest, TaggingAttributeTest, SolrCloudReportersTest, TestTolerantUpdateProcessorRandomCloud, TestInPlaceUpdatesDistrib, SearchRateTriggerTest, JWTAuthPluginIntegrationTest, CollectionsAPISolrJTest, TestCloudNestedDocsSort, TestAddFieldRealTimeGet, TestReversedWildcardFilterFactory, DistributedFacetPivotSmallTest, ClusterStateTest, TermsComponentTest, ReindexCollectionTest, DistributedFacetExistsSmallTest, TestSortByMinMaxFunction, TestDistributedMap, RangeFacetCloudTest, TestCoreContainer, HLLSerializationTest, TestJoin, TestCollectionAPI, ShardRoutingTest, AtomicUpdatesTest, TestComplexPhraseLeadingWildcard, TestStressVersions, HdfsDirectoryTest, TestObjectReleaseTracker, IgnoreLargeDocumentProcessorFactoryTest, TestMergePolicyConfig, TestZkChroot, TestNumericTerms64, SystemInfoHandlerTest, DeleteReplicaTest, PackageManagerCLITest, TestSolrXml, TestSchemaManager, SearchHandlerTest, MetricTriggerIntegrationTest, OverseerCollectionConfigSetProcessorTest, RankFieldTest, TestMiniSolrCloudClusterSSL, TestGraphTermsQParserPlugin, TriggerEventQueueTest, TestRecoveryHdfs, TestMultiValuedNumericRangeQuery, DistributedQueryComponentOptimizationTest, PhrasesIdentificationComponentTest, SolrCLIZkUtilsTest, ByteBuffersDirectoryFactoryTest, ReplicationFactorTest, HdfsThreadLeakTest, TestUnifiedSolrHighlighter, TestQuerySenderNoQuery, TestLFUCache, RequestLoggingTest, TestLegacyField, TestSimExtremeIndexing, TestConfigReload, SuggestComponentContextFilterQueryTest, ChangedSchemaMergeTest, NestedShardedAtomicUpdateTest, TestFileDictionaryLookup, TestCircuitBreaker]
   [junit4] Completed [484/936 (1!)] on J1 in 1.51s, 5 tests, 1 error <<< FAILURES!

[...truncated 52357 lines...]

Mime
View raw message