lucene-builds mailing list archives

Site index · List index
Message view « Date » · « Thread »
Top « Date » · « Thread »
From Policeman Jenkins Server <jenk...@thetaphi.de>
Subject [JENKINS] Lucene-Solr-8.x-Linux (32bit/jdk1.8.0_201) - Build # 4952 - Unstable!
Date Mon, 09 Nov 2020 17:00:10 GMT
Build: https://jenkins.thetaphi.de/job/Lucene-Solr-8.x-Linux/4952/
Java: 32bit/jdk1.8.0_201 -server -XX:+UseParallelGC

6 tests failed.
FAILED:  org.apache.solr.TestRandomDVFaceting.testRandomFaceting

Error Message:
mismatch: 'FGCZ'!='GCEU' @ facet_counts/facet_fields/id/[2]

Stack Trace:
java.lang.AssertionError: mismatch: 'FGCZ'!='GCEU' @ facet_counts/facet_fields/id/[2]
	at __randomizedtesting.SeedInfo.seed([135736BDCE8CA2EF:1E3F16689B756A50]:0)
	at org.junit.Assert.fail(Assert.java:89)
	at org.apache.solr.TestRandomDVFaceting.doFacetTests(TestRandomDVFaceting.java:292)
	at org.apache.solr.TestRandomDVFaceting.doFacetTests(TestRandomDVFaceting.java:175)
	at org.apache.solr.TestRandomDVFaceting.testRandomFaceting(TestRandomDVFaceting.java:158)
	at sun.reflect.NativeMethodAccessorImpl.invoke0(Native Method)
	at sun.reflect.NativeMethodAccessorImpl.invoke(NativeMethodAccessorImpl.java:62)
	at sun.reflect.DelegatingMethodAccessorImpl.invoke(DelegatingMethodAccessorImpl.java:43)
	at java.lang.reflect.Method.invoke(Method.java:498)
	at com.carrotsearch.randomizedtesting.RandomizedRunner.invoke(RandomizedRunner.java:1750)
	at com.carrotsearch.randomizedtesting.RandomizedRunner$8.evaluate(RandomizedRunner.java:938)
	at com.carrotsearch.randomizedtesting.RandomizedRunner$9.evaluate(RandomizedRunner.java:974)
	at com.carrotsearch.randomizedtesting.RandomizedRunner$10.evaluate(RandomizedRunner.java:988)
	at com.carrotsearch.randomizedtesting.rules.SystemPropertiesRestoreRule$1.evaluate(SystemPropertiesRestoreRule.java:57)
	at org.junit.rules.RunRules.evaluate(RunRules.java:20)
	at org.apache.lucene.util.TestRuleSetupTeardownChained$1.evaluate(TestRuleSetupTeardownChained.java:49)
	at org.apache.lucene.util.AbstractBeforeAfterRule$1.evaluate(AbstractBeforeAfterRule.java:45)
	at org.apache.lucene.util.TestRuleThreadAndTestName$1.evaluate(TestRuleThreadAndTestName.java:48)
	at org.apache.lucene.util.TestRuleIgnoreAfterMaxFailures$1.evaluate(TestRuleIgnoreAfterMaxFailures.java:64)
	at org.apache.lucene.util.TestRuleMarkFailure$1.evaluate(TestRuleMarkFailure.java:47)
	at org.junit.rules.RunRules.evaluate(RunRules.java:20)
	at com.carrotsearch.randomizedtesting.rules.StatementAdapter.evaluate(StatementAdapter.java:36)
	at com.carrotsearch.randomizedtesting.ThreadLeakControl$StatementRunner.run(ThreadLeakControl.java:368)
	at com.carrotsearch.randomizedtesting.ThreadLeakControl.forkTimeoutingTask(ThreadLeakControl.java:817)
	at com.carrotsearch.randomizedtesting.ThreadLeakControl$3.evaluate(ThreadLeakControl.java:468)
	at com.carrotsearch.randomizedtesting.RandomizedRunner.runSingleTest(RandomizedRunner.java:947)
	at com.carrotsearch.randomizedtesting.RandomizedRunner$5.evaluate(RandomizedRunner.java:832)
	at com.carrotsearch.randomizedtesting.RandomizedRunner$6.evaluate(RandomizedRunner.java:883)
	at com.carrotsearch.randomizedtesting.RandomizedRunner$7.evaluate(RandomizedRunner.java:894)
	at com.carrotsearch.randomizedtesting.rules.StatementAdapter.evaluate(StatementAdapter.java:36)
	at com.carrotsearch.randomizedtesting.rules.SystemPropertiesRestoreRule$1.evaluate(SystemPropertiesRestoreRule.java:57)
	at org.junit.rules.RunRules.evaluate(RunRules.java:20)
	at org.apache.lucene.util.AbstractBeforeAfterRule$1.evaluate(AbstractBeforeAfterRule.java:45)
	at com.carrotsearch.randomizedtesting.rules.StatementAdapter.evaluate(StatementAdapter.java:36)
	at org.apache.lucene.util.TestRuleStoreClassName$1.evaluate(TestRuleStoreClassName.java:41)
	at com.carrotsearch.randomizedtesting.rules.NoShadowingOrOverridesOnMethodsRule$1.evaluate(NoShadowingOrOverridesOnMethodsRule.java:40)
	at com.carrotsearch.randomizedtesting.rules.NoShadowingOrOverridesOnMethodsRule$1.evaluate(NoShadowingOrOverridesOnMethodsRule.java:40)
	at com.carrotsearch.randomizedtesting.rules.StatementAdapter.evaluate(StatementAdapter.java:36)
	at com.carrotsearch.randomizedtesting.rules.StatementAdapter.evaluate(StatementAdapter.java:36)
	at com.carrotsearch.randomizedtesting.rules.StatementAdapter.evaluate(StatementAdapter.java:36)
	at org.apache.lucene.util.TestRuleAssertionsRequired$1.evaluate(TestRuleAssertionsRequired.java:53)
	at org.apache.lucene.util.TestRuleMarkFailure$1.evaluate(TestRuleMarkFailure.java:47)
	at org.apache.lucene.util.TestRuleIgnoreAfterMaxFailures$1.evaluate(TestRuleIgnoreAfterMaxFailures.java:64)
	at org.apache.lucene.util.TestRuleIgnoreTestSuites$1.evaluate(TestRuleIgnoreTestSuites.java:54)
	at org.junit.rules.RunRules.evaluate(RunRules.java:20)
	at com.carrotsearch.randomizedtesting.rules.StatementAdapter.evaluate(StatementAdapter.java:36)
	at com.carrotsearch.randomizedtesting.ThreadLeakControl$StatementRunner.run(ThreadLeakControl.java:368)
	at java.lang.Thread.run(Thread.java:748)


FAILED:  org.apache.solr.TestRandomDVFaceting.testRandomFaceting

Error Message:
mismatch: 'FGCZ'!='GCEU' @ facet_counts/facet_fields/id/[2]

Stack Trace:
java.lang.AssertionError: mismatch: 'FGCZ'!='GCEU' @ facet_counts/facet_fields/id/[2]
	at __randomizedtesting.SeedInfo.seed([135736BDCE8CA2EF:1E3F16689B756A50]:0)
	at org.junit.Assert.fail(Assert.java:89)
	at org.apache.solr.TestRandomDVFaceting.doFacetTests(TestRandomDVFaceting.java:292)
	at org.apache.solr.TestRandomDVFaceting.doFacetTests(TestRandomDVFaceting.java:175)
	at org.apache.solr.TestRandomDVFaceting.testRandomFaceting(TestRandomDVFaceting.java:158)
	at sun.reflect.NativeMethodAccessorImpl.invoke0(Native Method)
	at sun.reflect.NativeMethodAccessorImpl.invoke(NativeMethodAccessorImpl.java:62)
	at sun.reflect.DelegatingMethodAccessorImpl.invoke(DelegatingMethodAccessorImpl.java:43)
	at java.lang.reflect.Method.invoke(Method.java:498)
	at com.carrotsearch.randomizedtesting.RandomizedRunner.invoke(RandomizedRunner.java:1750)
	at com.carrotsearch.randomizedtesting.RandomizedRunner$8.evaluate(RandomizedRunner.java:938)
	at com.carrotsearch.randomizedtesting.RandomizedRunner$9.evaluate(RandomizedRunner.java:974)
	at com.carrotsearch.randomizedtesting.RandomizedRunner$10.evaluate(RandomizedRunner.java:988)
	at com.carrotsearch.randomizedtesting.rules.SystemPropertiesRestoreRule$1.evaluate(SystemPropertiesRestoreRule.java:57)
	at org.junit.rules.RunRules.evaluate(RunRules.java:20)
	at org.apache.lucene.util.TestRuleSetupTeardownChained$1.evaluate(TestRuleSetupTeardownChained.java:49)
	at org.apache.lucene.util.AbstractBeforeAfterRule$1.evaluate(AbstractBeforeAfterRule.java:45)
	at org.apache.lucene.util.TestRuleThreadAndTestName$1.evaluate(TestRuleThreadAndTestName.java:48)
	at org.apache.lucene.util.TestRuleIgnoreAfterMaxFailures$1.evaluate(TestRuleIgnoreAfterMaxFailures.java:64)
	at org.apache.lucene.util.TestRuleMarkFailure$1.evaluate(TestRuleMarkFailure.java:47)
	at org.junit.rules.RunRules.evaluate(RunRules.java:20)
	at com.carrotsearch.randomizedtesting.rules.StatementAdapter.evaluate(StatementAdapter.java:36)
	at com.carrotsearch.randomizedtesting.ThreadLeakControl$StatementRunner.run(ThreadLeakControl.java:368)
	at com.carrotsearch.randomizedtesting.ThreadLeakControl.forkTimeoutingTask(ThreadLeakControl.java:817)
	at com.carrotsearch.randomizedtesting.ThreadLeakControl$3.evaluate(ThreadLeakControl.java:468)
	at com.carrotsearch.randomizedtesting.RandomizedRunner.runSingleTest(RandomizedRunner.java:947)
	at com.carrotsearch.randomizedtesting.RandomizedRunner$5.evaluate(RandomizedRunner.java:832)
	at com.carrotsearch.randomizedtesting.RandomizedRunner$6.evaluate(RandomizedRunner.java:883)
	at com.carrotsearch.randomizedtesting.RandomizedRunner$7.evaluate(RandomizedRunner.java:894)
	at com.carrotsearch.randomizedtesting.rules.StatementAdapter.evaluate(StatementAdapter.java:36)
	at com.carrotsearch.randomizedtesting.rules.SystemPropertiesRestoreRule$1.evaluate(SystemPropertiesRestoreRule.java:57)
	at org.junit.rules.RunRules.evaluate(RunRules.java:20)
	at org.apache.lucene.util.AbstractBeforeAfterRule$1.evaluate(AbstractBeforeAfterRule.java:45)
	at com.carrotsearch.randomizedtesting.rules.StatementAdapter.evaluate(StatementAdapter.java:36)
	at org.apache.lucene.util.TestRuleStoreClassName$1.evaluate(TestRuleStoreClassName.java:41)
	at com.carrotsearch.randomizedtesting.rules.NoShadowingOrOverridesOnMethodsRule$1.evaluate(NoShadowingOrOverridesOnMethodsRule.java:40)
	at com.carrotsearch.randomizedtesting.rules.NoShadowingOrOverridesOnMethodsRule$1.evaluate(NoShadowingOrOverridesOnMethodsRule.java:40)
	at com.carrotsearch.randomizedtesting.rules.StatementAdapter.evaluate(StatementAdapter.java:36)
	at com.carrotsearch.randomizedtesting.rules.StatementAdapter.evaluate(StatementAdapter.java:36)
	at com.carrotsearch.randomizedtesting.rules.StatementAdapter.evaluate(StatementAdapter.java:36)
	at org.apache.lucene.util.TestRuleAssertionsRequired$1.evaluate(TestRuleAssertionsRequired.java:53)
	at org.apache.lucene.util.TestRuleMarkFailure$1.evaluate(TestRuleMarkFailure.java:47)
	at org.apache.lucene.util.TestRuleIgnoreAfterMaxFailures$1.evaluate(TestRuleIgnoreAfterMaxFailures.java:64)
	at org.apache.lucene.util.TestRuleIgnoreTestSuites$1.evaluate(TestRuleIgnoreTestSuites.java:54)
	at org.junit.rules.RunRules.evaluate(RunRules.java:20)
	at com.carrotsearch.randomizedtesting.rules.StatementAdapter.evaluate(StatementAdapter.java:36)
	at com.carrotsearch.randomizedtesting.ThreadLeakControl$StatementRunner.run(ThreadLeakControl.java:368)
	at java.lang.Thread.run(Thread.java:748)


FAILED:  org.apache.solr.TestRandomDVFaceting.testRandomFaceting

Error Message:
mismatch: 'FGCZ'!='GCEU' @ facet_counts/facet_fields/id/[2]

Stack Trace:
java.lang.AssertionError: mismatch: 'FGCZ'!='GCEU' @ facet_counts/facet_fields/id/[2]
	at __randomizedtesting.SeedInfo.seed([135736BDCE8CA2EF:1E3F16689B756A50]:0)
	at org.junit.Assert.fail(Assert.java:89)
	at org.apache.solr.TestRandomDVFaceting.doFacetTests(TestRandomDVFaceting.java:292)
	at org.apache.solr.TestRandomDVFaceting.doFacetTests(TestRandomDVFaceting.java:175)
	at org.apache.solr.TestRandomDVFaceting.testRandomFaceting(TestRandomDVFaceting.java:158)
	at sun.reflect.NativeMethodAccessorImpl.invoke0(Native Method)
	at sun.reflect.NativeMethodAccessorImpl.invoke(NativeMethodAccessorImpl.java:62)
	at sun.reflect.DelegatingMethodAccessorImpl.invoke(DelegatingMethodAccessorImpl.java:43)
	at java.lang.reflect.Method.invoke(Method.java:498)
	at com.carrotsearch.randomizedtesting.RandomizedRunner.invoke(RandomizedRunner.java:1750)
	at com.carrotsearch.randomizedtesting.RandomizedRunner$8.evaluate(RandomizedRunner.java:938)
	at com.carrotsearch.randomizedtesting.RandomizedRunner$9.evaluate(RandomizedRunner.java:974)
	at com.carrotsearch.randomizedtesting.RandomizedRunner$10.evaluate(RandomizedRunner.java:988)
	at com.carrotsearch.randomizedtesting.rules.SystemPropertiesRestoreRule$1.evaluate(SystemPropertiesRestoreRule.java:57)
	at org.junit.rules.RunRules.evaluate(RunRules.java:20)
	at org.apache.lucene.util.TestRuleSetupTeardownChained$1.evaluate(TestRuleSetupTeardownChained.java:49)
	at org.apache.lucene.util.AbstractBeforeAfterRule$1.evaluate(AbstractBeforeAfterRule.java:45)
	at org.apache.lucene.util.TestRuleThreadAndTestName$1.evaluate(TestRuleThreadAndTestName.java:48)
	at org.apache.lucene.util.TestRuleIgnoreAfterMaxFailures$1.evaluate(TestRuleIgnoreAfterMaxFailures.java:64)
	at org.apache.lucene.util.TestRuleMarkFailure$1.evaluate(TestRuleMarkFailure.java:47)
	at org.junit.rules.RunRules.evaluate(RunRules.java:20)
	at com.carrotsearch.randomizedtesting.rules.StatementAdapter.evaluate(StatementAdapter.java:36)
	at com.carrotsearch.randomizedtesting.ThreadLeakControl$StatementRunner.run(ThreadLeakControl.java:368)
	at com.carrotsearch.randomizedtesting.ThreadLeakControl.forkTimeoutingTask(ThreadLeakControl.java:817)
	at com.carrotsearch.randomizedtesting.ThreadLeakControl$3.evaluate(ThreadLeakControl.java:468)
	at com.carrotsearch.randomizedtesting.RandomizedRunner.runSingleTest(RandomizedRunner.java:947)
	at com.carrotsearch.randomizedtesting.RandomizedRunner$5.evaluate(RandomizedRunner.java:832)
	at com.carrotsearch.randomizedtesting.RandomizedRunner$6.evaluate(RandomizedRunner.java:883)
	at com.carrotsearch.randomizedtesting.RandomizedRunner$7.evaluate(RandomizedRunner.java:894)
	at com.carrotsearch.randomizedtesting.rules.StatementAdapter.evaluate(StatementAdapter.java:36)
	at com.carrotsearch.randomizedtesting.rules.SystemPropertiesRestoreRule$1.evaluate(SystemPropertiesRestoreRule.java:57)
	at org.junit.rules.RunRules.evaluate(RunRules.java:20)
	at org.apache.lucene.util.AbstractBeforeAfterRule$1.evaluate(AbstractBeforeAfterRule.java:45)
	at com.carrotsearch.randomizedtesting.rules.StatementAdapter.evaluate(StatementAdapter.java:36)
	at org.apache.lucene.util.TestRuleStoreClassName$1.evaluate(TestRuleStoreClassName.java:41)
	at com.carrotsearch.randomizedtesting.rules.NoShadowingOrOverridesOnMethodsRule$1.evaluate(NoShadowingOrOverridesOnMethodsRule.java:40)
	at com.carrotsearch.randomizedtesting.rules.NoShadowingOrOverridesOnMethodsRule$1.evaluate(NoShadowingOrOverridesOnMethodsRule.java:40)
	at com.carrotsearch.randomizedtesting.rules.StatementAdapter.evaluate(StatementAdapter.java:36)
	at com.carrotsearch.randomizedtesting.rules.StatementAdapter.evaluate(StatementAdapter.java:36)
	at com.carrotsearch.randomizedtesting.rules.StatementAdapter.evaluate(StatementAdapter.java:36)
	at org.apache.lucene.util.TestRuleAssertionsRequired$1.evaluate(TestRuleAssertionsRequired.java:53)
	at org.apache.lucene.util.TestRuleMarkFailure$1.evaluate(TestRuleMarkFailure.java:47)
	at org.apache.lucene.util.TestRuleIgnoreAfterMaxFailures$1.evaluate(TestRuleIgnoreAfterMaxFailures.java:64)
	at org.apache.lucene.util.TestRuleIgnoreTestSuites$1.evaluate(TestRuleIgnoreTestSuites.java:54)
	at org.junit.rules.RunRules.evaluate(RunRules.java:20)
	at com.carrotsearch.randomizedtesting.rules.StatementAdapter.evaluate(StatementAdapter.java:36)
	at com.carrotsearch.randomizedtesting.ThreadLeakControl$StatementRunner.run(ThreadLeakControl.java:368)
	at java.lang.Thread.run(Thread.java:748)


FAILED:  org.apache.solr.TestRandomDVFaceting.testRandomFaceting

Error Message:
mismatch: 'FGCZ'!='GCEU' @ facet_counts/facet_fields/id/[2]

Stack Trace:
java.lang.AssertionError: mismatch: 'FGCZ'!='GCEU' @ facet_counts/facet_fields/id/[2]
	at __randomizedtesting.SeedInfo.seed([135736BDCE8CA2EF:1E3F16689B756A50]:0)
	at org.junit.Assert.fail(Assert.java:89)
	at org.apache.solr.TestRandomDVFaceting.doFacetTests(TestRandomDVFaceting.java:292)
	at org.apache.solr.TestRandomDVFaceting.doFacetTests(TestRandomDVFaceting.java:175)
	at org.apache.solr.TestRandomDVFaceting.testRandomFaceting(TestRandomDVFaceting.java:158)
	at sun.reflect.NativeMethodAccessorImpl.invoke0(Native Method)
	at sun.reflect.NativeMethodAccessorImpl.invoke(NativeMethodAccessorImpl.java:62)
	at sun.reflect.DelegatingMethodAccessorImpl.invoke(DelegatingMethodAccessorImpl.java:43)
	at java.lang.reflect.Method.invoke(Method.java:498)
	at com.carrotsearch.randomizedtesting.RandomizedRunner.invoke(RandomizedRunner.java:1750)
	at com.carrotsearch.randomizedtesting.RandomizedRunner$8.evaluate(RandomizedRunner.java:938)
	at com.carrotsearch.randomizedtesting.RandomizedRunner$9.evaluate(RandomizedRunner.java:974)
	at com.carrotsearch.randomizedtesting.RandomizedRunner$10.evaluate(RandomizedRunner.java:988)
	at com.carrotsearch.randomizedtesting.rules.SystemPropertiesRestoreRule$1.evaluate(SystemPropertiesRestoreRule.java:57)
	at org.junit.rules.RunRules.evaluate(RunRules.java:20)
	at org.apache.lucene.util.TestRuleSetupTeardownChained$1.evaluate(TestRuleSetupTeardownChained.java:49)
	at org.apache.lucene.util.AbstractBeforeAfterRule$1.evaluate(AbstractBeforeAfterRule.java:45)
	at org.apache.lucene.util.TestRuleThreadAndTestName$1.evaluate(TestRuleThreadAndTestName.java:48)
	at org.apache.lucene.util.TestRuleIgnoreAfterMaxFailures$1.evaluate(TestRuleIgnoreAfterMaxFailures.java:64)
	at org.apache.lucene.util.TestRuleMarkFailure$1.evaluate(TestRuleMarkFailure.java:47)
	at org.junit.rules.RunRules.evaluate(RunRules.java:20)
	at com.carrotsearch.randomizedtesting.rules.StatementAdapter.evaluate(StatementAdapter.java:36)
	at com.carrotsearch.randomizedtesting.ThreadLeakControl$StatementRunner.run(ThreadLeakControl.java:368)
	at com.carrotsearch.randomizedtesting.ThreadLeakControl.forkTimeoutingTask(ThreadLeakControl.java:817)
	at com.carrotsearch.randomizedtesting.ThreadLeakControl$3.evaluate(ThreadLeakControl.java:468)
	at com.carrotsearch.randomizedtesting.RandomizedRunner.runSingleTest(RandomizedRunner.java:947)
	at com.carrotsearch.randomizedtesting.RandomizedRunner$5.evaluate(RandomizedRunner.java:832)
	at com.carrotsearch.randomizedtesting.RandomizedRunner$6.evaluate(RandomizedRunner.java:883)
	at com.carrotsearch.randomizedtesting.RandomizedRunner$7.evaluate(RandomizedRunner.java:894)
	at com.carrotsearch.randomizedtesting.rules.StatementAdapter.evaluate(StatementAdapter.java:36)
	at com.carrotsearch.randomizedtesting.rules.SystemPropertiesRestoreRule$1.evaluate(SystemPropertiesRestoreRule.java:57)
	at org.junit.rules.RunRules.evaluate(RunRules.java:20)
	at org.apache.lucene.util.AbstractBeforeAfterRule$1.evaluate(AbstractBeforeAfterRule.java:45)
	at com.carrotsearch.randomizedtesting.rules.StatementAdapter.evaluate(StatementAdapter.java:36)
	at org.apache.lucene.util.TestRuleStoreClassName$1.evaluate(TestRuleStoreClassName.java:41)
	at com.carrotsearch.randomizedtesting.rules.NoShadowingOrOverridesOnMethodsRule$1.evaluate(NoShadowingOrOverridesOnMethodsRule.java:40)
	at com.carrotsearch.randomizedtesting.rules.NoShadowingOrOverridesOnMethodsRule$1.evaluate(NoShadowingOrOverridesOnMethodsRule.java:40)
	at com.carrotsearch.randomizedtesting.rules.StatementAdapter.evaluate(StatementAdapter.java:36)
	at com.carrotsearch.randomizedtesting.rules.StatementAdapter.evaluate(StatementAdapter.java:36)
	at com.carrotsearch.randomizedtesting.rules.StatementAdapter.evaluate(StatementAdapter.java:36)
	at org.apache.lucene.util.TestRuleAssertionsRequired$1.evaluate(TestRuleAssertionsRequired.java:53)
	at org.apache.lucene.util.TestRuleMarkFailure$1.evaluate(TestRuleMarkFailure.java:47)
	at org.apache.lucene.util.TestRuleIgnoreAfterMaxFailures$1.evaluate(TestRuleIgnoreAfterMaxFailures.java:64)
	at org.apache.lucene.util.TestRuleIgnoreTestSuites$1.evaluate(TestRuleIgnoreTestSuites.java:54)
	at org.junit.rules.RunRules.evaluate(RunRules.java:20)
	at com.carrotsearch.randomizedtesting.rules.StatementAdapter.evaluate(StatementAdapter.java:36)
	at com.carrotsearch.randomizedtesting.ThreadLeakControl$StatementRunner.run(ThreadLeakControl.java:368)
	at java.lang.Thread.run(Thread.java:748)


FAILED:  org.apache.solr.TestRandomDVFaceting.testRandomFaceting

Error Message:
mismatch: 'FGCZ'!='GCEU' @ facet_counts/facet_fields/id/[2]

Stack Trace:
java.lang.AssertionError: mismatch: 'FGCZ'!='GCEU' @ facet_counts/facet_fields/id/[2]
	at __randomizedtesting.SeedInfo.seed([135736BDCE8CA2EF:1E3F16689B756A50]:0)
	at org.junit.Assert.fail(Assert.java:89)
	at org.apache.solr.TestRandomDVFaceting.doFacetTests(TestRandomDVFaceting.java:292)
	at org.apache.solr.TestRandomDVFaceting.doFacetTests(TestRandomDVFaceting.java:175)
	at org.apache.solr.TestRandomDVFaceting.testRandomFaceting(TestRandomDVFaceting.java:158)
	at sun.reflect.NativeMethodAccessorImpl.invoke0(Native Method)
	at sun.reflect.NativeMethodAccessorImpl.invoke(NativeMethodAccessorImpl.java:62)
	at sun.reflect.DelegatingMethodAccessorImpl.invoke(DelegatingMethodAccessorImpl.java:43)
	at java.lang.reflect.Method.invoke(Method.java:498)
	at com.carrotsearch.randomizedtesting.RandomizedRunner.invoke(RandomizedRunner.java:1750)
	at com.carrotsearch.randomizedtesting.RandomizedRunner$8.evaluate(RandomizedRunner.java:938)
	at com.carrotsearch.randomizedtesting.RandomizedRunner$9.evaluate(RandomizedRunner.java:974)
	at com.carrotsearch.randomizedtesting.RandomizedRunner$10.evaluate(RandomizedRunner.java:988)
	at com.carrotsearch.randomizedtesting.rules.SystemPropertiesRestoreRule$1.evaluate(SystemPropertiesRestoreRule.java:57)
	at org.junit.rules.RunRules.evaluate(RunRules.java:20)
	at org.apache.lucene.util.TestRuleSetupTeardownChained$1.evaluate(TestRuleSetupTeardownChained.java:49)
	at org.apache.lucene.util.AbstractBeforeAfterRule$1.evaluate(AbstractBeforeAfterRule.java:45)
	at org.apache.lucene.util.TestRuleThreadAndTestName$1.evaluate(TestRuleThreadAndTestName.java:48)
	at org.apache.lucene.util.TestRuleIgnoreAfterMaxFailures$1.evaluate(TestRuleIgnoreAfterMaxFailures.java:64)
	at org.apache.lucene.util.TestRuleMarkFailure$1.evaluate(TestRuleMarkFailure.java:47)
	at org.junit.rules.RunRules.evaluate(RunRules.java:20)
	at com.carrotsearch.randomizedtesting.rules.StatementAdapter.evaluate(StatementAdapter.java:36)
	at com.carrotsearch.randomizedtesting.ThreadLeakControl$StatementRunner.run(ThreadLeakControl.java:368)
	at com.carrotsearch.randomizedtesting.ThreadLeakControl.forkTimeoutingTask(ThreadLeakControl.java:817)
	at com.carrotsearch.randomizedtesting.ThreadLeakControl$3.evaluate(ThreadLeakControl.java:468)
	at com.carrotsearch.randomizedtesting.RandomizedRunner.runSingleTest(RandomizedRunner.java:947)
	at com.carrotsearch.randomizedtesting.RandomizedRunner$5.evaluate(RandomizedRunner.java:832)
	at com.carrotsearch.randomizedtesting.RandomizedRunner$6.evaluate(RandomizedRunner.java:883)
	at com.carrotsearch.randomizedtesting.RandomizedRunner$7.evaluate(RandomizedRunner.java:894)
	at com.carrotsearch.randomizedtesting.rules.StatementAdapter.evaluate(StatementAdapter.java:36)
	at com.carrotsearch.randomizedtesting.rules.SystemPropertiesRestoreRule$1.evaluate(SystemPropertiesRestoreRule.java:57)
	at org.junit.rules.RunRules.evaluate(RunRules.java:20)
	at org.apache.lucene.util.AbstractBeforeAfterRule$1.evaluate(AbstractBeforeAfterRule.java:45)
	at com.carrotsearch.randomizedtesting.rules.StatementAdapter.evaluate(StatementAdapter.java:36)
	at org.apache.lucene.util.TestRuleStoreClassName$1.evaluate(TestRuleStoreClassName.java:41)
	at com.carrotsearch.randomizedtesting.rules.NoShadowingOrOverridesOnMethodsRule$1.evaluate(NoShadowingOrOverridesOnMethodsRule.java:40)
	at com.carrotsearch.randomizedtesting.rules.NoShadowingOrOverridesOnMethodsRule$1.evaluate(NoShadowingOrOverridesOnMethodsRule.java:40)
	at com.carrotsearch.randomizedtesting.rules.StatementAdapter.evaluate(StatementAdapter.java:36)
	at com.carrotsearch.randomizedtesting.rules.StatementAdapter.evaluate(StatementAdapter.java:36)
	at com.carrotsearch.randomizedtesting.rules.StatementAdapter.evaluate(StatementAdapter.java:36)
	at org.apache.lucene.util.TestRuleAssertionsRequired$1.evaluate(TestRuleAssertionsRequired.java:53)
	at org.apache.lucene.util.TestRuleMarkFailure$1.evaluate(TestRuleMarkFailure.java:47)
	at org.apache.lucene.util.TestRuleIgnoreAfterMaxFailures$1.evaluate(TestRuleIgnoreAfterMaxFailures.java:64)
	at org.apache.lucene.util.TestRuleIgnoreTestSuites$1.evaluate(TestRuleIgnoreTestSuites.java:54)
	at org.junit.rules.RunRules.evaluate(RunRules.java:20)
	at com.carrotsearch.randomizedtesting.rules.StatementAdapter.evaluate(StatementAdapter.java:36)
	at com.carrotsearch.randomizedtesting.ThreadLeakControl$StatementRunner.run(ThreadLeakControl.java:368)
	at java.lang.Thread.run(Thread.java:748)


FAILED:  org.apache.solr.TestRandomDVFaceting.testRandomFaceting

Error Message:
mismatch: 'FGCZ'!='GCEU' @ facet_counts/facet_fields/id/[2]

Stack Trace:
java.lang.AssertionError: mismatch: 'FGCZ'!='GCEU' @ facet_counts/facet_fields/id/[2]
	at __randomizedtesting.SeedInfo.seed([135736BDCE8CA2EF:1E3F16689B756A50]:0)
	at org.junit.Assert.fail(Assert.java:89)
	at org.apache.solr.TestRandomDVFaceting.doFacetTests(TestRandomDVFaceting.java:292)
	at org.apache.solr.TestRandomDVFaceting.doFacetTests(TestRandomDVFaceting.java:175)
	at org.apache.solr.TestRandomDVFaceting.testRandomFaceting(TestRandomDVFaceting.java:158)
	at sun.reflect.NativeMethodAccessorImpl.invoke0(Native Method)
	at sun.reflect.NativeMethodAccessorImpl.invoke(NativeMethodAccessorImpl.java:62)
	at sun.reflect.DelegatingMethodAccessorImpl.invoke(DelegatingMethodAccessorImpl.java:43)
	at java.lang.reflect.Method.invoke(Method.java:498)
	at com.carrotsearch.randomizedtesting.RandomizedRunner.invoke(RandomizedRunner.java:1750)
	at com.carrotsearch.randomizedtesting.RandomizedRunner$8.evaluate(RandomizedRunner.java:938)
	at com.carrotsearch.randomizedtesting.RandomizedRunner$9.evaluate(RandomizedRunner.java:974)
	at com.carrotsearch.randomizedtesting.RandomizedRunner$10.evaluate(RandomizedRunner.java:988)
	at com.carrotsearch.randomizedtesting.rules.SystemPropertiesRestoreRule$1.evaluate(SystemPropertiesRestoreRule.java:57)
	at org.junit.rules.RunRules.evaluate(RunRules.java:20)
	at org.apache.lucene.util.TestRuleSetupTeardownChained$1.evaluate(TestRuleSetupTeardownChained.java:49)
	at org.apache.lucene.util.AbstractBeforeAfterRule$1.evaluate(AbstractBeforeAfterRule.java:45)
	at org.apache.lucene.util.TestRuleThreadAndTestName$1.evaluate(TestRuleThreadAndTestName.java:48)
	at org.apache.lucene.util.TestRuleIgnoreAfterMaxFailures$1.evaluate(TestRuleIgnoreAfterMaxFailures.java:64)
	at org.apache.lucene.util.TestRuleMarkFailure$1.evaluate(TestRuleMarkFailure.java:47)
	at org.junit.rules.RunRules.evaluate(RunRules.java:20)
	at com.carrotsearch.randomizedtesting.rules.StatementAdapter.evaluate(StatementAdapter.java:36)
	at com.carrotsearch.randomizedtesting.ThreadLeakControl$StatementRunner.run(ThreadLeakControl.java:368)
	at com.carrotsearch.randomizedtesting.ThreadLeakControl.forkTimeoutingTask(ThreadLeakControl.java:817)
	at com.carrotsearch.randomizedtesting.ThreadLeakControl$3.evaluate(ThreadLeakControl.java:468)
	at com.carrotsearch.randomizedtesting.RandomizedRunner.runSingleTest(RandomizedRunner.java:947)
	at com.carrotsearch.randomizedtesting.RandomizedRunner$5.evaluate(RandomizedRunner.java:832)
	at com.carrotsearch.randomizedtesting.RandomizedRunner$6.evaluate(RandomizedRunner.java:883)
	at com.carrotsearch.randomizedtesting.RandomizedRunner$7.evaluate(RandomizedRunner.java:894)
	at com.carrotsearch.randomizedtesting.rules.StatementAdapter.evaluate(StatementAdapter.java:36)
	at com.carrotsearch.randomizedtesting.rules.SystemPropertiesRestoreRule$1.evaluate(SystemPropertiesRestoreRule.java:57)
	at org.junit.rules.RunRules.evaluate(RunRules.java:20)
	at org.apache.lucene.util.AbstractBeforeAfterRule$1.evaluate(AbstractBeforeAfterRule.java:45)
	at com.carrotsearch.randomizedtesting.rules.StatementAdapter.evaluate(StatementAdapter.java:36)
	at org.apache.lucene.util.TestRuleStoreClassName$1.evaluate(TestRuleStoreClassName.java:41)
	at com.carrotsearch.randomizedtesting.rules.NoShadowingOrOverridesOnMethodsRule$1.evaluate(NoShadowingOrOverridesOnMethodsRule.java:40)
	at com.carrotsearch.randomizedtesting.rules.NoShadowingOrOverridesOnMethodsRule$1.evaluate(NoShadowingOrOverridesOnMethodsRule.java:40)
	at com.carrotsearch.randomizedtesting.rules.StatementAdapter.evaluate(StatementAdapter.java:36)
	at com.carrotsearch.randomizedtesting.rules.StatementAdapter.evaluate(StatementAdapter.java:36)
	at com.carrotsearch.randomizedtesting.rules.StatementAdapter.evaluate(StatementAdapter.java:36)
	at org.apache.lucene.util.TestRuleAssertionsRequired$1.evaluate(TestRuleAssertionsRequired.java:53)
	at org.apache.lucene.util.TestRuleMarkFailure$1.evaluate(TestRuleMarkFailure.java:47)
	at org.apache.lucene.util.TestRuleIgnoreAfterMaxFailures$1.evaluate(TestRuleIgnoreAfterMaxFailures.java:64)
	at org.apache.lucene.util.TestRuleIgnoreTestSuites$1.evaluate(TestRuleIgnoreTestSuites.java:54)
	at org.junit.rules.RunRules.evaluate(RunRules.java:20)
	at com.carrotsearch.randomizedtesting.rules.StatementAdapter.evaluate(StatementAdapter.java:36)
	at com.carrotsearch.randomizedtesting.ThreadLeakControl$StatementRunner.run(ThreadLeakControl.java:368)
	at java.lang.Thread.run(Thread.java:748)




Build Log:
[...truncated 25 lines...]
ERROR: ld.so: object 'libeatmydata.so' from LD_PRELOAD cannot be preloaded (cannot open shared object file): ignored.
Buildfile: /home/jenkins/workspace/Lucene-Solr-8.x-Linux/build.xml

jenkins-hourly:

-print-java-info:
[java-info] java version "1.8.0_201"
[java-info] Java(TM) SE Runtime Environment (1.8.0_201-b09, Oracle Corporation)
[java-info] Java HotSpot(TM) Server VM (25.201-b09, Oracle Corporation)
[java-info] Test args: [-server -XX:+UseParallelGC]

clean:

clean:

clean:

ivy-availability-check:
[loadresource] Do not set property disallowed.ivy.jars.list as its length is 0.

-ivy-fail-disallowed-ivy-version:

ivy-fail:

ivy-configure:
[ivy:configure] :: Apache Ivy 2.4.0 - 20141213170938 :: http://ant.apache.org/ivy/ ::
[ivy:configure] :: loading settings :: file = /home/jenkins/workspace/Lucene-Solr-8.x-Linux/lucene/top-level-ivy-settings.xml

resolve-groovy:
[ivy:cachepath] :: resolving dependencies :: org.codehaus.groovy#groovy-all-caller;working
[ivy:cachepath] 	confs: [default]
[ivy:cachepath] 	found org.codehaus.groovy#groovy-all;2.4.17 in public
[ivy:cachepath] :: resolution report :: resolve 74ms :: artifacts dl 1ms
	---------------------------------------------------------------------
	|                  |            modules            ||   artifacts   |
	|       conf       | number| search|dwnlded|evicted|| number|dwnlded|
	---------------------------------------------------------------------
	|      default     |   1   |   0   |   0   |   0   ||   1   |   0   |
	---------------------------------------------------------------------

-test-with-heapdumps-enabled:
     [echo] Java HotSpot(TM) Server VM: Enabling heap dumps on OutOfMemoryError to dir '/home/jenkins/workspace/Lucene-Solr-8.x-Linux/heapdumps'.
    [mkdir] Created dir: /home/jenkins/workspace/Lucene-Solr-8.x-Linux/heapdumps

ivy-availability-check:
[loadresource] Do not set property disallowed.ivy.jars.list as its length is 0.

-ivy-fail-disallowed-ivy-version:

ivy-fail:

ivy-configure:
[ivy:configure] :: loading settings :: file = /home/jenkins/workspace/Lucene-Solr-8.x-Linux/lucene/top-level-ivy-settings.xml

resolve-groovy:

test:

ivy-availability-check:
[loadresource] Do not set property disallowed.ivy.jars.list as its length is 0.

-ivy-fail-disallowed-ivy-version:

ivy-fail:

ivy-configure:
[ivy:configure] :: loading settings :: file = /home/jenkins/workspace/Lucene-Solr-8.x-Linux/lucene/top-level-ivy-settings.xml

-clover.load:

resolve-groovy:

-init-totals:

test-core:

-clover.disable:

ivy-availability-check:
[loadresource] Do not set property disallowed.ivy.jars.list as its length is 0.

-ivy-fail-disallowed-ivy-version:

ivy-fail:

ivy-configure:
[ivy:configure] :: loading settings :: file = /home/jenkins/workspace/Lucene-Solr-8.x-Linux/lucene/top-level-ivy-settings.xml

-clover.load:

-clover.classpath:

-clover.setup:

clover:

-check-git-state:

-git-cleanroot:

-copy-git-state:
     [copy] Copying 1 file to /home/jenkins/workspace/Lucene-Solr-8.x-Linux/lucene/build

git-autoclean:

resolve:

init:

compile-core:
    [mkdir] Created dir: /home/jenkins/workspace/Lucene-Solr-8.x-Linux/lucene/build/core/classes/java
    [javac] Compiling 947 source files to /home/jenkins/workspace/Lucene-Solr-8.x-Linux/lucene/build/core/classes/java
    [javac] /home/jenkins/workspace/Lucene-Solr-8.x-Linux/lucene/core/src/java/org/apache/lucene/util/fst/FST.java:338: warning: [rawtypes] found raw type: Arc
    [javac]       static boolean isBitSet(int bitIndex, Arc arc, FST.BytesReader in) throws IOException {
    [javac]                                             ^
    [javac]   missing type arguments for generic class Arc<T>
    [javac]   where T is a type-variable:
    [javac]     T extends Object declared in class Arc
    [javac] /home/jenkins/workspace/Lucene-Solr-8.x-Linux/lucene/core/src/java/org/apache/lucene/util/fst/FST.java:348: warning: [rawtypes] found raw type: Arc
    [javac]       static int countBits(Arc arc, FST.BytesReader in) throws IOException {
    [javac]                            ^
    [javac]   missing type arguments for generic class Arc<T>
    [javac]   where T is a type-variable:
    [javac]     T extends Object declared in class Arc
    [javac] /home/jenkins/workspace/Lucene-Solr-8.x-Linux/lucene/core/src/java/org/apache/lucene/util/fst/FST.java:355: warning: [rawtypes] found raw type: Arc
    [javac]       static int countBitsUpTo(int bitIndex, Arc arc, FST.BytesReader in) throws IOException {
    [javac]                                              ^
    [javac]   missing type arguments for generic class Arc<T>
    [javac]   where T is a type-variable:
    [javac]     T extends Object declared in class Arc
    [javac] /home/jenkins/workspace/Lucene-Solr-8.x-Linux/lucene/core/src/java/org/apache/lucene/util/fst/FST.java:362: warning: [rawtypes] found raw type: Arc
    [javac]       static int nextBitSet(int bitIndex, Arc arc, FST.BytesReader in) throws IOException {
    [javac]                                           ^
    [javac]   missing type arguments for generic class Arc<T>
    [javac]   where T is a type-variable:
    [javac]     T extends Object declared in class Arc
    [javac] /home/jenkins/workspace/Lucene-Solr-8.x-Linux/lucene/core/src/java/org/apache/lucene/util/fst/FST.java:369: warning: [rawtypes] found raw type: Arc
    [javac]       static int previousBitSet(int bitIndex, Arc arc, FST.BytesReader in) throws IOException {
    [javac]                                               ^
    [javac]   missing type arguments for generic class Arc<T>
    [javac]   where T is a type-variable:
    [javac]     T extends Object declared in class Arc
    [javac] /home/jenkins/workspace/Lucene-Solr-8.x-Linux/lucene/core/src/java/org/apache/lucene/util/fst/FST.java:378: warning: [rawtypes] found raw type: Arc
    [javac]       static boolean assertIsValid(Arc arc, FST.BytesReader in) throws IOException {
    [javac]                                    ^
    [javac]   missing type arguments for generic class Arc<T>
    [javac]   where T is a type-variable:
    [javac]     T extends Object declared in class Arc
    [javac] /home/jenkins/workspace/Lucene-Solr-8.x-Linux/lucene/core/src/java/org/apache/lucene/search/MaxScoreAccumulator.java:55: warning: [overrides] Class DocAndScore overrides equals, but neither it nor any superclass overrides hashCode method
    [javac]   static class DocAndScore implements Comparable<DocAndScore> {
    [javac]          ^
    [javac] /home/jenkins/workspace/Lucene-Solr-8.x-Linux/lucene/core/src/java/org/apache/lucene/store/SimpleFSDirectory.java:50: warning: [dep-ann] deprecated item is not annotated with @Deprecated
    [javac] public class SimpleFSDirectory extends FSDirectory {
    [javac]        ^
    [javac] Note: Some input files use or override a deprecated API.
    [javac] Note: Recompile with -Xlint:deprecation for details.
    [javac] 8 warnings
    [javac] Creating empty /home/jenkins/workspace/Lucene-Solr-8.x-Linux/lucene/build/core/classes/java/org/apache/lucene/util/graph/package-info.class
    [javac] Creating empty /home/jenkins/workspace/Lucene-Solr-8.x-Linux/lucene/build/core/classes/java/org/apache/lucene/document/package-info.class
    [javac] Creating empty /home/jenkins/workspace/Lucene-Solr-8.x-Linux/lucene/build/core/classes/java/org/apache/lucene/package-info.class
    [javac] Creating empty /home/jenkins/workspace/Lucene-Solr-8.x-Linux/lucene/build/core/classes/java/org/apache/lucene/util/bkd/package-info.class
    [javac] Creating empty /home/jenkins/workspace/Lucene-Solr-8.x-Linux/lucene/build/core/classes/java/org/apache/lucene/codecs/compressing/package-info.class
    [javac] Creating empty /home/jenkins/workspace/Lucene-Solr-8.x-Linux/lucene/build/core/classes/java/org/apache/lucene/util/compress/package-info.class
    [javac] Creating empty /home/jenkins/workspace/Lucene-Solr-8.x-Linux/lucene/build/core/classes/java/org/apache/lucene/codecs/lucene60/package-info.class
    [javac] Creating empty /home/jenkins/workspace/Lucene-Solr-8.x-Linux/lucene/build/core/classes/java/org/apache/lucene/codecs/package-info.class
    [javac] Creating empty /home/jenkins/workspace/Lucene-Solr-8.x-Linux/lucene/build/core/classes/java/org/apache/lucene/codecs/lucene80/package-info.class
    [javac] Creating empty /home/jenkins/workspace/Lucene-Solr-8.x-Linux/lucene/build/core/classes/java/org/apache/lucene/util/package-info.class
    [javac] Creating empty /home/jenkins/workspace/Lucene-Solr-8.x-Linux/lucene/build/core/classes/java/org/apache/lucene/index/package-info.class
    [javac] Creating empty /home/jenkins/workspace/Lucene-Solr-8.x-Linux/lucene/build/core/classes/java/org/apache/lucene/search/comparators/package-info.class
    [javac] Creating empty /home/jenkins/workspace/Lucene-Solr-8.x-Linux/lucene/build/core/classes/java/org/apache/lucene/util/fst/package-info.class
    [javac] Creating empty /home/jenkins/workspace/Lucene-Solr-8.x-Linux/lucene/build/core/classes/java/org/apache/lucene/analysis/tokenattributes/package-info.class
    [javac] Creating empty /home/jenkins/workspace/Lucene-Solr-8.x-Linux/lucene/build/core/classes/java/org/apache/lucene/codecs/lucene87/package-info.class
    [javac] Creating empty /home/jenkins/workspace/Lucene-Solr-8.x-Linux/lucene/build/core/classes/java/org/apache/lucene/search/package-info.class
    [javac] Creating empty /home/jenkins/workspace/Lucene-Solr-8.x-Linux/lucene/build/core/classes/java/org/apache/lucene/codecs/lucene86/package-info.class
    [javac] Creating empty /home/jenkins/workspace/Lucene-Solr-8.x-Linux/lucene/build/core/classes/java/org/apache/lucene/codecs/lucene84/package-info.class
    [javac] Creating empty /home/jenkins/workspace/Lucene-Solr-8.x-Linux/lucene/build/core/classes/java/org/apache/lucene/util/packed/package-info.class
    [javac] Creating empty /home/jenkins/workspace/Lucene-Solr-8.x-Linux/lucene/build/core/classes/java/org/apache/lucene/util/mutable/package-info.class
    [javac] Creating empty /home/jenkins/workspace/Lucene-Solr-8.x-Linux/lucene/build/core/classes/java/org/apache/lucene/codecs/perfield/package-info.class
    [javac] Creating empty /home/jenkins/workspace/Lucene-Solr-8.x-Linux/lucene/build/core/classes/java/org/apache/lucene/analysis/package-info.class
    [javac] Creating empty /home/jenkins/workspace/Lucene-Solr-8.x-Linux/lucene/build/core/classes/java/org/apache/lucene/analysis/standard/package-info.class
    [javac] Creating empty /home/jenkins/workspace/Lucene-Solr-8.x-Linux/lucene/build/core/classes/java/org/apache/lucene/store/package-info.class
    [javac] Creating empty /home/jenkins/workspace/Lucene-Solr-8.x-Linux/lucene/build/core/classes/java/org/apache/lucene/codecs/blocktree/package-info.class
    [javac] Creating empty /home/jenkins/workspace/Lucene-Solr-8.x-Linux/lucene/build/core/classes/java/org/apache/lucene/search/spans/package-info.class
    [javac] Creating empty /home/jenkins/workspace/Lucene-Solr-8.x-Linux/lucene/build/core/classes/java/org/apache/lucene/search/similarities/package-info.class
    [javac] Creating empty /home/jenkins/workspace/Lucene-Solr-8.x-Linux/lucene/build/core/classes/java/org/apache/lucene/util/automaton/package-info.class
    [javac] Creating empty /home/jenkins/workspace/Lucene-Solr-8.x-Linux/lucene/build/core/classes/java/org/apache/lucene/codecs/lucene50/package-info.class
    [javac] Creating empty /home/jenkins/workspace/Lucene-Solr-8.x-Linux/lucene/build/core/classes/java/org/apache/lucene/geo/package-info.class
     [copy] Copying 4 files to /home/jenkins/workspace/Lucene-Solr-8.x-Linux/lucene/build/core/classes/java

compile-test-framework:

-check-git-state:

-git-cleanroot:

-copy-git-state:

git-autoclean:

ivy-availability-check:
[loadresource] Do not set property disallowed.ivy.jars.list as its length is 0.

-ivy-fail-disallowed-ivy-version:

ivy-fail:

ivy-configure:
[ivy:configure] :: loading settings :: file = /home/jenkins/workspace/Lucene-Solr-8.x-Linux/lucene/top-level-ivy-settings.xml

resolve:

init:

compile-lucene-core:

-check-git-state:

-git-cleanroot:

-copy-git-state:

git-autoclean:

ivy-availability-check:
[loadresource] Do not set property disallowed.ivy.jars.list as its length is 0.

-ivy-fail-disallowed-ivy-version:

ivy-fail:

ivy-configure:
[ivy:configure] :: loading settings :: file = /home/jenkins/workspace/Lucene-Solr-8.x-Linux/lucene/top-level-ivy-settings.xml

resolve:

init:

-clover.disable:

-clover.load:

-clover.classpath:

-clover.setup:

clover:

compile-core:

compile-codecs:

-check-git-state:

-git-cleanroot:

-copy-git-state:

git-autoclean:

ivy-availability-check:
[loadresource] Do not set property disallowed.ivy.jars.list as its length is 0.

-ivy-fail-disallowed-ivy-version:

ivy-fail:

ivy-configure:
[ivy:configure] :: loading settings :: file = /home/jenkins/workspace/Lucene-Solr-8.x-Linux/lucene/top-level-ivy-settings.xml

resolve:

common.init:

compile-lucene-core:

init:

-clover.disable:

-clover.load:

-clover.classpath:

-clover.setup:

clover:

compile-core:
    [mkdir] Created dir: /home/jenkins/workspace/Lucene-Solr-8.x-Linux/lucene/build/codecs/classes/java
    [javac] Compiling 102 source files to /home/jenkins/workspace/Lucene-Solr-8.x-Linux/lucene/build/codecs/classes/java
    [javac] Note: Some input files use or override a deprecated API.
    [javac] Note: Recompile with -Xlint:deprecation for details.
    [javac] Creating empty /home/jenkins/workspace/Lucene-Solr-8.x-Linux/lucene/build/codecs/classes/java/org/apache/lucene/codecs/bloom/package-info.class
    [javac] Creating empty /home/jenkins/workspace/Lucene-Solr-8.x-Linux/lucene/build/codecs/classes/java/org/apache/lucene/codecs/uniformsplit/sharedterms/package-info.class
    [javac] Creating empty /home/jenkins/workspace/Lucene-Solr-8.x-Linux/lucene/build/codecs/classes/java/org/apache/lucene/codecs/memory/package-info.class
    [javac] Creating empty /home/jenkins/workspace/Lucene-Solr-8.x-Linux/lucene/build/codecs/classes/java/org/apache/lucene/codecs/simpletext/package-info.class
    [javac] Creating empty /home/jenkins/workspace/Lucene-Solr-8.x-Linux/lucene/build/codecs/classes/java/org/apache/lucene/codecs/uniformsplit/package-info.class
    [javac] Creating empty /home/jenkins/workspace/Lucene-Solr-8.x-Linux/lucene/build/codecs/classes/java/org/apache/lucene/codecs/blockterms/package-info.class
    [javac] Creating empty /home/jenkins/workspace/Lucene-Solr-8.x-Linux/lucene/build/codecs/classes/java/org/apache/lucene/codecs/blocktreeords/package-info.class
     [copy] Copying 3 files to /home/jenkins/workspace/Lucene-Solr-8.x-Linux/lucene/build/codecs/classes/java

-clover.disable:

-clover.load:

-clover.classpath:

-clover.setup:

clover:

common.compile-core:
    [mkdir] Created dir: /home/jenkins/workspace/Lucene-Solr-8.x-Linux/lucene/build/test-framework/classes/java
    [javac] Compiling 205 source files to /home/jenkins/workspace/Lucene-Solr-8.x-Linux/lucene/build/test-framework/classes/java
    [javac] Note: Some input files use or override a deprecated API.
    [javac] Note: Recompile with -Xlint:deprecation for details.
    [javac] Creating empty /home/jenkins/workspace/Lucene-Solr-8.x-Linux/lucene/build/test-framework/classes/java/org/apache/lucene/codecs/asserting/package-info.class
    [javac] Creating empty /home/jenkins/workspace/Lucene-Solr-8.x-Linux/lucene/build/test-framework/classes/java/org/apache/lucene/codecs/ramonly/package-info.class
    [javac] Creating empty /home/jenkins/workspace/Lucene-Solr-8.x-Linux/lucene/build/test-framework/classes/java/org/apache/lucene/mockfile/package-info.class
    [javac] Creating empty /home/jenkins/workspace/Lucene-Solr-8.x-Linux/lucene/build/test-framework/classes/java/org/apache/lucene/codecs/cheapbastard/package-info.class
    [javac] Creating empty /home/jenkins/workspace/Lucene-Solr-8.x-Linux/lucene/build/test-framework/classes/java/org/apache/lucene/codecs/mockrandom/package-info.class
    [javac] Creating empty /home/jenkins/workspace/Lucene-Solr-8.x-Linux/lucene/build/test-framework/classes/java/org/apache/lucene/codecs/cranky/package-info.class
    [javac] Creating empty /home/jenkins/workspace/Lucene-Solr-8.x-Linux/lucene/build/test-framework/classes/java/org/apache/lucene/codecs/compressing/dummy/package-info.class
     [copy] Copying 7 files to /home/jenkins/workspace/Lucene-Solr-8.x-Linux/lucene/build/test-framework/classes/java

compile-core:

compile-test:
    [mkdir] Created dir: /home/jenkins/workspace/Lucene-Solr-8.x-Linux/lucene/build/core/classes/test
    [javac] Compiling 585 source files to /home/jenkins/workspace/Lucene-Solr-8.x-Linux/lucene/build/core/classes/test
    [javac] Note: Some input files use or override a deprecated API.
    [javac] Note: Recompile with -Xlint:deprecation for details.
     [copy] Copying 3 files to /home/jenkins/workspace/Lucene-Solr-8.x-Linux/lucene/build/core/classes/test

-mrjar-classes-uptodate:

resolve-groovy:

patch-mrjar-classes:
[patch-cls] Remapped: org/apache/lucene/analysis/tokenattributes/CharTermAttributeImpl
[patch-cls] Remapped: org/apache/lucene/codecs/blocktree/BlockTreeTermsWriter$TermsWriter
[patch-cls] Remapped: org/apache/lucene/codecs/blocktree/SegmentTermsEnumFrame
[patch-cls] Remapped: org/apache/lucene/codecs/compressing/FieldsIndexReader
[patch-cls] Remapped: org/apache/lucene/document/BinaryPoint$2
[patch-cls] Remapped: org/apache/lucene/document/DoubleRange
[patch-cls] Remapped: org/apache/lucene/document/FloatRange
[patch-cls] Remapped: org/apache/lucene/document/IntRange
[patch-cls] Remapped: org/apache/lucene/document/LatLonPointDistanceFeatureQuery$DistanceScorer$2
[patch-cls] Remapped: org/apache/lucene/document/LatLonPointDistanceQuery$1
[patch-cls] Remapped: org/apache/lucene/document/LatLonPointInGeometryQuery$1
[patch-cls] Remapped: org/apache/lucene/document/LatLonShapeBoundingBoxQuery$EncodedRectangle
[patch-cls] Remapped: org/apache/lucene/document/LongDistanceFeatureQuery$DistanceScorer$2
[patch-cls] Remapped: org/apache/lucene/document/LongRange
[patch-cls] Remapped: org/apache/lucene/document/RangeFieldQuery$QueryType$1
[patch-cls] Remapped: org/apache/lucene/document/RangeFieldQuery$QueryType$2
[patch-cls] Remapped: org/apache/lucene/document/RangeFieldQuery$QueryType$3
[patch-cls] Remapped: org/apache/lucene/index/BitsSlice
[patch-cls] Remapped: org/apache/lucene/index/CheckIndex$VerifyPointsVisitor
[patch-cls] Remapped: org/apache/lucene/index/CodecReader
[patch-cls] Remapped: org/apache/lucene/index/MergeReaderWrapper
[patch-cls] Remapped: org/apache/lucene/index/PointValues
[patch-cls] Remapped: org/apache/lucene/search/BooleanScorer$TailPriorityQueue
[patch-cls] Remapped: org/apache/lucene/search/PointInSetQuery$SinglePointVisitor
[patch-cls] Remapped: org/apache/lucene/search/PointRangeQuery$1
[patch-cls] Remapped: org/apache/lucene/search/TopFieldCollector
[patch-cls] Remapped: org/apache/lucene/search/comparators/NumericComparator$NumericLeafComparator$1
[patch-cls] Remapped: org/apache/lucene/store/DataInput
[patch-cls] Remapped: org/apache/lucene/util/BytesRef
[patch-cls] Remapped: org/apache/lucene/util/BytesRefArray
[patch-cls] Remapped: org/apache/lucene/util/CharsRef$UTF16SortedAsUTF8Comparator
[patch-cls] Remapped: org/apache/lucene/util/CharsRef
[patch-cls] Remapped: org/apache/lucene/util/IntsRef
[patch-cls] Remapped: org/apache/lucene/util/LongsRef
[patch-cls] Remapped: org/apache/lucene/util/StringHelper
[patch-cls] Remapped: org/apache/lucene/util/automaton/Automaton$Builder
[patch-cls] Remapped: org/apache/lucene/util/automaton/Automaton
[patch-cls] Remapped: org/apache/lucene/util/bkd/BKDRadixSelector$1$1
[patch-cls] Remapped: org/apache/lucene/util/bkd/BKDRadixSelector$2$1
[patch-cls] Remapped: org/apache/lucene/util/bkd/BKDRadixSelector
[patch-cls] Remapped: org/apache/lucene/util/bkd/BKDReader
[patch-cls] Remapped: org/apache/lucene/util/bkd/BKDWriter$BKDMergeQueue
[patch-cls] Remapped: org/apache/lucene/util/bkd/BKDWriter$OneDimensionBKDWriter
[patch-cls] Remapped: org/apache/lucene/util/bkd/BKDWriter
[patch-cls] Remapped: org/apache/lucene/util/bkd/HeapPointWriter
[patch-cls] Remapped: org/apache/lucene/util/bkd/MutablePointsReaderUtils$1$1
[patch-cls] Remapped: org/apache/lucene/util/bkd/MutablePointsReaderUtils$2
[patch-cls] Remapped: org/apache/lucene/util/bkd/MutablePointsReaderUtils$3$1
[patch-cls] Remapped: org/apache/lucene/util/compress/LZ4$FastCompressionHashTable
[patch-cls] Remapped: org/apache/lucene/util/compress/LZ4$HighCompressionHashTable
[patch-cls] Remapped: org/apache/lucene/util/compress/LZ4
[patch-cls] Remapped 51 class files for Java 9 to: /home/jenkins/workspace/Lucene-Solr-8.x-Linux/lucene/build/core/classes/java9
    [touch] Creating /home/jenkins/workspace/Lucene-Solr-8.x-Linux/lucene/build/core/patch-mrjar.stamp

install-junit4-taskdef:

validate:

-init-totals:

-test:
    [mkdir] Created dir: /home/jenkins/workspace/Lucene-Solr-8.x-Linux/lucene/build/core/test
[loadresource] Do not set property tests.explicitclass as its length is 0.
    [mkdir] Created dir: /home/jenkins/workspace/Lucene-Solr-8.x-Linux/lucene/build/core/test/temp
    [mkdir] Created dir: /home/jenkins/workspace/Lucene-Solr-8.x-Linux/.caches/test-stats/core
   [junit4] <JUnit4> says 今日は! Master seed: 20F3B426CA510CAD
   [junit4] Executing 570 suites with 6 JVMs.
   [junit4] 
   [junit4] Started J1 PID(3056696@localhost).
   [junit4] Started J4 PID(3056688@localhost).
   [junit4] Started J0 PID(3056713@localhost).
   [junit4] Started J2 PID(3056712@localhost).
   [junit4] Started J3 PID(3056697@localhost).
   [junit4] Started J5 PID(3056714@localhost).
   [junit4] Suite: org.apache.lucene.index.TestIndexWriterConfig
   [junit4] Completed [1/570] on J4 in 0.96s, 8 tests
   [junit4] 
   [junit4] Suite: org.apache.lucene.index.TestIndexTooManyDocs
   [junit4] Completed [2/570] on J1 in 1.72s, 1 test
   [junit4] 
   [junit4] Suite: org.apache.lucene.document.TestLatLonDocValuesField
   [junit4] Completed [3/570] on J1 in 0.27s, 1 test
   [junit4] 
   [junit4] Suite: org.apache.lucene.index.TestIndexWriterCommit
   [junit4] IGNOR/A 0.01s J3 | TestIndexWriterCommit.testCommitOnCloseDiskUsage
   [junit4]    > Assumption #1: 'nightly' test group is disabled (@Nightly())
   [junit4] Completed [4/570] on J3 in 2.75s, 14 tests, 1 skipped
   [junit4] 
   [junit4] Suite: org.apache.lucene.document.TestLongDistanceFeatureQuery
   [junit4] Completed [5/570] on J1 in 1.76s, 7 tests
   [junit4] 
   [junit4] Suite: org.apache.lucene.index.TestIndexWriterDelete
   [junit4] IGNOR/A 0.02s J5 | TestIndexWriterDelete.testUpdatesOnDiskFull
   [junit4]    > Assumption #1: 'nightly' test group is disabled (@Nightly())
   [junit4] IGNOR/A 0.00s J5 | TestIndexWriterDelete.testIndexingThenDeleting
   [junit4]    > Assumption #1: 'nightly' test group is disabled (@Nightly())
   [junit4] IGNOR/A 0.00s J5 | TestIndexWriterDelete.testDeletesOnDiskFull
   [junit4]    > Assumption #1: 'nightly' test group is disabled (@Nightly())
   [junit4] IGNOR/A 0.00s J5 | TestIndexWriterDelete.testApplyDeletesOnFlush
   [junit4]    > Assumption #1: 'nightly' test group is disabled (@Nightly())
   [junit4] Completed [6/570] on J5 in 5.27s, 26 tests, 5 skipped
   [junit4] 
   [junit4] Suite: org.apache.lucene.document.TestLatLonMultiPointShapeQueries
   [junit4] IGNOR/A 0.04s J4 | TestLatLonMultiPointShapeQueries.testRandomBig
   [junit4]    > Assumption #1: 'nightly' test group is disabled (@Nightly())
   [junit4] Completed [7/570] on J4 in 5.04s, 9 tests, 1 skipped
   [junit4] 
   [junit4] Suite: org.apache.lucene.index.TestMixedCodecs
   [junit4] Completed [8/570] on J1 in 2.27s, 1 test
   [junit4] 
   [junit4] Suite: org.apache.lucene.geo.TestPolygon2D
   [junit4] Completed [9/570] on J1 in 3.05s, 16 tests
   [junit4] 
   [junit4] Suite: org.apache.lucene.document.TestXYMultiLineShapeQueries
   [junit4] IGNOR/A 0.00s J4 | TestXYMultiLineShapeQueries.testRandomBig
   [junit4]    > Assumption #1: 'nightly' test group is disabled (@Nightly())
   [junit4] Completed [10/570] on J4 in 4.32s, 5 tests, 1 skipped
   [junit4] 
   [junit4] Suite: org.apache.lucene.index.TestMultiFields
   [junit4] Completed [11/570] on J4 in 2.27s, 3 tests
   [junit4] 
   [junit4] Suite: org.apache.lucene.geo.TestTessellator
   [junit4] IGNOR/A 0.00s J4 | TestTessellator.testSimpleTessellationAtNight
   [junit4]    > Assumption #1: 'nightly' test group is disabled (@Nightly())
   [junit4] IGNOR/A 0.00s J4 | TestTessellator.testComplexPolygon40
   [junit4]    > Assumption #1: 'nightly' test group is disabled (@Nightly())
   [junit4] IGNOR/A 0.00s J4 | TestTessellator.testComplexPolygon42
   [junit4]    > Assumption #1: 'nightly' test group is disabled (@Nightly())
   [junit4] Completed [12/570] on J4 in 1.30s, 51 tests, 3 skipped
   [junit4] 
   [junit4] Suite: org.apache.lucene.index.TestCrashCausesCorruptIndex
   [junit4] Completed [13/570] on J4 in 0.26s, 1 test
   [junit4] 
   [junit4] Suite: org.apache.lucene.index.TestConcurrentMergeScheduler
   [junit4] Completed [14/570] on J1 in 5.77s, 17 tests
   [junit4] 
   [junit4] Suite: org.apache.lucene.search.TestWildcardRandom
   [junit4] Completed [15/570] on J1 in 0.81s, 1 test
   [junit4] 
   [junit4] Suite: org.apache.lucene.index.TestAllFilesHaveChecksumFooter
   [junit4] Completed [16/570] on J1 in 1.03s, 1 test
   [junit4] 
   [junit4] Suite: org.apache.lucene.index.TestIndexWriter
   [junit4] Completed [17/570] on J2 in 17.03s, 101 tests, 1 skipped
   [junit4] 
   [junit4] Suite: org.apache.lucene.util.TestVersion
   [junit4] Completed [18/570] on J1 in 0.27s, 11 tests
   [junit4] 
   [junit4] Suite: org.apache.lucene.index.TestDuelingCodecsAtNight
   [junit4] IGNOR/A 0.00s J1 | TestDuelingCodecsAtNight.testEquals
   [junit4]    > Assumption #1: 'nightly' test group is disabled (@Nightly())
   [junit4] IGNOR/A 0.00s J1 | TestDuelingCodecsAtNight.testBigEquals
   [junit4]    > Assumption #1: 'nightly' test group is disabled (@Nightly())
   [junit4] IGNOR/A 0.00s J1 | TestDuelingCodecsAtNight.testCrazyReaderEquals
   [junit4]    > Assumption #1: 'nightly' test group is disabled (@Nightly())
   [junit4] Completed [19/570] on J1 in 0.03s, 3 tests, 3 skipped
   [junit4] 
   [junit4] Suite: org.apache.lucene.util.TestRadixSelector
   [junit4] Completed [20/570] on J1 in 1.04s, 2 tests
   [junit4] 
   [junit4] Suite: org.apache.lucene.document.TestLatLonMultiLineShapeQueries
   [junit4] IGNOR/A 0.01s J3 | TestLatLonMultiLineShapeQueries.testRandomBig
   [junit4]    > Assumption #1: 'nightly' test group is disabled (@Nightly())
   [junit4] Completed [21/570] on J3 in 15.59s, 9 tests, 1 skipped
   [junit4] 
   [junit4] Suite: org.apache.lucene.search.TestTermRangeQuery
   [junit4] Completed [22/570] on J1 in 0.28s, 7 tests
   [junit4] 
   [junit4] Suite: org.apache.lucene.index.TestSoftDeletesDirectoryReaderWrapper
   [junit4] Completed [23/570] on J1 in 0.27s, 4 tests
   [junit4] 
   [junit4] Suite: org.apache.lucene.document.TestXYLineShapeQueries
   [junit4] IGNOR/A 0.00s J3 | TestXYLineShapeQueries.testRandomBig
   [junit4]    > Assumption #1: 'nightly' test group is disabled (@Nightly())
   [junit4] Completed [24/570] on J3 in 2.53s, 5 tests, 1 skipped
   [junit4] 
   [junit4] Suite: org.apache.lucene.index.TestMultiDocValues
   [junit4] Completed [25/570] on J3 in 1.29s, 7 tests
   [junit4] 
   [junit4] Suite: org.apache.lucene.geo.TestSimpleWKTShapeParsing
   [junit4] Completed [26/570] on J3 in 0.29s, 14 tests
   [junit4] 
   [junit4] Suite: org.apache.lucene.search.TestShardSearching
   [junit4] Completed [27/570] on J1 in 3.94s, 1 test
   [junit4] 
   [junit4] Suite: org.apache.lucene.index.TestCrash
   [junit4] Completed [28/570] on J3 in 0.78s, 5 tests
   [junit4] 
   [junit4] Suite: org.apache.lucene.document.TestLatLonLineShapeQueries
   [junit4] IGNOR/A 0.01s J2 | TestLatLonLineShapeQueries.testRandomBig
   [junit4]    > Assumption #1: 'nightly' test group is disabled (@Nightly())
   [junit4] Completed [29/570] on J2 in 6.80s, 9 tests, 1 skipped
   [junit4] 
   [junit4] Suite: org.apache.lucene.document.TestLongRange
   [junit4] Completed [30/570] on J2 in 0.29s, 1 test
   [junit4] 
   [junit4] Suite: org.apache.lucene.search.TestXYPointDistanceSort
   [junit4] IGNOR/A 0.00s J3 | TestXYPointDistanceSort.testRandomHuge
   [junit4]    > Assumption #1: 'nightly' test group is disabled (@Nightly())
   [junit4] Completed [31/570] on J3 in 1.77s, 4 tests, 1 skipped
   [junit4] 
   [junit4] Suite: org.apache.lucene.search.TestXYPointQueries
   [junit4] IGNOR/A 0.00s J4 | TestXYPointQueries.testRandomDistanceHuge
   [junit4]    > Assumption #1: 'nightly' test group is disabled (@Nightly())
   [junit4] IGNOR/A 0.00s J4 | TestXYPointQueries.testRandomBig
   [junit4]    > Assumption #1: 'nightly' test group is disabled (@Nightly())
   [junit4] Completed [32/570] on J4 in 11.05s, 38 tests, 2 skipped
   [junit4] 
   [junit4] Suite: org.apache.lucene.index.TestIndexSorting
   [junit4] Completed [33/570] on J0 in 25.85s, 53 tests
   [junit4] 
   [junit4] Suite: org.apache.lucene.document.TestIntRange
   [junit4] Completed [34/570] on J0 in 0.28s, 1 test
   [junit4] 
   [junit4] Suite: org.apache.lucene.index.TestAtomicUpdate
   [junit4] Completed [35/570] on J3 in 1.27s, 1 test
   [junit4] 
   [junit4] Suite: org.apache.lucene.document.TestLatLonShapeEncoding
   [junit4] Completed [36/570] on J0 in 0.52s, 18 tests
   [junit4] 
   [junit4] Suite: org.apache.lucene.index.TestBagOfPositions
   [junit4] Completed [37/570] on J4 in 1.52s, 1 test
   [junit4] 
   [junit4] Suite: org.apache.lucene.index.TestMergeRateLimiter
   [junit4] Completed [38/570] on J0 in 0.26s, 1 test
   [junit4] 
   [junit4] Suite: org.apache.lucene.index.TestStressIndexing
   [junit4] Completed [39/570] on J1 in 4.54s, 1 test
   [junit4] 
   [junit4] Suite: org.apache.lucene.geo.TestPolygon
   [junit4] Completed [40/570] on J0 in 0.29s, 16 tests
   [junit4] 
   [junit4] Suite: org.apache.lucene.util.automaton.FiniteStringsIteratorTest
   [junit4] Completed [41/570] on J4 in 0.50s, 7 tests
   [junit4] 
   [junit4] Suite: org.apache.lucene.index.TestFieldInfos
   [junit4] Completed [42/570] on J4 in 0.28s, 4 tests
   [junit4] 
   [junit4] Suite: org.apache.lucene.search.TestPrefixInBooleanQuery
   [junit4] Completed [43/570] on J1 in 0.53s, 4 tests
   [junit4] 
   [junit4] Suite: org.apache.lucene.index.TestCodecs
   [junit4] Completed [44/570] on J0 in 0.53s, 3 tests
   [junit4] 
   [junit4] Suite: org.apache.lucene.util.TestWeakIdentityMap
   [junit4] Completed [45/570] on J3 in 1.47s, 2 tests
   [junit4] 
   [junit4] Suite: org.apache.lucene.search.TestSortedNumericSortField
   [junit4] Completed [46/570] on J1 in 0.30s, 9 tests
   [junit4] 
   [junit4] Suite: org.apache.lucene.analysis.TestCachingTokenFilter
   [junit4] Completed [47/570] on J1 in 0.28s, 2 tests
   [junit4] 
   [junit4] Suite: org.apache.lucene.search.TestWildcard
   [junit4] Completed [48/570] on J0 in 0.53s, 8 tests
   [junit4] 
   [junit4] Suite: org.apache.lucene.index.TestAllFilesDetectTruncation
   [junit4] IGNOR/A 0.00s J0 | TestAllFilesDetectTruncation.test
   [junit4]    > Assumption #1: 'awaitsfix' test group is disabled (@AwaitsFix(bugUrl=https://issues.apache.org/jira/browse/LUCENE-9409))
   [junit4] Completed [49/570] on J0 in 0.02s, 1 test, 1 skipped
   [junit4] 
   [junit4] Suite: org.apache.lucene.util.TestRecyclingIntBlockAllocator
   [junit4] Completed [50/570] on J4 in 0.54s, 3 tests
   [junit4] 
   [junit4] Suite: org.apache.lucene.analysis.TestGraphTokenFilter
   [junit4] Completed [51/570] on J1 in 0.26s, 4 tests
   [junit4] 
   [junit4] Suite: org.apache.lucene.TestDemo
   [junit4] Completed [52/570] on J1 in 0.25s, 1 test
   [junit4] 
   [junit4] Suite: org.apache.lucene.util.TestUnicodeUtil
   [junit4] Completed [53/570] on J0 in 0.51s, 5 tests
   [junit4] 
   [junit4] Suite: org.apache.lucene.document.TestLatLonMultiPolygonShapeQueries
   [junit4] IGNOR/A 0.00s J5 | TestLatLonMultiPolygonShapeQueries.testRandomBig
   [junit4]    > Assumption #1: 'nightly' test group is disabled (@Nightly())
   [junit4] Completed [54/570] on J5 in 25.11s, 9 tests, 1 skipped
   [junit4] 
   [junit4] Suite: org.apache.lucene.search.TestTopDocsCollector
   [junit4] Completed [55/570] on J4 in 2.52s, 14 tests
   [junit4] 
   [junit4] Suite: org.apache.lucene.store.TestByteBuffersDataInput
   [junit4] Completed [56/570] on J1 in 2.59s, 8 tests
   [junit4] 
   [junit4] Suite: org.apache.lucene.document.TestXYMultiPointShapeQueries
   [junit4] IGNOR/A 0.00s J5 | TestXYMultiPointShapeQueries.testRandomBig
   [junit4]    > Assumption #1: 'nightly' test group is disabled (@Nightly())
   [junit4] Completed [57/570] on J5 in 1.54s, 5 tests, 1 skipped
   [junit4] 
   [junit4] Suite: org.apache.lucene.index.TestSortingCodecReader
   [junit4] Completed [58/570] on J4 in 1.79s, 2 tests
   [junit4] 
   [junit4] Suite: org.apache.lucene.document.TestXYPointShapeQueries
   [junit4] IGNOR/A 0.00s J1 | TestXYPointShapeQueries.testRandomBig
   [junit4]    > Assumption #1: 'nightly' test group is disabled (@Nightly())
   [junit4] Completed [59/570] on J1 in 1.52s, 5 tests, 1 skipped
   [junit4] 
   [junit4] Suite: org.apache.lucene.index.TestMultiLevelSkipList
   [junit4] Completed [60/570] on J5 in 1.28s, 1 test
   [junit4] 
   [junit4] Suite: org.apache.lucene.index.TestExitableDirectoryReader
   [junit4] Completed [61/570] on J3 in 5.56s, 4 tests
   [junit4] 
   [junit4] Suite: org.apache.lucene.search.TestComplexExplanationsOfNonMatches
   [junit4] Completed [62/570] on J1 in 0.52s, 21 tests
   [junit4] 
   [junit4] Suite: org.apache.lucene.geo.TestXYCircle
   [junit4] Completed [63/570] on J5 in 0.27s, 6 tests
   [junit4] 
   [junit4] Suite: org.apache.lucene.util.TestRecyclingByteBlockAllocator
   [junit4] Completed [64/570] on J3 in 0.29s, 3 tests
   [junit4] 
   [junit4] Suite: org.apache.lucene.search.TestBooleanQueryVisitSubscorers
   [junit4] Completed [65/570] on J1 in 0.31s, 7 tests
   [junit4] 
   [junit4] Suite: org.apache.lucene.index.TestBinaryTerms
   [junit4] Completed [66/570] on J1 in 0.27s, 2 tests
   [junit4] 
   [junit4] Suite: org.apache.lucene.index.TestDuelingCodecs
   [junit4] Completed [67/570] on J0 in 6.05s, 2 tests
   [junit4] 
   [junit4] Suite: org.apache.lucene.search.TestSimpleExplanations
   [junit4] Completed [68/570] on J4 in 2.54s, 70 tests
   [junit4] 
   [junit4] Suite: org.apache.lucene.util.TestQueryBuilder
   [junit4] Completed [69/570] on J0 in 0.54s, 26 tests
   [junit4] 
   [junit4] Suite: org.apache.lucene.util.automaton.TestOperations
   [junit4] Completed [70/570] on J1 in 1.79s, 7 tests
   [junit4] 
   [junit4] Suite: org.apache.lucene.search.TestTermQuery
   [junit4] Completed [71/570] on J0 in 0.28s, 3 tests
   [junit4] 
   [junit4] Suite: org.apache.lucene.index.TestSumDocFreq
   [junit4] Completed [72/570] on J4 in 0.77s, 1 test
   [junit4] 
   [junit4] Suite: org.apache.lucene.index.TestCustomNorms
   [junit4] Completed [73/570] on J5 in 2.54s, 1 test
   [junit4] 
   [junit4] Suite: org.apache.lucene.index.TestMixedDocValuesUpdates
   [junit4] IGNOR/A 0.00s J2 | TestMixedDocValuesUpdates.testTonsOfUpdates
   [junit4]    > Assumption #1: 'nightly' test group is disabled (@Nightly())
   [junit4] Completed [74/570] on J2 in 11.83s, 10 tests, 1 skipped
   [junit4] 
   [junit4] Suite: org.apache.lucene.geo.TestRectangle2D
   [junit4] Completed [75/570] on J2 in 0.29s, 4 tests
   [junit4] 
   [junit4] Suite: org.apache.lucene.index.TestReaderPool
   [junit4] Completed [76/570] on J1 in 0.59s, 6 tests
   [junit4] 
   [junit4] Suite: org.apache.lucene.index.TestParallelTermEnum
   [junit4] Completed [77/570] on J1 in 0.27s, 1 test
   [junit4] 
   [junit4] Suite: org.apache.lucene.search.TestQueryRescorer
   [junit4] Completed [78/570] on J4 in 1.03s, 8 tests
   [junit4] 
   [junit4] Suite: org.apache.lucene.search.similarities.TestAxiomaticF1EXP
   [junit4] Completed [79/570] on J5 in 0.78s, 1 test
   [junit4] 
   [junit4] Suite: org.apache.lucene.index.TestSnapshotDeletionPolicy
   [junit4] Completed [80/570] on J0 in 1.05s, 7 tests
   [junit4] 
   [junit4] Suite: org.apache.lucene.search.TestSubScorerFreqs
   [junit4] Completed [81/570] on J4 in 0.27s, 3 tests
   [junit4] 
   [junit4] Suite: org.apache.lucene.search.TestSegmentCacheables
   [junit4] Completed [82/570] on J0 in 0.31s, 1 test
   [junit4] 
   [junit4] Suite: org.apache.lucene.analysis.TestCharFilter
   [junit4] Completed [83/570] on J4 in 0.29s, 4 tests
   [junit4] 
   [junit4] Suite: org.apache.lucene.analysis.TestStopFilter
   [junit4] Completed [84/570] on J4 in 0.27s, 5 tests
   [junit4] 
   [junit4] Suite: org.apache.lucene.TestSearch
   [junit4] Completed [85/570] on J4 in 0.27s, 1 test
   [junit4] 
   [junit4] Suite: org.apache.lucene.store.TestDirectory
   [junit4] IGNOR/A 0.01s J4 | TestDirectory.testListAll
   [junit4]    > Assumption #1: this test does not expect extra files
   [junit4] Completed [86/570] on J4 in 0.27s, 4 tests, 1 skipped
   [junit4] 
   [junit4] Suite: org.apache.lucene.document.TestXYShapeEncoding
   [junit4] Completed [87/570] on J4 in 0.31s, 18 tests
   [junit4] 
   [junit4] Suite: org.apache.lucene.search.TestConstantScoreQuery
   [junit4] Completed [88/570] on J4 in 0.31s, 5 tests
   [junit4] 
   [junit4] Suite: org.apache.lucene.search.TestBoostQuery
   [junit4] Completed [89/570] on J4 in 0.29s, 4 tests
   [junit4] 
   [junit4] Suite: org.apache.lucene.index.TestStressDeletes
   [junit4] Completed [90/570] on J0 in 2.05s, 1 test
   [junit4] 
   [junit4] Suite: org.apache.lucene.index.TestConsistentFieldNumbers
   [junit4] Completed [91/570] on J2 in 3.02s, 4 tests
   [junit4] 
   [junit4] Suite: org.apache.lucene.search.TestPositiveScoresOnlyCollector
   [junit4] Completed [92/570] on J0 in 0.28s, 1 test
   [junit4] 
   [junit4] Suite: org.apache.lucene.search.TestTimeLimitingCollector
   [junit4] Completed [93/570] on J3 in 6.06s, 7 tests
   [junit4] 
   [junit4] Suite: org.apache.lucene.search.TestBlockMaxConjunction
   [junit4] Completed [94/570] on J1 in 3.07s, 1 test
   [junit4] 
   [junit4] Suite: org.apache.lucene.index.TestSortedSetDocValues
   [junit4] Completed [95/570] on J3 in 0.28s, 1 test
   [junit4] 
   [junit4] Suite: org.apache.lucene.geo.TestXYPoint
   [junit4] Completed [96/570] on J1 in 0.28s, 4 tests
   [junit4] 
   [junit4] Suite: org.apache.lucene.util.TestSPIClassIterator
   [junit4] Completed [98/570] on J1 in 0.30s, 1 test
   [junit4] 
   [junit4] Suite: org.apache.lucene.search.TestSimilarityProvider
   [junit4] Completed [99/570] on J3 in 0.27s, 1 test
   [junit4] 
   [junit4] Suite: org.apache.lucene.index.TestNRTReaderCleanup
   [junit4] Completed [100/570] on J1 in 0.28s, 1 test
   [junit4] 
   [junit4] Suite: org.apache.lucene.search.TestSortRescorer
   [junit4] Completed [101/570] on J0 in 1.04s, 3 tests
   [junit4] 
   [junit4] Suite: org.apache.lucene.analysis.TestAnalyzerWrapper
   [junit4] Completed [102/570] on J0 in 0.27s, 1 test
   [junit4] 
   [junit4] Suite: org.apache.lucene.index.TestCheckIndex
   [junit4] Completed [103/570] on J4 in 1.77s, 4 tests
   [junit4] 
   [junit4] Suite: org.apache.lucene.util.bkd.Test2BBKDPoints
   [junit4] IGNOR/A 0.00s J4 | Test2BBKDPoints.test1D
   [junit4]    > Assumption #1: 'monster' test group is disabled (@Monster(value=takes at least 4 hours and consumes many GB of temp disk space))
   [junit4] IGNOR/A 0.00s J4 | Test2BBKDPoints.test2D
   [junit4]    > Assumption #1: 'monster' test group is disabled (@Monster(value=takes at least 4 hours and consumes many GB of temp disk space))
   [junit4] Completed [104/570] on J4 in 0.01s, 2 tests, 2 skipped
   [junit4] 
   [junit4] Suite: org.apache.lucene.index.TestStressNRT
   [junit4] Completed [105/570] on J3 in 0.81s, 1 test
   [junit4] 
   [junit4] Suite: org.apache.lucene.analysis.TestDelegatingAnalyzerWrapper
   [junit4] Completed [106/570] on J0 in 0.31s, 3 tests
   [junit4] 
   [junit4] Suite: org.apache.lucene.TestAssertions
   [junit4] Completed [107/570] on J0 in 0.27s, 1 test
   [junit4] 
   [junit4] Suite: org.apache.lucene.store.TestByteArrayDataInput
   [junit4] Completed [108/570] on J0 in 0.28s, 1 test
   [junit4] 
   [junit4] Suite: org.apache.lucene.search.TestPrefixRandom
   [junit4] Completed [109/570] on J3 in 1.79s, 1 test
   [junit4] 
   [junit4] Suite: org.apache.lucene.search.TestSortedSetSortField
   [junit4] Completed [110/570] on J3 in 0.27s, 7 tests
   [junit4] 
   [junit4] Suite: org.apache.lucene.index.TestBagOfPostings
   [junit4] Completed [111/570] on J5 in 6.55s, 1 test
   [junit4] 
   [junit4] Suite: org.apache.lucene.analysis.TestCharArraySet
   [junit4] Completed [112/570] on J3 in 0.29s, 15 tests
   [junit4] 
   [junit4] Suite: org.apache.lucene.util.automaton.LimitedFiniteStringsIteratorTest
   [junit4] Completed [113/570] on J5 in 0.26s, 6 tests
   [junit4] 
   [junit4] Suite: org.apache.lucene.index.TestRollingUpdates
   [junit4] Completed [114/570] on J4 in 2.54s, 2 tests
   [junit4] 
   [junit4] Suite: org.apache.lucene.analysis.TestReusableStringReader
   [junit4] Completed [115/570] on J3 in 0.27s, 1 test
   [junit4] 
   [junit4] Suite: org.apache.lucene.index.TestFieldInvertState
   [junit4] Completed [116/570] on J5 in 0.27s, 2 tests
   [junit4] 
   [junit4] Suite: org.apache.lucene.index.TestPendingDeletes
   [junit4] Completed [117/570] on J4 in 0.29s, 3 tests
   [junit4] 
   [junit4] Suite: org.apache.lucene.util.TestRoaringDocIdSet
   [junit4] Completed [118/570] on J5 in 0.54s, 5 tests
   [junit4] 
   [junit4] Suite: org.apache.lucene.TestMergeSchedulerExternal
   [junit4] Completed [119/570] on J3 in 1.04s, 2 tests
   [junit4] 
   [junit4] Suite: org.apache.lucene.search.TestBooleanMinShouldMatch
   [junit4] Completed [120/570] on J4 in 1.78s, 17 tests
   [junit4] 
   [junit4] Suite: org.apache.lucene.index.Test2BBinaryDocValues
   [junit4] IGNOR/A 0.00s J4 | Test2BBinaryDocValues.testFixedBinary
   [junit4]    > Assumption #1: 'monster' test group is disabled (@Monster(value=takes ~ 6 hours if the heap is 5gb))
   [junit4] IGNOR/A 0.00s J4 | Test2BBinaryDocValues.testVariableBinary
   [junit4]    > Assumption #1: 'monster' test group is disabled (@Monster(value=takes ~ 6 hours if the heap is 5gb))
   [junit4] Completed [121/570] on J4 in 0.01s, 2 tests, 2 skipped
   [junit4] 
   [junit4] Suite: org.apache.lucene.search.TestTopDocsMerge
   [junit4] Completed [122/570] on J5 in 1.26s, 5 tests
   [junit4] 
   [junit4] Suite: org.apache.lucene.index.TestStressAdvance
   [junit4] Completed [123/570] on J5 in 1.79s, 1 test
   [junit4] 
   [junit4] Suite: org.apache.lucene.search.TestSimpleExplanationsOfNonMatches
   [junit4] Completed [124/570] on J5 in 0.53s, 70 tests
   [junit4] 
   [junit4] Suite: org.apache.lucene.store.TestByteBuffersDirectory
   [junit4] IGNOR/A 0.02s J3 | TestByteBuffersDirectory.testPendingDeletions {impl=byte array (heap)}
   [junit4]    > Assumption #1: we can only install VirusCheckingFS on an FSDirectory
   [junit4] IGNOR/A 0.01s J3 | TestByteBuffersDirectory.testFsyncDoesntCreateNewFiles {impl=byte array (heap)}
   [junit4]    > Assumption #1: test only works for FSDirectory subclasses
   [junit4] IGNOR/A 0.01s J3 | TestByteBuffersDirectory.testPendingDeletions {impl=one buffer (heap)}
   [junit4]    > Assumption #1: we can only install VirusCheckingFS on an FSDirectory
   [junit4] IGNOR/A 0.00s J3 | TestByteBuffersDirectory.testFsyncDoesntCreateNewFiles {impl=one buffer (heap)}
   [junit4]    > Assumption #1: test only works for FSDirectory subclasses
   [junit4] IGNOR/A 0.00s J3 | TestByteBuffersDirectory.testPendingDeletions {impl=many buffers (heap)}
   [junit4]    > Assumption #1: we can only install VirusCheckingFS on an FSDirectory
   [junit4] IGNOR/A 0.00s J3 | TestByteBuffersDirectory.testFsyncDoesntCreateNewFiles {impl=many buffers (heap)}
   [junit4]    > Assumption #1: test only works for FSDirectory subclasses
   [junit4] IGNOR/A 0.00s J3 | TestByteBuffersDirectory.testPendingDeletions {impl=lucene's buffers (heap)}
   [junit4]    > Assumption #1: we can only install VirusCheckingFS on an FSDirectory
   [junit4] IGNOR/A 0.00s J3 | TestByteBuffersDirectory.testFsyncDoesntCreateNewFiles {impl=lucene's buffers (heap)}
   [junit4]    > Assumption #1: test only works for FSDirectory subclasses
   [junit4] Completed [125/570] on J3 in 3.34s, 180 tests, 8 skipped
   [junit4] 
   [junit4] Suite: org.apache.lucene.index.TestSwappedIndexFiles
   [junit4] Completed [126/570] on J5 in 0.28s, 1 test
   [junit4] 
   [junit4] Suite: org.apache.lucene.index.TestTermsEnum
   [junit4] IGNOR/A 0.00s J1 | TestTermsEnum.testVaryingTermsPerSegment
   [junit4]    > Assumption #1: 'nightly' test group is disabled (@Nightly())
   [junit4] Completed [127/570] on J1 in 7.82s, 13 tests, 1 skipped
   [junit4] 
   [junit4] Suite: org.apache.lucene.index.Test2BPoints
   [junit4] IGNOR/A 0.00s J1 | Test2BPoints.test1D
   [junit4]    > Assumption #1: 'monster' test group is disabled (@Monster(value=takes at least 4 hours and consumes many GB of temp disk space))
   [junit4] IGNOR/A 0.00s J1 | Test2BPoints.test2D
   [junit4]    > Assumption #1: 'monster' test group is disabled (@Monster(value=takes at least 4 hours and consumes many GB of temp disk space))
   [junit4] Completed [128/570] on J1 in 0.03s, 2 tests, 2 skipped
   [junit4] 
   [junit4] Suite: org.apache.lucene.document.TestXYShape
   [junit4] Completed [129/570] on J3 in 0.28s, 3 tests
   [junit4] 
   [junit4] Suite: org.apache.lucene.search.TestQueryVisitor
   [junit4] Completed [130/570] on J5 in 0.27s, 4 tests
   [junit4] 
   [junit4] Suite: org.apache.lucene.search.TestConjunctions
   [junit4] Completed [131/570] on J3 in 0.27s, 2 tests
   [junit4] 
   [junit4] Suite: org.apache.lucene.search.TestSynonymQuery
   [junit4] Completed [132/570] on J5 in 0.29s, 7 tests
   [junit4] 
   [junit4] Suite: org.apache.lucene.geo.TestGeoEncodingUtils
   [junit4] Completed [133/570] on J1 in 0.52s, 3 tests
   [junit4] 
   [junit4] Suite: org.apache.lucene.search.TestXYDocValuesQueries
   [junit4] IGNOR/A 0.00s J2 | TestXYDocValuesQueries.testRandomDistanceHuge
   [junit4]    > Assumption #1: 'nightly' test group is disabled (@Nightly())
   [junit4] IGNOR/A 0.00s J2 | TestXYDocValuesQueries.testRandomBig
   [junit4]    > Assumption #1: 'nightly' test group is disabled (@Nightly())
   [junit4] Completed [134/570] on J2 in 9.83s, 38 tests, 2 skipped
   [junit4] 
   [junit4] Suite: org.apache.lucene.analysis.TestCharacterUtils
   [junit4] Completed [135/570] on J5 in 0.29s, 5 tests
   [junit4] 
   [junit4] Suite: org.apache.lucene.analysis.TestToken
   [junit4] Completed [136/570] on J5 in 0.29s, 5 tests
   [junit4] 
   [junit4] Suite: org.apache.lucene.codecs.lucene86.TestLucene86SegmentInfoFormat
   [junit4] Completed [137/570] on J1 in 0.77s, 17 tests
   [junit4] 
   [junit4] Suite: org.apache.lucene.TestSearchForDuplicates
   [junit4] Completed [138/570] on J5 in 0.27s, 1 test
   [junit4] 
   [junit4] Suite: org.apache.lucene.index.TestAllFilesHaveCodecHeader
   [junit4] Completed [139/570] on J2 in 1.05s, 1 test
   [junit4] 
   [junit4] Suite: org.apache.lucene.util.TestVirtualMethod
   [junit4] Completed [140/570] on J2 in 0.28s, 2 tests
   [junit4] 
   [junit4] Suite: org.apache.lucene.index.TestExceedMaxTermLength
   [junit4] Completed [141/570] on J2 in 0.28s, 1 test
   [junit4] 
   [junit4] Suite: org.apache.lucene.util.fst.TestFSTs
   [junit4] IGNOR/A 0.00s J4 | TestFSTs.testBigSet
   [junit4]    > Assumption #1: 'nightly' test group is disabled (@Nightly())
   [junit4] Completed [142/570] on J4 in 5.29s, 21 tests, 1 skipped
   [junit4] 
   [junit4] Suite: org.apache.lucene.util.TestRamUsageEstimator
   [junit4] IGNOR/A 0.00s J2 | TestRamUsageEstimator.testHotspotBean
   [junit4]    > Assumption #1: testHotspotBean only works on 64bit JVMs.
   [junit4] IGNOR/A 0.00s J2 | TestRamUsageEstimator.testPrintValues
   [junit4]    > Assumption #1: Specify -Dtests.verbose=true to print constants of RamUsageEstimator.
   [junit4] Completed [143/570] on J2 in 0.26s, 10 tests, 2 skipped
   [junit4] 
   [junit4] Suite: org.apache.lucene.search.TestBooleanScorer
   [junit4] Completed [144/570] on J3 in 2.28s, 6 tests
   [junit4] 
   [junit4] Suite: org.apache.lucene.store.TestFileSwitchDirectory
   [junit4] IGNOR/A 0.01s J5 | TestFileSwitchDirectory.testPendingDeletions
   [junit4]    > Assumption #1: we can only install VirusCheckingFS on an FSDirectory
   [junit4] IGNOR/A 0.01s J5 | TestFileSwitchDirectory.testFsyncDoesntCreateNewFiles
   [junit4]    > Assumption #1: test only works for FSDirectory subclasses
   [junit4] Completed [145/570] on J5 in 1.29s, 47 tests, 2 skipped
   [junit4] 
   [junit4] Suite: org.apache.lucene.geo.TestCircle
   [junit4] Completed [146/570] on J5 in 0.26s, 5 tests
   [junit4] 
   [junit4] Suite: org.apache.lucene.search.TestTermScorer
   [junit4] Completed [147/570] on J2 in 0.25s, 5 tests
   [junit4] 
   [junit4] Suite: org.apache.lucene.util.TestSloppyMath
   [junit4] Completed [148/570] on J4 in 0.75s, 8 tests
   [junit4] 
   [junit4] Suite: org.apache.lucene.search.TestConstantScoreScorer
   [junit4] Completed [149/570] on J5 in 0.51s, 7 tests
   [junit4] 
   [junit4] Suite: org.apache.lucene.index.TestSoftDeletesRetentionMergePolicy
   [junit4] Completed [150/570] on J2 in 0.50s, 14 tests
   [junit4] 
   [junit4] Suite: org.apache.lucene.index.TestIndexWriterMergePolicy
   [junit4] IGNOR/A 0.00s J1 | TestIndexWriterMergePolicy.testMaxBufferedDocsChange
   [junit4]    > Assumption #1: 'nightly' test group is disabled (@Nightly())
   [junit4] Completed [151/570] on J1 in 2.29s, 16 tests, 1 skipped
   [junit4] 
   [junit4] Suite: org.apache.lucene.search.TestCachingCollector
   [junit4] Completed [152/570] on J5 in 0.27s, 4 tests
   [junit4] 
   [junit4] Suite: org.apache.lucene.search.TestSimilarity
   [junit4] Completed [153/570] on J2 in 0.28s, 1 test
   [junit4] 
   [junit4] Suite: org.apache.lucene.document.TestFeatureField
   [junit4] Completed [154/570] on J1 in 0.25s, 8 tests
   [junit4] 
   [junit4] Suite: org.apache.lucene.index.TestByteSlices
   [junit4] Completed [155/570] on J3 in 1.27s, 1 test
   [junit4] 
   [junit4] Suite: org.apache.lucene.index.TestCodecHoldsOpenFiles
   [junit4] Completed [156/570] on J5 in 0.25s, 1 test
   [junit4] 
   [junit4] Suite: org.apache.lucene.search.TestMaxScoreSumPropagator
   [junit4] Completed [157/570] on J1 in 0.25s, 6 tests
   [junit4] 
   [junit4] Suite: org.apache.lucene.util.automaton.TestUTF32ToUTF8
   [junit4] Completed [158/570] on J3 in 0.77s, 6 tests
   [junit4] 
   [junit4] Suite: org.apache.lucene.index.TestRollback
   [junit4] Completed [159/570] on J3 in 0.27s, 1 test
   [junit4] 
   [junit4] Suite: org.apache.lucene.index.TestStressIndexing2
   [junit4] Completed [160/570] on J2 in 1.25s, 3 tests
   [junit4] 
   [junit4] Suite: org.apache.lucene.index.TestPayloadsOnVectors
   [junit4] Completed [161/570] on J3 in 0.27s, 3 tests
   [junit4] 
   [junit4] Suite: org.apache.lucene.document.TestXYMultiPolygonShapeQueries
   [junit4] IGNOR/A 0.00s J0 | TestXYMultiPolygonShapeQueries.testRandomBig
   [junit4]    > Assumption #1: 'nightly' test group is disabled (@Nightly())
   [junit4] Completed [162/570] on J0 in 11.82s, 5 tests, 1 skipped
   [junit4] 
   [junit4] Suite: org.apache.lucene.search.TestBoolean2ScorerSupplier
   [junit4] Completed [163/570] on J3 in 0.28s, 10 tests
   [junit4] 
   [junit4] Suite: org.apache.lucene.geo.TestXYRectangle
   [junit4] Completed [164/570] on J3 in 0.28s, 5 tests
   [junit4] 
   [junit4] Suite: org.apache.lucene.search.TestPrefixQuery
   [junit4] Completed [165/570] on J2 in 0.78s, 3 tests
   [junit4] 
   [junit4] Suite: org.apache.lucene.search.TestSortedSetSelector
   [junit4] Completed [166/570] on J2 in 0.27s, 15 tests
   [junit4] 
   [junit4] Suite: org.apache.lucene.analysis.TestCharArrayMap
   [junit4] Completed [167/570] on J2 in 0.26s, 4 tests
   [junit4] 
   [junit4] Suite: org.apache.lucene.util.fst.TestBytesStore
   [junit4] Completed [168/570] on J3 in 0.78s, 1 test
   [junit4] 
   [junit4] Suite: org.apache.lucene.search.TestComplexExplanations
   [junit4] Completed [169/570] on J0 in 1.29s, 21 tests
   [junit4] 
   [junit4] Suite: org.apache.lucene.search.TestDocValuesRewriteMethod
   [junit4] Completed [170/570] on J1 in 2.53s, 2 tests
   [junit4] 
   [junit4] Suite: org.apache.lucene.util.TestSetOnce
   [junit4] Completed [171/570] on J3 in 0.29s, 5 tests
   [junit4] 
   [junit4] Suite: org.apache.lucene.search.TestBooleanQuery
   [junit4] Completed [172/570] on J0 in 0.54s, 22 tests
   [junit4] 
   [junit4] Suite: org.apache.lucene.index.TestNeverDelete
   [junit4] Completed [173/570] on J4 in 4.05s, 1 test
   [junit4] 
   [junit4] Suite: org.apache.lucene.search.TestFieldSortOptimizationSkipping
   [junit4] IGNOR/A 0.00s J1 | TestFieldSortOptimizationSkipping.testDocSortOptimization
   [junit4]    > Assumption #1: 'awaitsfix' test group is disabled (@AwaitsFix(bugUrl=https://issues.apache.org/jira/browse/LUCENE-9569))
   [junit4] IGNOR/A 0.01s J1 | TestFieldSortOptimizationSkipping.testDocSortOptimizationWithAfter
   [junit4]    > Assumption #1: 'awaitsfix' test group is disabled (@AwaitsFix(bugUrl=https://issues.apache.org/jira/browse/LUCENE-9569))
   [junit4] Completed [174/570] on J1 in 1.54s, 8 tests, 2 skipped
   [junit4] 
   [junit4] Suite: org.apache.lucene.index.TestNRTThreads
   [junit4] Completed [175/570] on J3 in 1.29s, 1 test
   [junit4] 
   [junit4] Suite: org.apache.lucene.index.TestTermsHashPerField
   [junit4] Completed [176/570] on J3 in 0.28s, 2 tests
   [junit4] 
   [junit4] Suite: org.apache.lucene.index.Test2BPostings
   [junit4] IGNOR/A 0.00s J3 | Test2BPostings.test
   [junit4]    > Assumption #1: 'nightly' test group is disabled (@Nightly())
   [junit4] Completed [177/570] on J3 in 0.01s, 1 test, 1 skipped
   [junit4] 
   [junit4] Suite: org.apache.lucene.geo.TestLine2D
   [junit4] Completed [178/570] on J3 in 0.28s, 4 tests
   [junit4] 
   [junit4] Suite: org.apache.lucene.analysis.TestGraphTokenizers
   [junit4] Completed [179/570] on J2 in 2.53s, 23 tests
   [junit4] 
   [junit4] Suite: org.apache.lucene.index.TestThreadedForceMerge
   [junit4] Completed [180/570] on J4 in 1.56s, 1 test
   [junit4] 
   [junit4] Suite: org.apache.lucene.index.Test2BPostingsBytes
   [junit4] IGNOR/A 0.00s J4 | Test2BPostingsBytes.test
   [junit4]    > Assumption #1: 'monster' test group is disabled (@Monster(value=takes ~20GB-30GB of space and 10 minutes))
   [junit4] Completed [181/570] on J4 in 0.00s, 1 test, 1 skipped
   [junit4] 
   [junit4] Suite: org.apache.lucene.geo.TestPoint
   [junit4] Completed [182/570] on J4 in 0.27s, 2 tests
   [junit4] 
   [junit4] Suite: org.apache.lucene.TestExternalCodecs
   [junit4] Completed [183/570] on J2 in 0.78s, 1 test
   [junit4] 
   [junit4] Suite: org.apache.lucene.store.TestByteBuffersDataOutput
   [junit4] Completed [184/570] on J2 in 0.32s, 9 tests
   [junit4] 
   [junit4] Suite: org.apache.lucene.codecs.lucene87.TestLucene87StoredFieldsFormatMergeInstance
   [junit4] IGNOR/A 0.00s J4 | TestLucene87StoredFieldsFormatMergeInstance.testRamBytesUsed
   [junit4]    > Assumption #1: 'nightly' test group is disabled (@Nightly())
   [junit4] IGNOR/A 0.00s J4 | TestLucene87StoredFieldsFormatMergeInstance.testBigDocuments
   [junit4]    > Assumption #1: 'nightly' test group is disabled (@Nightly())
   [junit4] Completed [185/570] on J4 in 2.51s, 18 tests, 2 skipped
   [junit4] 
   [junit4] Suite: org.apache.lucene.analysis.standard.TestStandardAnalyzer
   [junit4] Completed [186/570] on J1 in 3.58s, 45 tests
   [junit4] 
   [junit4] Suite: org.apache.lucene.codecs.lucene87.TestLucene87StoredFieldsFormatHighCompression
   [junit4] IGNOR/A 0.00s J3 | TestLucene87StoredFieldsFormatHighCompression.testBigDocuments
   [junit4]    > Assumption #1: 'nightly' test group is disabled (@Nightly())
   [junit4] IGNOR/A 0.00s J3 | TestLucene87StoredFieldsFormatHighCompression.testRamBytesUsed
   [junit4]    > Assumption #1: 'nightly' test group is disabled (@Nightly())
   [junit4] Completed [187/570] on J3 in 3.58s, 21 tests, 2 skipped
   [junit4] 
   [junit4] Suite: org.apache.lucene.index.TestIndexWriterOnDiskFull
   [junit4] Completed [188/570] on J4 in 0.53s, 4 tests
   [junit4] 
   [junit4] Suite: org.apache.lucene.document.TestFieldType
   [junit4] Completed [189/570] on J4 in 0.25s, 5 tests
   [junit4] 
   [junit4] Suite: org.apache.lucene.search.TestMultiPhraseEnum
   [junit4] Completed [190/570] on J4 in 0.25s, 2 tests
   [junit4] 
   [junit4] Suite: org.apache.lucene.search.TestEarlyTermination
   [junit4] Completed [191/570] on J4 in 0.26s, 1 test
   [junit4] 
   [junit4] Suite: org.apache.lucene.index.TestIndexFileDeleter
   [junit4] Completed [192/570] on J1 in 1.28s, 10 tests
   [junit4] 
   [junit4] Suite: org.apache.lucene.index.TestBinaryDocValuesUpdates
   [junit4] IGNOR/A 0.00s J0 | TestBinaryDocValuesUpdates.testTonsOfUpdates
   [junit4]    > Assumption #1: 'nightly' test group is disabled (@Nightly())
   [junit4] Completed [193/570] on J0 in 6.30s, 29 tests, 1 skipped
   [junit4] 
   [junit4] Suite: org.apache.lucene.util.bkd.TestBKD
   [junit4] IGNOR/A 0.00s J5 | TestBKD.testRandomBinaryBig
   [junit4]    > Assumption #1: 'nightly' test group is disabled (@Nightly())
   [junit4] Completed [194/570] on J5 in 9.43s, 25 tests, 1 skipped
   [junit4] 
   [junit4] Suite: org.apache.lucene.index.TestOmitTf
   [junit4] Completed [195/570] on J1 in 0.52s, 4 tests
   [junit4] 
   [junit4] Suite: org.apache.lucene.index.TestSameTokenSamePosition
   [junit4] Completed [196/570] on J5 in 0.29s, 2 tests
   [junit4] 
   [junit4] Suite: org.apache.lucene.search.TestFloatRangeFieldQueries
   [junit4] IGNOR/A 0.00s J4 | TestFloatRangeFieldQueries.testRandomBig
   [junit4]    > Assumption #1: 'nightly' test group is disabled (@Nightly())
   [junit4] Completed [197/570] on J4 in 1.03s, 7 tests, 1 skipped
   [junit4] 
   [junit4] Suite: org.apache.lucene.index.TestPendingSoftDeletes
   [junit4] Completed [198/570] on J5 in 0.27s, 8 tests
   [junit4] 
   [junit4] Suite: org.apache.lucene.analysis.tokenattributes.TestPackedTokenAttributeImpl
   [junit4] Completed [199/570] on J4 in 0.28s, 4 tests
   [junit4] 
   [junit4] Suite: org.apache.lucene.index.TestIndexWriterNRTIsCurrent
   [junit4] Completed [200/570] on J3 in 2.25s, 1 test
   [junit4] 
   [junit4] Suite: org.apache.lucene.util.automaton.TestMinimize
   [junit4] IGNOR/A 0.00s J0 | TestMinimize.testMinimizeHuge
   [junit4]    > Assumption #1: 'nightly' test group is disabled (@Nightly())
   [junit4] Completed [201/570] on J0 in 1.02s, 3 tests, 1 skipped
   [junit4] 
   [junit4] Suite: org.apache.lucene.index.TestReaderClosed
   [junit4] Completed [202/570] on J0 in 0.26s, 2 tests
   [junit4] 
   [junit4] Suite: org.apache.lucene.document.TestField
   [junit4] Completed [203/570] on J3 in 0.31s, 23 tests
   [junit4] 
   [junit4] Suite: org.apache.lucene.util.TestSparseFixedBitSet
   [junit4] Completed [204/570] on J1 in 1.29s, 11 tests
   [junit4] 
   [junit4] Suite: org.apache.lucene.index.TestParallelReaderEmptyIndex
   [junit4] Completed [205/570] on J0 in 0.26s, 2 tests
   [junit4] 
   [junit4] Suite: org.apache.lucene.search.TestBlendedTermQuery
   [junit4] Completed [206/570] on J0 in 0.28s, 3 tests
   [junit4] 
   [junit4] Suite: org.apache.lucene.search.TestMultiCollector
   [junit4] Completed [207/570] on J3 in 0.51s, 12 tests
   [junit4] 
   [junit4] Suite: org.apache.lucene.geo.TestXYLine
   [junit4] Completed [208/570] on J0 in 0.26s, 8 tests
   [junit4] 
   [junit4] Suite: org.apache.lucene.index.TestIndexOptions
   [junit4] Completed [209/570] on J4 in 1.76s, 3 tests
   [junit4] 
   [junit4] Suite: org.apache.lucene.util.compress.TestLowercaseAsciiCompression
   [junit4] Completed [210/570] on J0 in 0.53s, 6 tests
   [junit4] 
   [junit4] Suite: org.apache.lucene.search.TestLongRangeFieldQueries
   [junit4] IGNOR/A 0.00s J1 | TestLongRangeFieldQueries.testRandomBig
   [junit4]    > Assumption #1: 'nightly' test group is disabled (@Nightly())
   [junit4] Completed [211/570] on J1 in 1.26s, 7 tests, 1 skipped
   [junit4] 
   [junit4] Suite: org.apache.lucene.index.TestParallelCompositeReader
   [junit4] Completed [212/570] on J4 in 0.27s, 11 tests
   [junit4] 
   [junit4] Suite: org.apache.lucene.document.TestXYPolygonShapeQueries
   [junit4] IGNOR/A 0.00s J2 | TestXYPolygonShapeQueries.testRandomBig
   [junit4]    > Assumption #1: 'nightly' test group is disabled (@Nightly())
   [junit4] Completed [213/570] on J2 in 6.31s, 5 tests, 1 skipped
   [junit4] 
   [junit4] Suite: org.apache.lucene.index.TestNoMergePolicy
   [junit4] Completed [214/570] on J1 in 0.28s, 7 tests
   [junit4] 
   [junit4] Suite: org.apache.lucene.util.TestTimSorter
   [junit4] Completed [215/570] on J4 in 0.27s, 9 tests
   [junit4] 
   [junit4] Suite: org.apache.lucene.util.TestRollingBuffer
   [junit4] Completed [216/570] on J0 in 0.50s, 1 test
   [junit4] 
   [junit4] Suite: org.apache.lucene.search.TestDoubleValuesSource
   [junit4] Completed [217/570] on J3 in 1.26s, 7 tests
   [junit4] 
   [junit4] Suite: org.apache.lucene.search.TestMatchNoDocsQuery
   [junit4] Completed [218/570] on J4 in 0.27s, 3 tests
   [junit4] 
   [junit4] Suite: org.apache.lucene.index.TestMultiTermsEnum
   [junit4] Completed [219/570] on J0 in 0.25s, 1 test
   [junit4] 
   [junit4] Suite: org.apache.lucene.search.TestBooleanOr
   [junit4] Completed [220/570] on J5 in 2.79s, 7 tests
   [junit4] 
   [junit4] Suite: org.apache.lucene.index.Test2BDocs
   [junit4] IGNOR/A 0.00s J5 | Test2BDocs.test2BDocs
   [junit4]    > Assumption #1: 'monster' test group is disabled (@Monster(value=Takes ~30min))
   [junit4] Completed [221/570] on J5 in 0.00s, 1 test, 1 skipped
   [junit4] 
   [junit4] Suite: org.apache.lucene.search.TestFilterWeight
   [junit4] Completed [222/570] on J3 in 0.27s, 1 test
   [junit4] 
   [junit4] Suite: org.apache.lucene.codecs.TestCodecLoadingD

[...truncated too long message...]

CloseExecutor-19-thread-1) [     ] o.a.s.u.DirectUpdateHandler2 Committing on IndexWriter.close()  ... SKIPPED (unnecessary).
   [junit4]   2> 15676 INFO  (SUITE-TestRandomDVFaceting-seed#[135736BDCE8CA2EF]-worker) [     ] o.a.s.m.SolrMetricManager Closing metric reporters for registry=solr.node tag=null
   [junit4]   2> 15676 INFO  (SUITE-TestRandomDVFaceting-seed#[135736BDCE8CA2EF]-worker) [     ] o.a.s.m.r.SolrJmxReporter Closing reporter [org.apache.solr.metrics.reporters.SolrJmxReporter@1d496e0: rootName = null, domain = solr.node, service url = null, agent id = null] for registry solr.node/com.codahale.metrics.MetricRegistry@1c3926f
   [junit4]   2> 15684 INFO  (SUITE-TestRandomDVFaceting-seed#[135736BDCE8CA2EF]-worker) [     ] o.a.s.m.SolrMetricManager Closing metric reporters for registry=solr.jvm tag=null
   [junit4]   2> 15684 INFO  (SUITE-TestRandomDVFaceting-seed#[135736BDCE8CA2EF]-worker) [     ] o.a.s.m.r.SolrJmxReporter Closing reporter [org.apache.solr.metrics.reporters.SolrJmxReporter@57216f: rootName = null, domain = solr.jvm, service url = null, agent id = null] for registry solr.jvm/com.codahale.metrics.MetricRegistry@1e0ac25
   [junit4]   2> 15684 INFO  (SUITE-TestRandomDVFaceting-seed#[135736BDCE8CA2EF]-worker) [     ] o.a.s.m.SolrMetricManager Closing metric reporters for registry=solr.jetty tag=null
   [junit4]   2> 15684 INFO  (SUITE-TestRandomDVFaceting-seed#[135736BDCE8CA2EF]-worker) [     ] o.a.s.m.r.SolrJmxReporter Closing reporter [org.apache.solr.metrics.reporters.SolrJmxReporter@c5e9a6: rootName = null, domain = solr.jetty, service url = null, agent id = null] for registry solr.jetty/com.codahale.metrics.MetricRegistry@b32e1c
   [junit4]   2> NOTE: leaving temporary files on disk at: /home/jenkins/workspace/Lucene-Solr-8.x-Linux/solr/build/solr-core/test/J1/temp/solr.TestRandomDVFaceting_135736BDCE8CA2EF-001
   [junit4]   2> NOTE: test params are: codec=Asserting(Lucene87): {small3_ss=BlockTreeOrds(blocksize=128), foo_ds_dv=PostingsFormat(name=LuceneVarGapDocFreqInterval), foo_f_dv=PostingsFormat(name=MockRandom), small_i=PostingsFormat(name=LuceneVarGapDocFreqInterval), small3_is=PostingsFormat(name=LuceneVarGapDocFreqInterval), small_s=BlockTreeOrds(blocksize=128), score_f=PostingsFormat(name=LuceneVarGapDocFreqInterval), score_d=BlockTreeOrds(blocksize=128), id=BlockTreeOrds(blocksize=128), foo_i=PostingsFormat(name=MockRandom), foo_fs_dv=BlockTreeOrds(blocksize=128), foo_l=BlockTreeOrds(blocksize=128), small4_ss=PostingsFormat(name=MockRandom), small2_s=BlockTreeOrds(blocksize=128), small2_i=PostingsFormat(name=LuceneVarGapDocFreqInterval), foo_ls_dv=PostingsFormat(name=LuceneVarGapDocFreqInterval), small2_is=PostingsFormat(name=MockRandom), foo_ds=Lucene84, foo_fs=PostingsFormat(name=MockRandom), foo_d_dv=Lucene84, score_f_dv=PostingsFormat(name=MockRandom), foo_d=BlockTreeOrds(blocksize=128), score_d_dv=Lucene84, small2_ss=Lucene84, foo_f=PostingsFormat(name=LuceneVarGapDocFreqInterval), foo_l_dv=Lucene84, foo_ls=Lucene84}, docValues:{small2_s_dv=DocValuesFormat(name=Lucene80), score_f_p=DocValuesFormat(name=Asserting), id_dv=DocValuesFormat(name=Asserting), score_d_p=DocValuesFormat(name=Lucene80), small2_is_p=DocValuesFormat(name=Direct), small3_is_dv=DocValuesFormat(name=Asserting), foo_ds_dv=DocValuesFormat(name=Lucene80), foo_f_dv=DocValuesFormat(name=Lucene80), foo_ds_p=DocValuesFormat(name=Lucene80), foo_l_p=DocValuesFormat(name=Asserting), foo_i_p=DocValuesFormat(name=Lucene80), small2_i_dv=DocValuesFormat(name=Asserting), small4_ss_dv=DocValuesFormat(name=Direct), small_s_dv=DocValuesFormat(name=Asserting), foo_i_dv=DocValuesFormat(name=Lucene80), small2_ss_dv=DocValuesFormat(name=Lucene80), foo_fs_dv=DocValuesFormat(name=Direct), small2_is_dv=DocValuesFormat(name=Direct), small_i_p=DocValuesFormat(name=Lucene80), small2_i_p=DocValuesFormat(name=Asserting), small_i_dv=DocValuesFormat(name=Lucene80), small3_is_p=DocValuesFormat(name=Lucene80), foo_ls_dv=DocValuesFormat(name=Lucene80), foo_f_p=DocValuesFormat(name=Lucene80), foo_ls_p=DocValuesFormat(name=Lucene80), foo_d_p=DocValuesFormat(name=Asserting), foo_fs_p=DocValuesFormat(name=Direct), score_f_dv=DocValuesFormat(name=Lucene80), foo_d_dv=DocValuesFormat(name=Asserting), score_d_dv=DocValuesFormat(name=Asserting), foo_l_dv=DocValuesFormat(name=Asserting), small3_ss_dv=DocValuesFormat(name=Lucene80)}, maxPointsInLeafNode=1110, maxMBSortInHeap=7.257601611720773, sim=Asserting(RandomSimilarity(queryNorm=false): {}), locale=he-IL, timezone=America/Indiana/Vevay
   [junit4]   2> NOTE: Linux 5.4.0-52-generic i386/Oracle Corporation 1.8.0_201 (32-bit)/cpus=16,threads=1,free=136418840,total=226230272
   [junit4]   2> NOTE: All tests run in this JVM: [TestRandomDVFaceting]
   [junit4] Completed [5/5 (5!)] on J1 in 15.03s, 1 test, 1 failure <<< FAILURES!
   [junit4] 
   [junit4] JVM J3: stderr was not empty, see: /home/jenkins/workspace/Lucene-Solr-8.x-Linux/solr/build/solr-core/test/temp/junit4-J3-20201109_165946_6386002889997497637706.syserr
   [junit4] >>> JVM J3 emitted unexpected output (verbatim) ----
   [junit4] ERROR: ld.so: object 'libeatmydata.so' from LD_PRELOAD cannot be preloaded (cannot open shared object file): ignored.
   [junit4] <<< JVM J3: EOF ----
   [junit4] JVM J1: stderr was not empty, see: /home/jenkins/workspace/Lucene-Solr-8.x-Linux/solr/build/solr-core/test/temp/junit4-J1-20201109_165946_638478701685761184171.syserr
   [junit4] >>> JVM J1 emitted unexpected output (verbatim) ----
   [junit4] ERROR: ld.so: object 'libeatmydata.so' from LD_PRELOAD cannot be preloaded (cannot open shared object file): ignored.
   [junit4] <<< JVM J1: EOF ----
   [junit4] 
   [junit4] Tests with failures [seed: 135736BDCE8CA2EF]:
   [junit4]   - org.apache.solr.TestRandomDVFaceting.testRandomFaceting
   [junit4]   - org.apache.solr.TestRandomDVFaceting.testRandomFaceting
   [junit4]   - org.apache.solr.TestRandomDVFaceting.testRandomFaceting
   [junit4]   - org.apache.solr.TestRandomDVFaceting.testRandomFaceting
   [junit4]   - org.apache.solr.TestRandomDVFaceting.testRandomFaceting
   [junit4] 
   [junit4] 
   [junit4] JVM J0:     0.64 ..    15.84 =    15.20s
   [junit4] JVM J1:     0.65 ..    16.71 =    16.06s
   [junit4] JVM J2:     0.64 ..    16.07 =    15.43s
   [junit4] JVM J3:     0.90 ..    16.66 =    15.76s
   [junit4] JVM J4:     0.90 ..    16.38 =    15.48s
   [junit4] Execution time total: 16 seconds
   [junit4] Tests summary: 5 suites, 5 tests, 5 failures

BUILD FAILED
/home/jenkins/workspace/Lucene-Solr-8.x-Linux/lucene/common-build.xml:1599: The following error occurred while executing this line:
/home/jenkins/workspace/Lucene-Solr-8.x-Linux/lucene/common-build.xml:1126: There were test failures: 5 suites, 5 tests, 5 failures [seed: 135736BDCE8CA2EF]

Total time: 17 seconds

[repro] Setting last failure code to 256

[repro] Failures w/original seeds:
[repro]   5/5 failed: org.apache.solr.TestRandomDVFaceting
[repro] Exiting with code 256
+ mv lucene/build lucene/build.repro
+ mv solr/build solr/build.repro
+ mv lucene/build.orig lucene/build
+ mv solr/build.orig solr/build
Setting ANT_1_8_2_HOME=/home/jenkins/tools/hudson.tasks.Ant_AntInstallation/ANT_1.8.2
Archiving artifacts
[Java] Sleeping for 5 seconds due to JENKINS-32191...
[Java] Parsing console log (workspace: '/home/jenkins/workspace/Lucene-Solr-8.x-Linux')
[Java] Successfully parsed console log
[Java] -> found 112 issues (skipped 103 duplicates)
[Java] Post processing issues on 'Master' with source code encoding 'UTF-8'
[Java] Creating SCM blamer to obtain author and commit information for affected files
[Java] Creating SCM miner to obtain statistics for affected repository files
[Java] Resolving file names for all issues in source directory '/home/jenkins/workspace/Lucene-Solr-8.x-Linux'
[Java] -> resolved paths in source directory (53 found, 0 not found)
[Java] Resolving module names from module definitions (build.xml, pom.xml, or Manifest.mf files)
[Java] -> resolved module names for 112 issues
[Java] Resolving package names (or namespaces) by parsing the affected files
[Java] -> resolved package names of 53 affected files
[Java] No filter has been set, publishing all 112 issues
[Java] Creating fingerprints for all affected code blocks to track issues over different builds
[Java] -> created fingerprints for 112 issues (skipped 0 issues)
[Java] Copying affected files to Jenkins' build folder '/home/jenkins/jobs/Lucene-Solr-8.x-Linux/builds/4952/files-with-issues'
[Java] -> 53 copied, 0 not in workspace, 0 not-found, 0 with I/O error
[Java] Using reference build 'Lucene-Solr-8.x-Linux #4951' to compute new, fixed, and outstanding issues
[Java] Issues delta (vs. reference build): outstanding: 112, new: 0, fixed: 0
[Java] No quality gates have been set - skipping
[Java] Health report is disabled - skipping
[Java] Created analysis result for 112 issues (found 0 new issues, fixed 0 issues)
[Java] Attaching ResultAction with ID 'java' to run 'Lucene-Solr-8.x-Linux #4952'.
[Checks API] No suitable checks publisher found.
Setting ANT_1_8_2_HOME=/home/jenkins/tools/hudson.tasks.Ant_AntInstallation/ANT_1.8.2
Recording test results
Setting ANT_1_8_2_HOME=/home/jenkins/tools/hudson.tasks.Ant_AntInstallation/ANT_1.8.2
[Checks API] No suitable checks publisher found.
Build step 'Publish JUnit test result report' changed build result to UNSTABLE
Email was triggered for: Unstable (Test Failures)
Sending email for trigger: Unstable (Test Failures)
Setting ANT_1_8_2_HOME=/home/jenkins/tools/hudson.tasks.Ant_AntInstallation/ANT_1.8.2
Setting ANT_1_8_2_HOME=/home/jenkins/tools/hudson.tasks.Ant_AntInstallation/ANT_1.8.2
Setting ANT_1_8_2_HOME=/home/jenkins/tools/hudson.tasks.Ant_AntInstallation/ANT_1.8.2
Setting ANT_1_8_2_HOME=/home/jenkins/tools/hudson.tasks.Ant_AntInstallation/ANT_1.8.2
Setting ANT_1_8_2_HOME=/home/jenkins/tools/hudson.tasks.Ant_AntInstallation/ANT_1.8.2
Setting ANT_1_8_2_HOME=/home/jenkins/tools/hudson.tasks.Ant_AntInstallation/ANT_1.8.2

Mime
View raw message