lucene-builds mailing list archives

Site index · List index
Message view « Date » · « Thread »
Top « Date » · « Thread »
From Policeman Jenkins Server <jenk...@thetaphi.de>
Subject [JENKINS] Lucene-Solr-8.x-Linux (64bit/jdk-12.0.2) - Build # 4953 - Still Unstable!
Date Mon, 09 Nov 2020 18:52:55 GMT
Build: https://jenkins.thetaphi.de/job/Lucene-Solr-8.x-Linux/4953/
Java: 64bit/jdk-12.0.2 -XX:+UseCompressedOops -XX:+UseG1GC

6 tests failed.
FAILED:  org.apache.solr.TestRandomDVFaceting.testRandomFaceting

Error Message:
mismatch: 'r'!='v' @ facet_counts/facet_fields/small4_ss/[8]

Stack Trace:
java.lang.AssertionError: mismatch: 'r'!='v' @ facet_counts/facet_fields/small4_ss/[8]
	at __randomizedtesting.SeedInfo.seed([617FEADC4EFE4241:6C17CA091B078AFE]:0)
	at org.junit.Assert.fail(Assert.java:89)
	at org.apache.solr.TestRandomDVFaceting.doFacetTests(TestRandomDVFaceting.java:292)
	at org.apache.solr.TestRandomDVFaceting.doFacetTests(TestRandomDVFaceting.java:175)
	at org.apache.solr.TestRandomDVFaceting.testRandomFaceting(TestRandomDVFaceting.java:158)
	at java.base/jdk.internal.reflect.NativeMethodAccessorImpl.invoke0(Native Method)
	at java.base/jdk.internal.reflect.NativeMethodAccessorImpl.invoke(NativeMethodAccessorImpl.java:62)
	at java.base/jdk.internal.reflect.DelegatingMethodAccessorImpl.invoke(DelegatingMethodAccessorImpl.java:43)
	at java.base/java.lang.reflect.Method.invoke(Method.java:567)
	at com.carrotsearch.randomizedtesting.RandomizedRunner.invoke(RandomizedRunner.java:1750)
	at com.carrotsearch.randomizedtesting.RandomizedRunner$8.evaluate(RandomizedRunner.java:938)
	at com.carrotsearch.randomizedtesting.RandomizedRunner$9.evaluate(RandomizedRunner.java:974)
	at com.carrotsearch.randomizedtesting.RandomizedRunner$10.evaluate(RandomizedRunner.java:988)
	at com.carrotsearch.randomizedtesting.rules.SystemPropertiesRestoreRule$1.evaluate(SystemPropertiesRestoreRule.java:57)
	at org.junit.rules.RunRules.evaluate(RunRules.java:20)
	at org.apache.lucene.util.TestRuleSetupTeardownChained$1.evaluate(TestRuleSetupTeardownChained.java:49)
	at org.apache.lucene.util.AbstractBeforeAfterRule$1.evaluate(AbstractBeforeAfterRule.java:45)
	at org.apache.lucene.util.TestRuleThreadAndTestName$1.evaluate(TestRuleThreadAndTestName.java:48)
	at org.apache.lucene.util.TestRuleIgnoreAfterMaxFailures$1.evaluate(TestRuleIgnoreAfterMaxFailures.java:64)
	at org.apache.lucene.util.TestRuleMarkFailure$1.evaluate(TestRuleMarkFailure.java:47)
	at org.junit.rules.RunRules.evaluate(RunRules.java:20)
	at com.carrotsearch.randomizedtesting.rules.StatementAdapter.evaluate(StatementAdapter.java:36)
	at com.carrotsearch.randomizedtesting.ThreadLeakControl$StatementRunner.run(ThreadLeakControl.java:368)
	at com.carrotsearch.randomizedtesting.ThreadLeakControl.forkTimeoutingTask(ThreadLeakControl.java:817)
	at com.carrotsearch.randomizedtesting.ThreadLeakControl$3.evaluate(ThreadLeakControl.java:468)
	at com.carrotsearch.randomizedtesting.RandomizedRunner.runSingleTest(RandomizedRunner.java:947)
	at com.carrotsearch.randomizedtesting.RandomizedRunner$5.evaluate(RandomizedRunner.java:832)
	at com.carrotsearch.randomizedtesting.RandomizedRunner$6.evaluate(RandomizedRunner.java:883)
	at com.carrotsearch.randomizedtesting.RandomizedRunner$7.evaluate(RandomizedRunner.java:894)
	at com.carrotsearch.randomizedtesting.rules.StatementAdapter.evaluate(StatementAdapter.java:36)
	at com.carrotsearch.randomizedtesting.rules.SystemPropertiesRestoreRule$1.evaluate(SystemPropertiesRestoreRule.java:57)
	at org.junit.rules.RunRules.evaluate(RunRules.java:20)
	at org.apache.lucene.util.AbstractBeforeAfterRule$1.evaluate(AbstractBeforeAfterRule.java:45)
	at com.carrotsearch.randomizedtesting.rules.StatementAdapter.evaluate(StatementAdapter.java:36)
	at org.apache.lucene.util.TestRuleStoreClassName$1.evaluate(TestRuleStoreClassName.java:41)
	at com.carrotsearch.randomizedtesting.rules.NoShadowingOrOverridesOnMethodsRule$1.evaluate(NoShadowingOrOverridesOnMethodsRule.java:40)
	at com.carrotsearch.randomizedtesting.rules.NoShadowingOrOverridesOnMethodsRule$1.evaluate(NoShadowingOrOverridesOnMethodsRule.java:40)
	at com.carrotsearch.randomizedtesting.rules.StatementAdapter.evaluate(StatementAdapter.java:36)
	at com.carrotsearch.randomizedtesting.rules.StatementAdapter.evaluate(StatementAdapter.java:36)
	at org.apache.lucene.util.TestRuleAssertionsRequired$1.evaluate(TestRuleAssertionsRequired.java:53)
	at org.apache.lucene.util.TestRuleMarkFailure$1.evaluate(TestRuleMarkFailure.java:47)
	at org.apache.lucene.util.TestRuleIgnoreAfterMaxFailures$1.evaluate(TestRuleIgnoreAfterMaxFailures.java:64)
	at org.apache.lucene.util.TestRuleIgnoreTestSuites$1.evaluate(TestRuleIgnoreTestSuites.java:54)
	at org.junit.rules.RunRules.evaluate(RunRules.java:20)
	at com.carrotsearch.randomizedtesting.rules.StatementAdapter.evaluate(StatementAdapter.java:36)
	at com.carrotsearch.randomizedtesting.ThreadLeakControl$StatementRunner.run(ThreadLeakControl.java:368)
	at java.base/java.lang.Thread.run(Thread.java:835)


FAILED:  org.apache.solr.TestRandomDVFaceting.testRandomFaceting

Error Message:
mismatch: 'r'!='v' @ facet_counts/facet_fields/small4_ss/[8]

Stack Trace:
java.lang.AssertionError: mismatch: 'r'!='v' @ facet_counts/facet_fields/small4_ss/[8]
	at __randomizedtesting.SeedInfo.seed([617FEADC4EFE4241:6C17CA091B078AFE]:0)
	at org.junit.Assert.fail(Assert.java:89)
	at org.apache.solr.TestRandomDVFaceting.doFacetTests(TestRandomDVFaceting.java:292)
	at org.apache.solr.TestRandomDVFaceting.doFacetTests(TestRandomDVFaceting.java:175)
	at org.apache.solr.TestRandomDVFaceting.testRandomFaceting(TestRandomDVFaceting.java:158)
	at java.base/jdk.internal.reflect.NativeMethodAccessorImpl.invoke0(Native Method)
	at java.base/jdk.internal.reflect.NativeMethodAccessorImpl.invoke(NativeMethodAccessorImpl.java:62)
	at java.base/jdk.internal.reflect.DelegatingMethodAccessorImpl.invoke(DelegatingMethodAccessorImpl.java:43)
	at java.base/java.lang.reflect.Method.invoke(Method.java:567)
	at com.carrotsearch.randomizedtesting.RandomizedRunner.invoke(RandomizedRunner.java:1750)
	at com.carrotsearch.randomizedtesting.RandomizedRunner$8.evaluate(RandomizedRunner.java:938)
	at com.carrotsearch.randomizedtesting.RandomizedRunner$9.evaluate(RandomizedRunner.java:974)
	at com.carrotsearch.randomizedtesting.RandomizedRunner$10.evaluate(RandomizedRunner.java:988)
	at com.carrotsearch.randomizedtesting.rules.SystemPropertiesRestoreRule$1.evaluate(SystemPropertiesRestoreRule.java:57)
	at org.junit.rules.RunRules.evaluate(RunRules.java:20)
	at org.apache.lucene.util.TestRuleSetupTeardownChained$1.evaluate(TestRuleSetupTeardownChained.java:49)
	at org.apache.lucene.util.AbstractBeforeAfterRule$1.evaluate(AbstractBeforeAfterRule.java:45)
	at org.apache.lucene.util.TestRuleThreadAndTestName$1.evaluate(TestRuleThreadAndTestName.java:48)
	at org.apache.lucene.util.TestRuleIgnoreAfterMaxFailures$1.evaluate(TestRuleIgnoreAfterMaxFailures.java:64)
	at org.apache.lucene.util.TestRuleMarkFailure$1.evaluate(TestRuleMarkFailure.java:47)
	at org.junit.rules.RunRules.evaluate(RunRules.java:20)
	at com.carrotsearch.randomizedtesting.rules.StatementAdapter.evaluate(StatementAdapter.java:36)
	at com.carrotsearch.randomizedtesting.ThreadLeakControl$StatementRunner.run(ThreadLeakControl.java:368)
	at com.carrotsearch.randomizedtesting.ThreadLeakControl.forkTimeoutingTask(ThreadLeakControl.java:817)
	at com.carrotsearch.randomizedtesting.ThreadLeakControl$3.evaluate(ThreadLeakControl.java:468)
	at com.carrotsearch.randomizedtesting.RandomizedRunner.runSingleTest(RandomizedRunner.java:947)
	at com.carrotsearch.randomizedtesting.RandomizedRunner$5.evaluate(RandomizedRunner.java:832)
	at com.carrotsearch.randomizedtesting.RandomizedRunner$6.evaluate(RandomizedRunner.java:883)
	at com.carrotsearch.randomizedtesting.RandomizedRunner$7.evaluate(RandomizedRunner.java:894)
	at com.carrotsearch.randomizedtesting.rules.StatementAdapter.evaluate(StatementAdapter.java:36)
	at com.carrotsearch.randomizedtesting.rules.SystemPropertiesRestoreRule$1.evaluate(SystemPropertiesRestoreRule.java:57)
	at org.junit.rules.RunRules.evaluate(RunRules.java:20)
	at org.apache.lucene.util.AbstractBeforeAfterRule$1.evaluate(AbstractBeforeAfterRule.java:45)
	at com.carrotsearch.randomizedtesting.rules.StatementAdapter.evaluate(StatementAdapter.java:36)
	at org.apache.lucene.util.TestRuleStoreClassName$1.evaluate(TestRuleStoreClassName.java:41)
	at com.carrotsearch.randomizedtesting.rules.NoShadowingOrOverridesOnMethodsRule$1.evaluate(NoShadowingOrOverridesOnMethodsRule.java:40)
	at com.carrotsearch.randomizedtesting.rules.NoShadowingOrOverridesOnMethodsRule$1.evaluate(NoShadowingOrOverridesOnMethodsRule.java:40)
	at com.carrotsearch.randomizedtesting.rules.StatementAdapter.evaluate(StatementAdapter.java:36)
	at com.carrotsearch.randomizedtesting.rules.StatementAdapter.evaluate(StatementAdapter.java:36)
	at org.apache.lucene.util.TestRuleAssertionsRequired$1.evaluate(TestRuleAssertionsRequired.java:53)
	at org.apache.lucene.util.TestRuleMarkFailure$1.evaluate(TestRuleMarkFailure.java:47)
	at org.apache.lucene.util.TestRuleIgnoreAfterMaxFailures$1.evaluate(TestRuleIgnoreAfterMaxFailures.java:64)
	at org.apache.lucene.util.TestRuleIgnoreTestSuites$1.evaluate(TestRuleIgnoreTestSuites.java:54)
	at org.junit.rules.RunRules.evaluate(RunRules.java:20)
	at com.carrotsearch.randomizedtesting.rules.StatementAdapter.evaluate(StatementAdapter.java:36)
	at com.carrotsearch.randomizedtesting.ThreadLeakControl$StatementRunner.run(ThreadLeakControl.java:368)
	at java.base/java.lang.Thread.run(Thread.java:835)


FAILED:  org.apache.solr.TestRandomDVFaceting.testRandomFaceting

Error Message:
mismatch: 'r'!='v' @ facet_counts/facet_fields/small4_ss/[8]

Stack Trace:
java.lang.AssertionError: mismatch: 'r'!='v' @ facet_counts/facet_fields/small4_ss/[8]
	at __randomizedtesting.SeedInfo.seed([617FEADC4EFE4241:6C17CA091B078AFE]:0)
	at org.junit.Assert.fail(Assert.java:89)
	at org.apache.solr.TestRandomDVFaceting.doFacetTests(TestRandomDVFaceting.java:292)
	at org.apache.solr.TestRandomDVFaceting.doFacetTests(TestRandomDVFaceting.java:175)
	at org.apache.solr.TestRandomDVFaceting.testRandomFaceting(TestRandomDVFaceting.java:158)
	at java.base/jdk.internal.reflect.NativeMethodAccessorImpl.invoke0(Native Method)
	at java.base/jdk.internal.reflect.NativeMethodAccessorImpl.invoke(NativeMethodAccessorImpl.java:62)
	at java.base/jdk.internal.reflect.DelegatingMethodAccessorImpl.invoke(DelegatingMethodAccessorImpl.java:43)
	at java.base/java.lang.reflect.Method.invoke(Method.java:567)
	at com.carrotsearch.randomizedtesting.RandomizedRunner.invoke(RandomizedRunner.java:1750)
	at com.carrotsearch.randomizedtesting.RandomizedRunner$8.evaluate(RandomizedRunner.java:938)
	at com.carrotsearch.randomizedtesting.RandomizedRunner$9.evaluate(RandomizedRunner.java:974)
	at com.carrotsearch.randomizedtesting.RandomizedRunner$10.evaluate(RandomizedRunner.java:988)
	at com.carrotsearch.randomizedtesting.rules.SystemPropertiesRestoreRule$1.evaluate(SystemPropertiesRestoreRule.java:57)
	at org.junit.rules.RunRules.evaluate(RunRules.java:20)
	at org.apache.lucene.util.TestRuleSetupTeardownChained$1.evaluate(TestRuleSetupTeardownChained.java:49)
	at org.apache.lucene.util.AbstractBeforeAfterRule$1.evaluate(AbstractBeforeAfterRule.java:45)
	at org.apache.lucene.util.TestRuleThreadAndTestName$1.evaluate(TestRuleThreadAndTestName.java:48)
	at org.apache.lucene.util.TestRuleIgnoreAfterMaxFailures$1.evaluate(TestRuleIgnoreAfterMaxFailures.java:64)
	at org.apache.lucene.util.TestRuleMarkFailure$1.evaluate(TestRuleMarkFailure.java:47)
	at org.junit.rules.RunRules.evaluate(RunRules.java:20)
	at com.carrotsearch.randomizedtesting.rules.StatementAdapter.evaluate(StatementAdapter.java:36)
	at com.carrotsearch.randomizedtesting.ThreadLeakControl$StatementRunner.run(ThreadLeakControl.java:368)
	at com.carrotsearch.randomizedtesting.ThreadLeakControl.forkTimeoutingTask(ThreadLeakControl.java:817)
	at com.carrotsearch.randomizedtesting.ThreadLeakControl$3.evaluate(ThreadLeakControl.java:468)
	at com.carrotsearch.randomizedtesting.RandomizedRunner.runSingleTest(RandomizedRunner.java:947)
	at com.carrotsearch.randomizedtesting.RandomizedRunner$5.evaluate(RandomizedRunner.java:832)
	at com.carrotsearch.randomizedtesting.RandomizedRunner$6.evaluate(RandomizedRunner.java:883)
	at com.carrotsearch.randomizedtesting.RandomizedRunner$7.evaluate(RandomizedRunner.java:894)
	at com.carrotsearch.randomizedtesting.rules.StatementAdapter.evaluate(StatementAdapter.java:36)
	at com.carrotsearch.randomizedtesting.rules.SystemPropertiesRestoreRule$1.evaluate(SystemPropertiesRestoreRule.java:57)
	at org.junit.rules.RunRules.evaluate(RunRules.java:20)
	at org.apache.lucene.util.AbstractBeforeAfterRule$1.evaluate(AbstractBeforeAfterRule.java:45)
	at com.carrotsearch.randomizedtesting.rules.StatementAdapter.evaluate(StatementAdapter.java:36)
	at org.apache.lucene.util.TestRuleStoreClassName$1.evaluate(TestRuleStoreClassName.java:41)
	at com.carrotsearch.randomizedtesting.rules.NoShadowingOrOverridesOnMethodsRule$1.evaluate(NoShadowingOrOverridesOnMethodsRule.java:40)
	at com.carrotsearch.randomizedtesting.rules.NoShadowingOrOverridesOnMethodsRule$1.evaluate(NoShadowingOrOverridesOnMethodsRule.java:40)
	at com.carrotsearch.randomizedtesting.rules.StatementAdapter.evaluate(StatementAdapter.java:36)
	at com.carrotsearch.randomizedtesting.rules.StatementAdapter.evaluate(StatementAdapter.java:36)
	at org.apache.lucene.util.TestRuleAssertionsRequired$1.evaluate(TestRuleAssertionsRequired.java:53)
	at org.apache.lucene.util.TestRuleMarkFailure$1.evaluate(TestRuleMarkFailure.java:47)
	at org.apache.lucene.util.TestRuleIgnoreAfterMaxFailures$1.evaluate(TestRuleIgnoreAfterMaxFailures.java:64)
	at org.apache.lucene.util.TestRuleIgnoreTestSuites$1.evaluate(TestRuleIgnoreTestSuites.java:54)
	at org.junit.rules.RunRules.evaluate(RunRules.java:20)
	at com.carrotsearch.randomizedtesting.rules.StatementAdapter.evaluate(StatementAdapter.java:36)
	at com.carrotsearch.randomizedtesting.ThreadLeakControl$StatementRunner.run(ThreadLeakControl.java:368)
	at java.base/java.lang.Thread.run(Thread.java:835)


FAILED:  org.apache.solr.TestRandomDVFaceting.testRandomFaceting

Error Message:
mismatch: 'r'!='v' @ facet_counts/facet_fields/small4_ss/[8]

Stack Trace:
java.lang.AssertionError: mismatch: 'r'!='v' @ facet_counts/facet_fields/small4_ss/[8]
	at __randomizedtesting.SeedInfo.seed([617FEADC4EFE4241:6C17CA091B078AFE]:0)
	at org.junit.Assert.fail(Assert.java:89)
	at org.apache.solr.TestRandomDVFaceting.doFacetTests(TestRandomDVFaceting.java:292)
	at org.apache.solr.TestRandomDVFaceting.doFacetTests(TestRandomDVFaceting.java:175)
	at org.apache.solr.TestRandomDVFaceting.testRandomFaceting(TestRandomDVFaceting.java:158)
	at java.base/jdk.internal.reflect.NativeMethodAccessorImpl.invoke0(Native Method)
	at java.base/jdk.internal.reflect.NativeMethodAccessorImpl.invoke(NativeMethodAccessorImpl.java:62)
	at java.base/jdk.internal.reflect.DelegatingMethodAccessorImpl.invoke(DelegatingMethodAccessorImpl.java:43)
	at java.base/java.lang.reflect.Method.invoke(Method.java:567)
	at com.carrotsearch.randomizedtesting.RandomizedRunner.invoke(RandomizedRunner.java:1750)
	at com.carrotsearch.randomizedtesting.RandomizedRunner$8.evaluate(RandomizedRunner.java:938)
	at com.carrotsearch.randomizedtesting.RandomizedRunner$9.evaluate(RandomizedRunner.java:974)
	at com.carrotsearch.randomizedtesting.RandomizedRunner$10.evaluate(RandomizedRunner.java:988)
	at com.carrotsearch.randomizedtesting.rules.SystemPropertiesRestoreRule$1.evaluate(SystemPropertiesRestoreRule.java:57)
	at org.junit.rules.RunRules.evaluate(RunRules.java:20)
	at org.apache.lucene.util.TestRuleSetupTeardownChained$1.evaluate(TestRuleSetupTeardownChained.java:49)
	at org.apache.lucene.util.AbstractBeforeAfterRule$1.evaluate(AbstractBeforeAfterRule.java:45)
	at org.apache.lucene.util.TestRuleThreadAndTestName$1.evaluate(TestRuleThreadAndTestName.java:48)
	at org.apache.lucene.util.TestRuleIgnoreAfterMaxFailures$1.evaluate(TestRuleIgnoreAfterMaxFailures.java:64)
	at org.apache.lucene.util.TestRuleMarkFailure$1.evaluate(TestRuleMarkFailure.java:47)
	at org.junit.rules.RunRules.evaluate(RunRules.java:20)
	at com.carrotsearch.randomizedtesting.rules.StatementAdapter.evaluate(StatementAdapter.java:36)
	at com.carrotsearch.randomizedtesting.ThreadLeakControl$StatementRunner.run(ThreadLeakControl.java:368)
	at com.carrotsearch.randomizedtesting.ThreadLeakControl.forkTimeoutingTask(ThreadLeakControl.java:817)
	at com.carrotsearch.randomizedtesting.ThreadLeakControl$3.evaluate(ThreadLeakControl.java:468)
	at com.carrotsearch.randomizedtesting.RandomizedRunner.runSingleTest(RandomizedRunner.java:947)
	at com.carrotsearch.randomizedtesting.RandomizedRunner$5.evaluate(RandomizedRunner.java:832)
	at com.carrotsearch.randomizedtesting.RandomizedRunner$6.evaluate(RandomizedRunner.java:883)
	at com.carrotsearch.randomizedtesting.RandomizedRunner$7.evaluate(RandomizedRunner.java:894)
	at com.carrotsearch.randomizedtesting.rules.StatementAdapter.evaluate(StatementAdapter.java:36)
	at com.carrotsearch.randomizedtesting.rules.SystemPropertiesRestoreRule$1.evaluate(SystemPropertiesRestoreRule.java:57)
	at org.junit.rules.RunRules.evaluate(RunRules.java:20)
	at org.apache.lucene.util.AbstractBeforeAfterRule$1.evaluate(AbstractBeforeAfterRule.java:45)
	at com.carrotsearch.randomizedtesting.rules.StatementAdapter.evaluate(StatementAdapter.java:36)
	at org.apache.lucene.util.TestRuleStoreClassName$1.evaluate(TestRuleStoreClassName.java:41)
	at com.carrotsearch.randomizedtesting.rules.NoShadowingOrOverridesOnMethodsRule$1.evaluate(NoShadowingOrOverridesOnMethodsRule.java:40)
	at com.carrotsearch.randomizedtesting.rules.NoShadowingOrOverridesOnMethodsRule$1.evaluate(NoShadowingOrOverridesOnMethodsRule.java:40)
	at com.carrotsearch.randomizedtesting.rules.StatementAdapter.evaluate(StatementAdapter.java:36)
	at com.carrotsearch.randomizedtesting.rules.StatementAdapter.evaluate(StatementAdapter.java:36)
	at org.apache.lucene.util.TestRuleAssertionsRequired$1.evaluate(TestRuleAssertionsRequired.java:53)
	at org.apache.lucene.util.TestRuleMarkFailure$1.evaluate(TestRuleMarkFailure.java:47)
	at org.apache.lucene.util.TestRuleIgnoreAfterMaxFailures$1.evaluate(TestRuleIgnoreAfterMaxFailures.java:64)
	at org.apache.lucene.util.TestRuleIgnoreTestSuites$1.evaluate(TestRuleIgnoreTestSuites.java:54)
	at org.junit.rules.RunRules.evaluate(RunRules.java:20)
	at com.carrotsearch.randomizedtesting.rules.StatementAdapter.evaluate(StatementAdapter.java:36)
	at com.carrotsearch.randomizedtesting.ThreadLeakControl$StatementRunner.run(ThreadLeakControl.java:368)
	at java.base/java.lang.Thread.run(Thread.java:835)


FAILED:  org.apache.solr.TestRandomDVFaceting.testRandomFaceting

Error Message:
mismatch: 'r'!='v' @ facet_counts/facet_fields/small4_ss/[8]

Stack Trace:
java.lang.AssertionError: mismatch: 'r'!='v' @ facet_counts/facet_fields/small4_ss/[8]
	at __randomizedtesting.SeedInfo.seed([617FEADC4EFE4241:6C17CA091B078AFE]:0)
	at org.junit.Assert.fail(Assert.java:89)
	at org.apache.solr.TestRandomDVFaceting.doFacetTests(TestRandomDVFaceting.java:292)
	at org.apache.solr.TestRandomDVFaceting.doFacetTests(TestRandomDVFaceting.java:175)
	at org.apache.solr.TestRandomDVFaceting.testRandomFaceting(TestRandomDVFaceting.java:158)
	at java.base/jdk.internal.reflect.NativeMethodAccessorImpl.invoke0(Native Method)
	at java.base/jdk.internal.reflect.NativeMethodAccessorImpl.invoke(NativeMethodAccessorImpl.java:62)
	at java.base/jdk.internal.reflect.DelegatingMethodAccessorImpl.invoke(DelegatingMethodAccessorImpl.java:43)
	at java.base/java.lang.reflect.Method.invoke(Method.java:567)
	at com.carrotsearch.randomizedtesting.RandomizedRunner.invoke(RandomizedRunner.java:1750)
	at com.carrotsearch.randomizedtesting.RandomizedRunner$8.evaluate(RandomizedRunner.java:938)
	at com.carrotsearch.randomizedtesting.RandomizedRunner$9.evaluate(RandomizedRunner.java:974)
	at com.carrotsearch.randomizedtesting.RandomizedRunner$10.evaluate(RandomizedRunner.java:988)
	at com.carrotsearch.randomizedtesting.rules.SystemPropertiesRestoreRule$1.evaluate(SystemPropertiesRestoreRule.java:57)
	at org.junit.rules.RunRules.evaluate(RunRules.java:20)
	at org.apache.lucene.util.TestRuleSetupTeardownChained$1.evaluate(TestRuleSetupTeardownChained.java:49)
	at org.apache.lucene.util.AbstractBeforeAfterRule$1.evaluate(AbstractBeforeAfterRule.java:45)
	at org.apache.lucene.util.TestRuleThreadAndTestName$1.evaluate(TestRuleThreadAndTestName.java:48)
	at org.apache.lucene.util.TestRuleIgnoreAfterMaxFailures$1.evaluate(TestRuleIgnoreAfterMaxFailures.java:64)
	at org.apache.lucene.util.TestRuleMarkFailure$1.evaluate(TestRuleMarkFailure.java:47)
	at org.junit.rules.RunRules.evaluate(RunRules.java:20)
	at com.carrotsearch.randomizedtesting.rules.StatementAdapter.evaluate(StatementAdapter.java:36)
	at com.carrotsearch.randomizedtesting.ThreadLeakControl$StatementRunner.run(ThreadLeakControl.java:368)
	at com.carrotsearch.randomizedtesting.ThreadLeakControl.forkTimeoutingTask(ThreadLeakControl.java:817)
	at com.carrotsearch.randomizedtesting.ThreadLeakControl$3.evaluate(ThreadLeakControl.java:468)
	at com.carrotsearch.randomizedtesting.RandomizedRunner.runSingleTest(RandomizedRunner.java:947)
	at com.carrotsearch.randomizedtesting.RandomizedRunner$5.evaluate(RandomizedRunner.java:832)
	at com.carrotsearch.randomizedtesting.RandomizedRunner$6.evaluate(RandomizedRunner.java:883)
	at com.carrotsearch.randomizedtesting.RandomizedRunner$7.evaluate(RandomizedRunner.java:894)
	at com.carrotsearch.randomizedtesting.rules.StatementAdapter.evaluate(StatementAdapter.java:36)
	at com.carrotsearch.randomizedtesting.rules.SystemPropertiesRestoreRule$1.evaluate(SystemPropertiesRestoreRule.java:57)
	at org.junit.rules.RunRules.evaluate(RunRules.java:20)
	at org.apache.lucene.util.AbstractBeforeAfterRule$1.evaluate(AbstractBeforeAfterRule.java:45)
	at com.carrotsearch.randomizedtesting.rules.StatementAdapter.evaluate(StatementAdapter.java:36)
	at org.apache.lucene.util.TestRuleStoreClassName$1.evaluate(TestRuleStoreClassName.java:41)
	at com.carrotsearch.randomizedtesting.rules.NoShadowingOrOverridesOnMethodsRule$1.evaluate(NoShadowingOrOverridesOnMethodsRule.java:40)
	at com.carrotsearch.randomizedtesting.rules.NoShadowingOrOverridesOnMethodsRule$1.evaluate(NoShadowingOrOverridesOnMethodsRule.java:40)
	at com.carrotsearch.randomizedtesting.rules.StatementAdapter.evaluate(StatementAdapter.java:36)
	at com.carrotsearch.randomizedtesting.rules.StatementAdapter.evaluate(StatementAdapter.java:36)
	at org.apache.lucene.util.TestRuleAssertionsRequired$1.evaluate(TestRuleAssertionsRequired.java:53)
	at org.apache.lucene.util.TestRuleMarkFailure$1.evaluate(TestRuleMarkFailure.java:47)
	at org.apache.lucene.util.TestRuleIgnoreAfterMaxFailures$1.evaluate(TestRuleIgnoreAfterMaxFailures.java:64)
	at org.apache.lucene.util.TestRuleIgnoreTestSuites$1.evaluate(TestRuleIgnoreTestSuites.java:54)
	at org.junit.rules.RunRules.evaluate(RunRules.java:20)
	at com.carrotsearch.randomizedtesting.rules.StatementAdapter.evaluate(StatementAdapter.java:36)
	at com.carrotsearch.randomizedtesting.ThreadLeakControl$StatementRunner.run(ThreadLeakControl.java:368)
	at java.base/java.lang.Thread.run(Thread.java:835)


FAILED:  org.apache.solr.TestRandomDVFaceting.testRandomFaceting

Error Message:
mismatch: 'r'!='v' @ facet_counts/facet_fields/small4_ss/[8]

Stack Trace:
java.lang.AssertionError: mismatch: 'r'!='v' @ facet_counts/facet_fields/small4_ss/[8]
	at __randomizedtesting.SeedInfo.seed([617FEADC4EFE4241:6C17CA091B078AFE]:0)
	at org.junit.Assert.fail(Assert.java:89)
	at org.apache.solr.TestRandomDVFaceting.doFacetTests(TestRandomDVFaceting.java:292)
	at org.apache.solr.TestRandomDVFaceting.doFacetTests(TestRandomDVFaceting.java:175)
	at org.apache.solr.TestRandomDVFaceting.testRandomFaceting(TestRandomDVFaceting.java:158)
	at java.base/jdk.internal.reflect.NativeMethodAccessorImpl.invoke0(Native Method)
	at java.base/jdk.internal.reflect.NativeMethodAccessorImpl.invoke(NativeMethodAccessorImpl.java:62)
	at java.base/jdk.internal.reflect.DelegatingMethodAccessorImpl.invoke(DelegatingMethodAccessorImpl.java:43)
	at java.base/java.lang.reflect.Method.invoke(Method.java:567)
	at com.carrotsearch.randomizedtesting.RandomizedRunner.invoke(RandomizedRunner.java:1750)
	at com.carrotsearch.randomizedtesting.RandomizedRunner$8.evaluate(RandomizedRunner.java:938)
	at com.carrotsearch.randomizedtesting.RandomizedRunner$9.evaluate(RandomizedRunner.java:974)
	at com.carrotsearch.randomizedtesting.RandomizedRunner$10.evaluate(RandomizedRunner.java:988)
	at com.carrotsearch.randomizedtesting.rules.SystemPropertiesRestoreRule$1.evaluate(SystemPropertiesRestoreRule.java:57)
	at org.junit.rules.RunRules.evaluate(RunRules.java:20)
	at org.apache.lucene.util.TestRuleSetupTeardownChained$1.evaluate(TestRuleSetupTeardownChained.java:49)
	at org.apache.lucene.util.AbstractBeforeAfterRule$1.evaluate(AbstractBeforeAfterRule.java:45)
	at org.apache.lucene.util.TestRuleThreadAndTestName$1.evaluate(TestRuleThreadAndTestName.java:48)
	at org.apache.lucene.util.TestRuleIgnoreAfterMaxFailures$1.evaluate(TestRuleIgnoreAfterMaxFailures.java:64)
	at org.apache.lucene.util.TestRuleMarkFailure$1.evaluate(TestRuleMarkFailure.java:47)
	at org.junit.rules.RunRules.evaluate(RunRules.java:20)
	at com.carrotsearch.randomizedtesting.rules.StatementAdapter.evaluate(StatementAdapter.java:36)
	at com.carrotsearch.randomizedtesting.ThreadLeakControl$StatementRunner.run(ThreadLeakControl.java:368)
	at com.carrotsearch.randomizedtesting.ThreadLeakControl.forkTimeoutingTask(ThreadLeakControl.java:817)
	at com.carrotsearch.randomizedtesting.ThreadLeakControl$3.evaluate(ThreadLeakControl.java:468)
	at com.carrotsearch.randomizedtesting.RandomizedRunner.runSingleTest(RandomizedRunner.java:947)
	at com.carrotsearch.randomizedtesting.RandomizedRunner$5.evaluate(RandomizedRunner.java:832)
	at com.carrotsearch.randomizedtesting.RandomizedRunner$6.evaluate(RandomizedRunner.java:883)
	at com.carrotsearch.randomizedtesting.RandomizedRunner$7.evaluate(RandomizedRunner.java:894)
	at com.carrotsearch.randomizedtesting.rules.StatementAdapter.evaluate(StatementAdapter.java:36)
	at com.carrotsearch.randomizedtesting.rules.SystemPropertiesRestoreRule$1.evaluate(SystemPropertiesRestoreRule.java:57)
	at org.junit.rules.RunRules.evaluate(RunRules.java:20)
	at org.apache.lucene.util.AbstractBeforeAfterRule$1.evaluate(AbstractBeforeAfterRule.java:45)
	at com.carrotsearch.randomizedtesting.rules.StatementAdapter.evaluate(StatementAdapter.java:36)
	at org.apache.lucene.util.TestRuleStoreClassName$1.evaluate(TestRuleStoreClassName.java:41)
	at com.carrotsearch.randomizedtesting.rules.NoShadowingOrOverridesOnMethodsRule$1.evaluate(NoShadowingOrOverridesOnMethodsRule.java:40)
	at com.carrotsearch.randomizedtesting.rules.NoShadowingOrOverridesOnMethodsRule$1.evaluate(NoShadowingOrOverridesOnMethodsRule.java:40)
	at com.carrotsearch.randomizedtesting.rules.StatementAdapter.evaluate(StatementAdapter.java:36)
	at com.carrotsearch.randomizedtesting.rules.StatementAdapter.evaluate(StatementAdapter.java:36)
	at org.apache.lucene.util.TestRuleAssertionsRequired$1.evaluate(TestRuleAssertionsRequired.java:53)
	at org.apache.lucene.util.TestRuleMarkFailure$1.evaluate(TestRuleMarkFailure.java:47)
	at org.apache.lucene.util.TestRuleIgnoreAfterMaxFailures$1.evaluate(TestRuleIgnoreAfterMaxFailures.java:64)
	at org.apache.lucene.util.TestRuleIgnoreTestSuites$1.evaluate(TestRuleIgnoreTestSuites.java:54)
	at org.junit.rules.RunRules.evaluate(RunRules.java:20)
	at com.carrotsearch.randomizedtesting.rules.StatementAdapter.evaluate(StatementAdapter.java:36)
	at com.carrotsearch.randomizedtesting.ThreadLeakControl$StatementRunner.run(ThreadLeakControl.java:368)
	at java.base/java.lang.Thread.run(Thread.java:835)




Build Log:
[...truncated 29083 lines...]
   [junit4]   2> 453354 ERROR (TEST-TestRandomDVFaceting.testRandomFaceting-seed#[617FEADC4EFE4241]) [     ] o.a.s.TestRandomDVFaceting ERROR: mismatch facet response: mismatch: 'r'!='v' @ facet_counts/facet_fields/small4_ss/[8]
   [junit4]   2>  expected ={
   [junit4]   2>   "response":{"numFound":57,"start":0,"numFoundExact":true,"docs":[]
   [junit4]   2>   },
   [junit4]   2>   "facet_counts":{
   [junit4]   2>     "facet_queries":{},
   [junit4]   2>     "facet_fields":{
   [junit4]   2>       "small4_ss":[
   [junit4]   2>         "p",3,
   [junit4]   2>         "b",2,
   [junit4]   2>         "k",2,
   [junit4]   2>         "l",2,
   [junit4]   2>         "r",2,
   [junit4]   2>         "v",2,
   [junit4]   2>         "z",2,
   [junit4]   2>         "†",2,
   [junit4]   2>         "c",1,
   [junit4]   2>         "g",1,
   [junit4]   2>         "h",1,
   [junit4]   2>         "i",1,
   [junit4]   2>         "o",1,
   [junit4]   2>         "q",1,
   [junit4]   2>         "w",1,
   [junit4]   2>         "x",1,
   [junit4]   2>         "~",1,
   [junit4]   2>         "",1,
   [junit4]   2>         "€",1,
   [junit4]   2>         "‚",1,
   [junit4]   2>         "d",0,
   [junit4]   2>         "f",0,
   [junit4]   2>         "m",0,
   [junit4]   2>         "n",0,
   [junit4]   2>         "t",0,
   [junit4]   2>         "|",0,
   [junit4]   2>         "ƒ",0,
   [junit4]   2>         "…",0,
   [junit4]   2>         null,28]},
   [junit4]   2>     "facet_ranges":{},
   [junit4]   2>     "facet_intervals":{},
   [junit4]   2>     "facet_heatmaps":{}}}
   [junit4]   2> 
   [junit4]   2>  response = {
   [junit4]   2>   "response":{"numFound":57,"start":0,"numFoundExact":true,"docs":[]
   [junit4]   2>   },
   [junit4]   2>   "facet_counts":{
   [junit4]   2>     "facet_queries":{},
   [junit4]   2>     "facet_fields":{
   [junit4]   2>       "small4_ss":[
   [junit4]   2>         "p",3,
   [junit4]   2>         "b",2,
   [junit4]   2>         "k",2,
   [junit4]   2>         "l",2,
   [junit4]   2>         "v",2,
   [junit4]   2>         "z",2,
   [junit4]   2>         "†",2,
   [junit4]   2>         "c",1,
   [junit4]   2>         "f",1,
   [junit4]   2>         "g",1,
   [junit4]   2>         "h",1,
   [junit4]   2>         "i",1,
   [junit4]   2>         "o",1,
   [junit4]   2>         "q",1,
   [junit4]   2>         "r",1,
   [junit4]   2>         "w",1,
   [junit4]   2>         "x",1,
   [junit4]   2>         "~",1,
   [junit4]   2>         "",1,
   [junit4]   2>         "€",1,
   [junit4]   2>         "‚",1,
   [junit4]   2>         "d",0,
   [junit4]   2>         "m",0,
   [junit4]   2>         "n",0,
   [junit4]   2>         "t",0,
   [junit4]   2>         "u",0,
   [junit4]   2>         "|",0,
   [junit4]   2>         "ƒ",0,
   [junit4]   2>         "…",0,
   [junit4]   2>         null,28]},
   [junit4]   2>     "facet_ranges":{},
   [junit4]   2>     "facet_intervals":{},
   [junit4]   2>     "facet_heatmaps":{}}}
   [junit4]   2> 
   [junit4]   2>  request = facet=true&wt=json&indent=true&omitHeader=true&q=*:*&rows=0&facet.prefix=&facet.missing=true&facet.field=small4_ss&facet.method=uif
   [junit4]   2> 453355 INFO  (TEST-TestRandomDVFaceting.testRandomFaceting-seed#[617FEADC4EFE4241]) [     ] o.a.s.SolrTestCaseJ4 ###Ending testRandomFaceting
   [junit4]   2> NOTE: reproduce with: ant test  -Dtestcase=TestRandomDVFaceting -Dtests.method=testRandomFaceting -Dtests.seed=617FEADC4EFE4241 -Dtests.multiplier=3 -Dtests.slow=true -Dtests.locale=ar-TD -Dtests.timezone=Asia/Kathmandu -Dtests.asserts=true -Dtests.file.encoding=UTF-8
   [junit4] FAILURE 7.39s J2 | TestRandomDVFaceting.testRandomFaceting <<<
   [junit4]    > Throwable #1: java.lang.AssertionError: mismatch: 'r'!='v' @ facet_counts/facet_fields/small4_ss/[8]
   [junit4]    > 	at __randomizedtesting.SeedInfo.seed([617FEADC4EFE4241:6C17CA091B078AFE]:0)
   [junit4]    > 	at org.apache.solr.TestRandomDVFaceting.doFacetTests(TestRandomDVFaceting.java:292)
   [junit4]    > 	at org.apache.solr.TestRandomDVFaceting.doFacetTests(TestRandomDVFaceting.java:175)
   [junit4]    > 	at org.apache.solr.TestRandomDVFaceting.testRandomFaceting(TestRandomDVFaceting.java:158)
   [junit4]    > 	at java.base/jdk.internal.reflect.NativeMethodAccessorImpl.invoke0(Native Method)
   [junit4]    > 	at java.base/jdk.internal.reflect.NativeMethodAccessorImpl.invoke(NativeMethodAccessorImpl.java:62)
   [junit4]    > 	at java.base/jdk.internal.reflect.DelegatingMethodAccessorImpl.invoke(DelegatingMethodAccessorImpl.java:43)
   [junit4]    > 	at java.base/java.lang.reflect.Method.invoke(Method.java:567)
   [junit4]    > 	at java.base/java.lang.Thread.run(Thread.java:835)
   [junit4]   2> 453356 INFO  (SUITE-TestRandomDVFaceting-seed#[617FEADC4EFE4241]-worker) [     ] o.a.s.SolrTestCaseJ4 ###deleteCore
   [junit4]   2> 453356 INFO  (SUITE-TestRandomDVFaceting-seed#[617FEADC4EFE4241]-worker) [     ] o.a.s.c.CoreContainer Shutting down CoreContainer instance=616997598
   [junit4]   2> 453357 INFO  (coreCloseExecutor-7724-thread-1) [     ] o.a.s.c.SolrCore [collection1]  CLOSING SolrCore org.apache.solr.core.SolrCore@67f1c62f
   [junit4]   2> 453357 INFO  (coreCloseExecutor-7724-thread-1) [     ] o.a.s.m.SolrMetricManager Closing metric reporters for registry=solr.core.collection1 tag=SolrCore@67f1c62f
   [junit4]   2> 453357 INFO  (coreCloseExecutor-7724-thread-1) [     ] o.a.s.m.r.SolrJmxReporter Closing reporter [org.apache.solr.metrics.reporters.SolrJmxReporter@7e893859: rootName = null, domain = solr.core.collection1, service url = null, agent id = null] for registry solr.core.collection1/com.codahale.metrics.MetricRegistry@2ca238fd
   [junit4]   2> 453364 INFO  (coreCloseExecutor-7724-thread-1) [     ] o.a.s.u.DirectUpdateHandler2 Committing on IndexWriter.close()  ... SKIPPED (unnecessary).
   [junit4]   2> 453366 INFO  (SUITE-TestRandomDVFaceting-seed#[617FEADC4EFE4241]-worker) [     ] o.a.s.m.SolrMetricManager Closing metric reporters for registry=solr.node tag=null
   [junit4]   2> 453366 INFO  (SUITE-TestRandomDVFaceting-seed#[617FEADC4EFE4241]-worker) [     ] o.a.s.m.r.SolrJmxReporter Closing reporter [org.apache.solr.metrics.reporters.SolrJmxReporter@e689ad9: rootName = null, domain = solr.node, service url = null, agent id = null] for registry solr.node/com.codahale.metrics.MetricRegistry@5e109ee3
   [junit4]   2> 453369 INFO  (SUITE-TestRandomDVFaceting-seed#[617FEADC4EFE4241]-worker) [     ] o.a.s.m.SolrMetricManager Closing metric reporters for registry=solr.jvm tag=null
   [junit4]   2> 453369 INFO  (SUITE-TestRandomDVFaceting-seed#[617FEADC4EFE4241]-worker) [     ] o.a.s.m.r.SolrJmxReporter Closing reporter [org.apache.solr.metrics.reporters.SolrJmxReporter@30fb68fd: rootName = null, domain = solr.jvm, service url = null, agent id = null] for registry solr.jvm/com.codahale.metrics.MetricRegistry@66288057
   [junit4]   2> 453371 INFO  (SUITE-TestRandomDVFaceting-seed#[617FEADC4EFE4241]-worker) [     ] o.a.s.m.SolrMetricManager Closing metric reporters for registry=solr.jetty tag=null
   [junit4]   2> 453371 INFO  (SUITE-TestRandomDVFaceting-seed#[617FEADC4EFE4241]-worker) [     ] o.a.s.m.r.SolrJmxReporter Closing reporter [org.apache.solr.metrics.reporters.SolrJmxReporter@d3f681f: rootName = null, domain = solr.jetty, service url = null, agent id = null] for registry solr.jetty/com.codahale.metrics.MetricRegistry@7bcfbc24
   [junit4]   2> NOTE: leaving temporary files on disk at: /home/jenkins/workspace/Lucene-Solr-8.x-Linux/solr/build/solr-core/test/J2/temp/solr.TestRandomDVFaceting_617FEADC4EFE4241-001
   [junit4]   2> NOTE: test params are: codec=Asserting(Lucene87): {small3_ss=PostingsFormat(name=LuceneVarGapFixedInterval), foo_ds_dv=PostingsFormat(name=LuceneFixedGap), foo_f_dv=PostingsFormat(name=Direct), small_i=PostingsFormat(name=LuceneFixedGap), small3_is=PostingsFormat(name=LuceneFixedGap), small_s=PostingsFormat(name=LuceneVarGapFixedInterval), score_f=PostingsFormat(name=LuceneVarGapFixedInterval), score_d=PostingsFormat(name=LuceneFixedGap), id=PostingsFormat(name=LuceneFixedGap), foo_i=PostingsFormat(name=Direct), foo_fs_dv=PostingsFormat(name=LuceneVarGapFixedInterval), foo_l=PostingsFormat(name=LuceneFixedGap), small4_ss=Lucene84, small2_s=PostingsFormat(name=LuceneVarGapFixedInterval), small2_i=PostingsFormat(name=LuceneFixedGap), foo_ls_dv=PostingsFormat(name=LuceneFixedGap), small2_is=Lucene84, foo_ds=PostingsFormat(name=Direct), foo_fs=Lucene84, foo_d_dv=Lucene84, score_f_dv=PostingsFormat(name=Direct), foo_d=PostingsFormat(name=LuceneFixedGap), score_d_dv=Lucene84, small2_ss=PostingsFormat(name=Direct), foo_f=PostingsFormat(name=LuceneVarGapFixedInterval), foo_l_dv=Lucene84, foo_ls=PostingsFormat(name=Direct)}, docValues:{small2_s_dv=DocValuesFormat(name=Lucene80), score_f_p=DocValuesFormat(name=Lucene80), id_dv=DocValuesFormat(name=Lucene80), score_d_p=DocValuesFormat(name=Direct), small2_is_p=DocValuesFormat(name=Lucene80), small3_is_dv=DocValuesFormat(name=Direct), foo_ds_dv=DocValuesFormat(name=Asserting), foo_f_dv=DocValuesFormat(name=Direct), foo_ds_p=DocValuesFormat(name=Lucene80), foo_l_p=DocValuesFormat(name=Direct), foo_i_p=DocValuesFormat(name=Asserting), small2_i_dv=DocValuesFormat(name=Direct), small4_ss_dv=DocValuesFormat(name=Asserting), small_s_dv=DocValuesFormat(name=Lucene80), foo_i_dv=DocValuesFormat(name=Lucene80), small2_ss_dv=DocValuesFormat(name=Asserting), foo_fs_dv=DocValuesFormat(name=Lucene80), small2_is_dv=DocValuesFormat(name=Lucene80), small_i_p=DocValuesFormat(name=Lucene80), small2_i_p=DocValuesFormat(name=Lucene80), small_i_dv=DocValuesFormat(name=Direct), small3_is_p=DocValuesFormat(name=Lucene80), foo_ls_dv=DocValuesFormat(name=Asserting), foo_f_p=DocValuesFormat(name=Lucene80), foo_ls_p=DocValuesFormat(name=Lucene80), foo_d_p=DocValuesFormat(name=Direct), foo_fs_p=DocValuesFormat(name=Asserting), score_f_dv=DocValuesFormat(name=Direct), foo_d_dv=DocValuesFormat(name=Lucene80), score_d_dv=DocValuesFormat(name=Lucene80), foo_l_dv=DocValuesFormat(name=Lucene80), small3_ss_dv=DocValuesFormat(name=Lucene80)}, maxPointsInLeafNode=764, maxMBSortInHeap=7.039423455454549, sim=Asserting(RandomSimilarity(queryNorm=false): {}), locale=ar-TD, timezone=Asia/Kathmandu
   [junit4]   2> NOTE: Linux 5.4.0-52-generic amd64/AdoptOpenJDK 12.0.2 (64-bit)/cpus=16,threads=1,free=105972880,total=440401920
   [junit4]   2> NOTE: All tests run in this JVM: [TestQuerySenderListener, ShardRoutingCustomTest, CustomHighlightComponentTest, IgnoreCommitOptimizeUpdateProcessorFactoryTest, TestConfigOverlay, BlockJoinFacetDistribTest, JSONWriterTest, MoveReplicaTest, TestFunctionQuery, DistribJoinFromCollectionTest, TestSQLHandlerNonCloud, ScheduledTriggerTest, TestInfoStreamLogging, RegexBytesRefFilterTest, TestEmbeddedSolrServerConstructors, TestFieldCacheSort, DistributedFacetPivotLargeTest, TestGraphMLResponseWriter, PluginInfoTest, SolrIndexMetricsTest, TriLevelCompositeIdRoutingTest, TestReplicationHandler, TestCursorMarkWithoutUniqueKey, ReturnFieldsTest, RecoveryZkTest, TestStressCloudBlindAtomicUpdates, FacetPivotSmallTest, TestFieldTypeResource, FieldAnalysisRequestHandlerTest, CdcrVersionReplicationTest, MaxScoreCollectorTest, ZkDynamicConfigTest, OutputWriterTest, TestLegacyFieldReuse, TestManagedSchemaAPI, ConfigureRecoveryStrategyTest, SuggesterWFSTTest, SolrCoreCheckLockOnStartupTest, PeerSyncWithLeaderAndIndexFingerprintCachingTest, NodeLostTriggerIntegrationTest, ConcurrentCreateRoutedAliasTest, HdfsThreadLeakTest, ConvertedLegacyTest, RestartWhileUpdatingTest, TestRandomFlRTGCloud, ZkCollectionPropsCachingTest, TestStressLucene, TestRealTimeGet, OverseerStatusTest, TestUnifiedSolrHighlighterWithoutStoredId, TestSafeXMLParsing, PKIAuthenticationIntegrationTest, ResponseLogComponentTest, MetricsHistoryIntegrationTest, TestCoreAdminApis, TestExactStatsCache, CoreAdminHandlerTest, TestTolerantSearch, ClusterStateMockUtilTest, TestMultiWordSynonyms, TimeZoneUtilsTest, TestDocSet, TestCloudDeleteByQuery, TestHttpServletCarrier, HdfsCollectionsAPIDistributedZkTest, TestFiltering, ChaosMonkeyNothingIsSafeWithPullReplicasTest, TestSolrCloudSnapshots, TestFuzzyAnalyzedSuggestions, CircularListTest, AtomicUpdateRemovalJavabinTest, TestRemoteStreaming, TestBlobHandler, AutoScalingHandlerTest, HdfsDirectoryTest, TestConfigSetsAPIZkFailure, CursorPagingTest, DisMaxRequestHandlerTest, DistributedIntervalFacetingTest, TestDistributedGrouping, TestDistributedMissingSort, TestDistributedSearch, TestDocumentBuilder, TestGroupingSearch, TestHighlightDedupGrouping, TestJoin, TestRandomDVFaceting]
   [junit4] Completed [419/921 (1!)] on J2 in 7.76s, 1 test, 1 failure <<< FAILURES!
   [junit4] 
   [junit4] Suite: org.apache.solr.security.JWTAuthPluginIntegrationTest
   [junit4] Completed [420/921 (1!)] on J3 in 10.76s, 5 tests
   [junit4] 
   [junit4] Suite: org.apache.solr.metrics.SolrMetricReporterTest
   [junit4] Completed [421/921 (1!)] on J3 in 0.25s, 1 test
   [junit4] 
   [junit4] Suite: org.apache.solr.handler.admin.InfoHandlerTest
   [junit4] Completed [422/921 (1!)] on J3 in 0.75s, 2 tests
   [junit4] 
   [junit4] Suite: org.apache.solr.cloud.ZkSolrClientTest
   [junit4] Completed [423/921 (1!)] on J4 in 20.01s, 8 tests
   [junit4] 
   [junit4] Suite: org.apache.solr.uninverting.TestDocTermOrds
   [junit4] Completed [424/921 (1!)] on J4 in 0.51s, 9 tests
   [junit4] 
   [junit4] Suite: org.apache.solr.cloud.CollectionPropsTest
   [junit4] Completed [425/921 (1!)] on J5 in 12.76s, 4 tests
   [junit4] 
   [junit4] Suite: org.apache.solr.servlet.SecurityHeadersTest
   [junit4] IGNOR/A 0.00s J5 | SecurityHeadersTest.testHeaders
   [junit4]    > Assumption #1: 'awaitsfix' test group is disabled (@AwaitsFix(bugUrl="https://issues.apache.org/jira/browse/SOLR-14903"))
   [junit4] Completed [426/921 (1!)] on J5 in 0.00s, 1 test, 1 skipped
   [junit4] 
   [junit4] Suite: org.apache.solr.util.DateMathParserTest
   [junit4] Completed [427/921 (1!)] on J4 in 0.26s, 11 tests
   [junit4] 
   [junit4] Suite: org.apache.solr.handler.BinaryUpdateRequestHandlerTest
   [junit4] Completed [428/921 (1!)] on J5 in 0.50s, 1 test
   [junit4] 
   [junit4] Suite: org.apache.solr.schema.RankFieldTest
   [junit4] Completed [429/921 (1!)] on J5 in 0.51s, 13 tests, 1 skipped
   [junit4] 
   [junit4] Suite: org.apache.solr.TestTrie
   [junit4] IGNOR/A 0.00s J5 | TestTrie.testTrieFacet_PrecisionStep
   [junit4]    > Assumption #1: Skipping test: Points+facets require docValues, but randomizer: points=true && DV=false
   [junit4] Completed [430/921 (1!)] on J5 in 0.50s, 8 tests, 1 skipped
   [junit4] 
   [junit4] Suite: org.apache.solr.analysis.PathHierarchyTokenizerFactoryTest
   [junit4] Completed [431/921 (1!)] on J5 in 0.50s, 2 tests
   [junit4] 
   [junit4] Suite: org.apache.solr.cloud.RemoteQueryErrorTest
   [junit4] Completed [432/921 (1!)] on J4 in 2.76s, 1 test
   [junit4] 
   [junit4] Suite: org.apache.solr.schema.TestTextField
   [junit4] Completed [433/921 (1!)] on J4 in 0.25s, 1 test
   [junit4] 
   [junit4] Suite: org.apache.solr.analysis.ProtectedTermFilterFactoryTest
   [junit4] Completed [434/921 (1!)] on J5 in 0.50s, 3 tests
   [junit4] 
   [junit4] Suite: org.apache.solr.schema.NotRequiredUniqueKeyTest
   [junit4] Completed [435/921 (1!)] on J4 in 0.50s, 1 test
   [junit4] 
   [junit4] Suite: org.apache.solr.analysis.TestCharFilters
   [junit4] Completed [436/921 (1!)] on J5 in 0.25s, 2 tests
   [junit4] 
   [junit4] Suite: org.apache.solr.TestRandomFaceting
   [junit4] Completed [437/921 (1!)] on J2 in 16.26s, 1 test
   [junit4] 
   [junit4] Suite: org.apache.solr.analysis.TestDeprecatedFilters
   [junit4] Completed [438/921 (1!)] on J5 in 0.25s, 1 test
   [junit4] 
   [junit4] Suite: org.apache.solr.analysis.TestLuceneMatchVersion
   [junit4] Completed [439/921 (1!)] on J2 in 0.50s, 1 test
   [junit4] 
   [junit4] Suite: org.apache.solr.analysis.TestReversedWildcardFilterFactory
   [junit4] Completed [440/921 (1!)] on J5 in 0.50s, 5 tests
   [junit4] 
   [junit4] Suite: org.apache.solr.analysis.TokenizerChainTest
   [junit4] Completed [441/921 (1!)] on J5 in 0.25s, 1 test
   [junit4] 
   [junit4] Suite: org.apache.solr.analysis.TestWordDelimiterFilterFactory
   [junit4] Completed [442/921 (1!)] on J2 in 0.50s, 7 tests
   [junit4] 
   [junit4] Suite: org.apache.solr.search.join.TestScoreJoinQPNoScore
   [junit4] Completed [443/921 (1!)] on J3 in 8.54s, 4 tests
   [junit4] 
   [junit4] Suite: org.apache.solr.cloud.ClusterStateUpdateTest
   [junit4] Completed [444/921 (1!)] on J4 in 3.26s, 1 test
   [junit4] 
   [junit4] Suite: org.apache.solr.spelling.suggest.TestAnalyzeInfixSuggestions
   [junit4] Completed [445/921 (1!)] on J3 in 0.50s, 4 tests
   [junit4] 
   [junit4] Suite: org.apache.solr.servlet.ResponseHeaderTest
   [junit4] Completed [446/921 (1!)] on J4 in 0.50s, 1 test
   [junit4] 
   [junit4] Suite: org.apache.solr.cloud.ActionThrottleTest
   [junit4] Completed [447/921 (1!)] on J5 in 3.50s, 3 tests
   [junit4] 
   [junit4] Suite: org.apache.solr.filestore.TestDistribPackageStore
   [junit4] Completed [448/921 (1!)] on J4 in 12.51s, 1 test
   [junit4] 
   [junit4] Suite: org.apache.solr.schema.PrimitiveFieldTypeTest
   [junit4] Completed [449/921 (1!)] on J4 in 0.25s, 2 tests
   [junit4] 
   [junit4] Suite: org.apache.solr.cloud.AddReplicaTest
   [junit4] Completed [450/921 (1!)] on J2 in 16.01s, 2 tests
   [junit4] 
   [junit4] Suite: org.apache.solr.cloud.RollingRestartTest
   [junit4] Completed [451/921 (1!)] on J3 in 17.01s, 1 test
   [junit4] 
   [junit4] Suite: org.apache.solr.cloud.DeleteLastCustomShardedReplicaTest
   [junit4] Completed [452/921 (1!)] on J2 in 3.01s, 1 test
   [junit4] 
   [junit4] Suite: org.apache.solr.cloud.TestCloudConsistency
   [junit4] Completed [453/921 (1!)] on J1 in 53.78s, 2 tests
   [junit4] 
   [junit4] Suite: org.apache.solr.util.tracing.TestDistributedTracing
   [junit4] Completed [454/921 (1!)] on J1 in 4.75s, 1 test
   [junit4] 
   [junit4] Suite: org.apache.solr.cloud.DeleteNodeTest
   [junit4] Completed [455/921 (1!)] on J2 in 6.76s, 1 test
   [junit4] 
   [junit4] Suite: org.apache.solr.cloud.DeleteInactiveReplicaTest
   [junit4] Completed [456/921 (1!)] on J4 in 14.76s, 1 test
   [junit4] 
   [junit4] Suite: org.apache.solr.cloud.SplitShardTest
   [junit4] Completed [457/921 (1!)] on J3 in 18.01s, 4 tests
   [junit4] 
   [junit4] Suite: org.apache.solr.update.UpdateLogTest
   [junit4] Completed [458/921 (1!)] on J3 in 0.25s, 4 tests
   [junit4] 
   [junit4] Suite: org.apache.solr.search.TestSimpleQParserPlugin
   [junit4] Completed [459/921 (1!)] on J3 in 0.50s, 17 tests
   [junit4] 
   [junit4] Suite: org.apache.solr.cloud.DistributedQueueTest
   [junit4] Completed [460/921 (1!)] on J2 in 10.51s, 6 tests
   [junit4] 
   [junit4] Suite: org.apache.solr.cloud.autoscaling.AutoAddReplicasIntegrationTest
   [junit4] IGNOR/A 0.00s J0 | AutoAddReplicasIntegrationTest.testRapidStopStartStopWithPropChange
   [junit4]    > Assumption #1: 'awaitsfix' test group is disabled (@AwaitsFix(bugUrl="https://issues.apache.org/jira/browse/SOLR-13811"))
   [junit4] Completed [461/921 (1!)] on J0 in 65.54s, 4 tests, 1 skipped
   [junit4] 
   [junit4] Suite: org.apache.solr.search.similarities.TestLMDirichletSimilarityFactory
   [junit4] Completed [462/921 (1!)] on J3 in 0.25s, 2 tests
   [junit4] 
   [junit4] Suite: org.apache.solr.cloud.AliasIntegrationTest
   [junit4] Completed [463/921 (1!)] on J5 in 34.51s, 9 tests
   [junit4] 
   [junit4] Suite: org.apache.solr.cloud.ForceLeaderTest
   [junit4] IGNOR/A 0.00s J5 | ForceLeaderTest.testReplicasInLowerTerms
   [junit4]    > Assumption #1: 'nightly' test group is disabled (@Nightly(value=""))
   [junit4] Completed [464/921 (1!)] on J5 in 0.00s, 2 tests, 2 skipped
   [junit4] 
   [junit4] Suite: org.apache.solr.cloud.ForceLeaderWithTlogReplicasTest
   [junit4] IGNOR/A 0.00s J5 | ForceLeaderWithTlogReplicasTest.testReplicasInLowerTerms
   [junit4]    > Assumption #1: 'nightly' test group is disabled (@Nightly(value=""))
   [junit4] Completed [465/921 (1!)] on J5 in 0.00s, 2 tests, 2 skipped
   [junit4] 
   [junit4] Suite: org.apache.solr.cloud.api.collections.CustomCollectionTest
   [junit4] Completed [466/921 (1!)] on J1 in 15.03s, 4 tests
   [junit4] 
   [junit4] Suite: org.apache.solr.cloud.DocValuesNotIndexedTest
   [junit4] Completed [467/921 (1!)] on J2 in 2.76s, 5 tests
   [junit4] 
   [junit4] Suite: org.apache.solr.store.blockcache.BlockDirectoryTest
   [junit4] Completed [468/921 (1!)] on J0 in 3.01s, 4 tests
   [junit4] 
   [junit4] Suite: org.apache.solr.search.TestFilteredDocIdSet
   [junit4] Completed [469/921 (1!)] on J1 in 0.25s, 3 tests
   [junit4] 
   [junit4] Suite: org.apache.solr.cloud.TestConfigSetsAPIExclusivity
   [junit4] Completed [470/921 (1!)] on J0 in 4.01s, 1 test
   [junit4] 
   [junit4] Suite: org.apache.solr.cloud.ConnectionManagerTest
   [junit4] Completed [471/921 (1!)] on J3 in 7.01s, 3 tests, 1 skipped
   [junit4] 
   [junit4] Suite: org.apache.solr.cloud.DistributedVersionInfoTest
   [junit4] Completed [472/921 (1!)] on J4 in 25.77s, 1 test
   [junit4] 
   [junit4] Suite: org.apache.solr.cloud.FullSolrCloudDistribCmdsTest
   [junit4] Completed [473/921 (1!)] on J5 in 25.27s, 6 tests
   [junit4] 
   [junit4] Suite: org.apache.solr.cloud.HttpPartitionOnCommitTest
   [junit4] Completed [474/921 (1!)] on J2 in 26.77s, 1 test
   [junit4] 
   [junit4] Suite: org.apache.solr.cloud.LeaderElectionContextKeyTest
   [junit4] Completed [475/921 (1!)] on J5 in 4.00s, 1 test
   [junit4] 
   [junit4] Suite: org.apache.solr.cloud.ChaosMonkeySafeLeaderTest
   [junit4] Completed [476/921 (1!)] on J3 in 27.04s, 1 test
   [junit4] 
   [junit4] Suite: org.apache.solr.legacy.TestLegacyNumericUtils
   [junit4] Completed [477/921 (1!)] on J3 in 1.00s, 12 tests
   [junit4] 
   [junit4] Suite: org.apache.solr.cloud.ZkShardTermsTest
   [junit4] Completed [478/921 (1!)] on J3 in 13.76s, 10 tests
   [junit4] 
   [junit4] Suite: org.apache.solr.store.hdfs.HdfsLockFactoryTest
   [junit4] IGNOR/A 0.00s J3 | HdfsLockFactoryTest.testBasic
   [junit4]    > Assumption #1: 'nightly' test group is disabled (@Nightly(value=""))
   [junit4] Completed [479/921 (1!)] on J3 in 0.00s, 1 test, 1 skipped
   [junit4] 
   [junit4] Suite: org.apache.solr.util.DOMUtilTest
   [junit4] Completed [480/921 (1!)] on J3 in 0.25s, 1 test
   [junit4] 
   [junit4] Suite: org.apache.solr.cloud.ChaosMonkeyNothingIsSafeTest
   [junit4] Completed [481/921 (1!)] on J1 in 48.77s, 1 test
   [junit4] 
   [junit4] Suite: org.apache.solr.core.backup.repository.HdfsBackupRepositoryTest
   [junit4] Completed [482/921 (1!)] on J1 in 0.02s, 8 tests
   [junit4] 
   [junit4] Suite: org.apache.solr.spelling.suggest.TestFreeTextSuggestions
   [junit4] Completed [483/921 (1!)] on J1 in 0.50s, 1 test
   [junit4] 
   [junit4] Suite: org.apache.solr.cloud.HttpPartitionTest
   [junit4] Completed [484/921 (1!)] on J0 in 45.79s, 1 test
   [junit4] 
   [junit4] Suite: org.apache.solr.util.AuthToolTest
   [junit4] Completed [485/921 (1!)] on J1 in 1.50s, 1 test
   [junit4] 
   [junit4] Suite: org.apache.solr.update.processor.AtomicUpdateProcessorFactoryTest
   [junit4] Completed [486/921 (1!)] on J1 in 0.50s, 4 tests
   [junit4] 
   [junit4] Suite: org.apache.solr.cloud.LeaderElectionTest
   [junit4] Completed [487/921 (1!)] on J5 in 25.76s, 5 tests
   [junit4] 
   [junit4] Suite: org.apache.solr.cloud.LeaderElectionIntegrationTest
   [junit4] Completed [488/921 (1!)] on J2 in 27.77s, 1 test
   [junit4] 
   [junit4] Suite: org.apache.solr.cloud.LeaderTragicEventTest
   [junit4] IGNOR/A 0.00s J2 | LeaderTragicEventTest.test
   [junit4]    > Assumption #1: 'awaitsfix' test group is disabled (@AwaitsFix(bugUrl="https://issues.apache.org/jira/browse/SOLR-13237"))
   [junit4] IGNOR/A 0.00s J2 | LeaderTragicEventTest.testOtherReplicasAreNotActive
   [junit4]    > Assumption #1: 'awaitsfix' test group is disabled (@AwaitsFix(bugUrl="https://issues.apache.org/jira/browse/SOLR-13237"))
   [junit4] Completed [489/921 (1!)] on J2 in 0.00s, 2 tests, 2 skipped
   [junit4] 
   [junit4] Suite: org.apache.solr.cloud.MetricsHistoryWithAuthIntegrationTest
   [junit4] Completed [490/921 (1!)] on J2 in 4.51s, 1 test
   [junit4] 
   [junit4] Suite: org.apache.solr.cloud.HttpPartitionWithTlogReplicasTest
   [junit4] Completed [491/921 (1!)] on J4 in 46.77s, 1 test
   [junit4] 
   [junit4] Suite: org.apache.solr.cloud.MissingSegmentRecoveryTest
   [junit4] Completed [492/921 (1!)] on J4 in 7.01s, 1 test
   [junit4] 
   [junit4] Suite: org.apache.solr.cloud.MultiSolrCloudTestCaseTest
   [junit4] Completed [493/921 (1!)] on J4 in 4.01s, 1 test
   [junit4] 
   [junit4] Suite: org.apache.solr.cloud.LeaderFailureAfterFreshStartTest
   [junit4] Completed [494/921 (1!)] on J5 in 27.76s, 1 test
   [junit4] 
   [junit4] Suite: org.apache.solr.cloud.LeaderFailoverAfterPartitionTest
   [junit4] Completed [495/921 (1!)] on J0 in 31.77s, 1 test
   [junit4] 
   [junit4] Suite: org.apache.solr.cloud.NodeMutatorTest
   [junit4] Completed [496/921 (1!)] on J0 in 0.25s, 3 tests
   [junit4] 
   [junit4] Suite: org.apache.solr.cloud.OutOfBoxZkACLAndCredentialsProvidersTest
   [junit4] Completed [497/921 (1!)] on J0 in 2.25s, 2 tests
   [junit4] 
   [junit4] Suite: org.apache.solr.cloud.MigrateRouteKeyTest
   [junit4] Completed [498/921 (1!)] on J2 in 25.76s, 2 tests
   [junit4] 
   [junit4] Suite: org.apache.solr.cloud.NestedShardedAtomicUpdateTest
   [junit4] Completed [499/921 (1!)] on J5 in 6.00s, 1 test
   [junit4] 
   [junit4] Suite: org.apache.solr.cloud.OverriddenZkACLAndCredentialsProvidersTest
   [junit4] Completed [500/921 (1!)] on J0 in 6.76s, 8 tests
   [junit4] 
   [junit4] Suite: org.apache.solr.cloud.OverseerTaskQueueTest
   [junit4] Completed [501/921 (1!)] on J2 in 11.01s, 7 tests
   [junit4] 
   [junit4] Suite: org.apache.solr.request.TestIntervalFaceting
   [junit4] Completed [502/921 (1!)] on J1 in 48.06s, 20 tests
   [junit4] 
   [junit4] Suite: org.apache.solr.handler.SearchHandlerTest
   [junit4] Completed [503/921 (1!)] on J1 in 0.50s, 1 test
   [junit4] 
   [junit4] Suite: org.apache.solr.cloud.SolrCLIZkUtilsTest
   [junit4] Completed [504/921 (1!)] on J2 in 6.76s, 6 tests
   [junit4] 
   [junit4] Suite: org.apache.solr.cloud.PackageManagerCLITest
   [junit4] Completed [505/921 (1!)] on J0 in 14.76s, 1 test
   [junit4] 
   [junit4] Suite: org.apache.solr.cloud.MultiThreadedOCPTest
   [junit4] Completed [506/921 (1!)] on J4 in 34.79s, 1 test
   [junit4] 
   [junit4] Suite: org.apache.solr.cloud.TestCloudInspectUtil
   [junit4] Completed [507/921 (1!)] on J4 in 0.25s, 1 test
   [junit4] 
   [junit4] Suite: org.apache.solr.cloud.SolrXmlInZkTest
   [junit4] Completed [508/921 (1!)] on J0 in 3.76s, 5 tests
   [junit4] 
   [junit4] Suite: org.apache.solr.cloud.TestCloudPhrasesIdentificationComponent
   [junit4] Completed [509/921 (1!)] on J4 in 2.25s, 2 tests
   [junit4] 
   [junit4] Suite: org.apache.solr.cloud.OverseerTest
   [junit4] Completed [510/921 (1!)] on J5 in 25.76s, 14 tests, 1 skipped
   [junit4] 
   [junit4] Suite: org.apache.solr.cloud.autoscaling.AutoAddReplicasPlanActionTest
   [junit4] Completed [511/921 (1!)] on J1 in 15.01s, 1 test
   [junit4] 
   [junit4] Suite: org.apache.solr.store.blockcache.BufferStoreTest
   [junit4] Completed [512/921 (1!)] on J1 in 0.25s, 1 test
   [junit4] 
   [junit4] Suite: org.apache.solr.cloud.TestCloudPseudoReturnFields
   [junit4] Completed [513/921 (1!)] on J4 in 4.76s, 30 tests
   [junit4] 
   [junit4] Suite: org.apache.solr.cloud.SolrCloudExampleTest
   [junit4] Completed [514/921 (1!)] on J2 in 14.79s, 1 test
   [junit4] 
   [junit4] Suite: org.apache.solr.cloud.ReindexCollectionTest
   [junit4] Completed [515/921 (1!)] on J3 in 73.79s, 6 tests
   [junit4] 
   [junit4] Suite: org.apache.solr.schema.TestSortableTextField
   [junit4] Completed [516/921 (1!)] on J3 in 0.50s, 7 tests
   [junit4] 
   [junit4] Suite: org.apache.solr.schema.ManagedSchemaRoundRobinCloudTest
   [junit4] Completed [517/921 (1!)] on J3 in 2.50s, 1 test
   [junit4] 
   [junit4] Suite: org.apache.solr.cloud.ClusterStateTest
   [junit4] Completed [518/921 (1!)] on J3 in 0.25s, 1 test
   [junit4] 
   [junit4] Suite: org.apache.solr.servlet.NoCacheHeaderTest
   [junit4] Completed [519/921 (1!)] on J3 in 0.25s, 3 tests
   [junit4] 
   [junit4] Suite: org.apache.solr.cloud.TestCloudRecovery
   [junit4] Completed [520/921 (1!)] on J5 in 13.01s, 2 tests
   [junit4] 
   [junit4] Suite: org.apache.solr.cloud.TestCloudPivotFacet
   [junit4] Completed [521/921 (1!)] on J0 in 15.76s, 1 test
   [junit4] 
   [junit4] Suite: org.apache.solr.core.snapshots.TestSolrCoreSnapshots
   [junit4] Completed [522/921 (1!)] on J3 in 3.51s, 2 tests
   [junit4] 
   [junit4] Suite: org.apache.solr.schema.PreAnalyzedFieldTest
   [junit4] Completed [523/921 (1!)] on J3 in 0.25s, 7 tests
   [junit4] 
   [junit4] Suite: org.apache.solr.cloud.TestClusterProperties
   [junit4] Completed [524/921 (1!)] on J5 in 2.00s, 3 tests
   [junit4] 
   [junit4] Suite: org.apache.solr.cloud.TestCloudRecovery2
   [junit4] Completed [525/921 (1!)] on J4 in 13.01s, 1 test
   [junit4] 
   [junit4] Suite: org.apache.solr.cloud.TestDeleteCollectionOnDownNodes
   [junit4] Completed [526/921 (1!)] on J5 in 6.76s, 1 test
   [junit4] 
   [junit4] Suite: org.apache.solr.cloud.TestDistributedMap
   [junit4] Completed [527/921 (1!)] on J5 in 1.75s, 8 tests
   [junit4] 
   [junit4] Suite: org.apache.solr.cloud.TestConfigSetsAPI
   [junit4] Completed [528/921 (1!)] on J0 in 12.01s, 31 tests
   [junit4] 
   [junit4] Suite: org.apache.solr.cloud.TestDistribDocBasedVersion
   [junit4] Completed [529/921 (1!)] on J4 in 9.76s, 1 test
   [junit4] 
   [junit4] Suite: org.apache.solr.cloud.TestDownShardTolerantSearch
   [junit4] Completed [530/921 (1!)] on J5 in 2.75s, 1 test
   [junit4] 
   [junit4] Suite: org.apache.solr.cloud.TestLockTree
   [junit4] Completed [531/921 (1!)] on J5 in 0.26s, 1 test
   [junit4] 
   [junit4] Suite: org.apache.solr.cloud.TestCryptoKeys
   [junit4] Completed [532/921 (1!)] on J3 in 16.76s, 1 test
   [junit4] 
   [junit4] Suite: org.apache.solr.cloud.TestDynamicFieldNamesIndexCorrectly
   [junit4] Completed [533/921 (1!)] on J0 in 13.76s, 1 test
   [junit4] 
   [junit4] Suite: org.apache.solr.cloud.TestLeaderElectionZkExpiry
   [junit4] Completed [534/921 (1!)] on J4 in 13.76s, 1 test
   [junit4] 
   [junit4] Suite: org.apache.solr.cloud.TestConfigSetsAPIShareSchema
   [junit4] Completed [535/921 (1!)] on J1 in 40.76s, 2 tests
   [junit4] 
   [junit4] Suite: org.apache.solr.cloud.TestRequestForwarding
   [junit4] Completed [536/921 (1!)] on J4 in 3.76s, 1 test
   [junit4] 
   [junit4] Suite: org.apache.solr.cloud.TestRandomRequestDistribution
   [junit4] Completed [537/921 (1!)] on J3 in 16.79s, 1 test
   [junit4] 
   [junit4] Suite: org.apache.solr.cloud.TestSSLRandomization
   [junit4] Completed [538/921 (1!)] on J1 in 4.76s, 4 tests
   [junit4] 
   [junit4] Suite: org.apache.solr.cloud.TestCloudSearcherWarming
   [junit4] Completed [539/921 (1!)] on J2 in 42.78s, 2 tests
   [junit4] 
   [junit4] Suite: org.apache.solr.cloud.TestMiniSolrCloudClusterSSL
   [junit4] Completed [540/921 (1!)] on J5 in 24.26s, 6 tests
   [junit4] 
   [junit4] Suite: org.apache.solr.cloud.TestTlogReplayVsRecovery
   [junit4] IGNOR/A 0.00s J5 | TestTlogReplayVsRecovery.testManyDocsInTlogReplayWhileReplicaIsTryingToRecover
   [junit4]    > Assumption #1: 'awaitsfix' test group is disabled (@AwaitsFix(bugUrl="https://issues.apache.org/jira/browse/SOLR-13486;https://issues.apache.org/jira/browse/SOLR-14183"))
   [junit4] Completed [541/921 (1!)] on J5 in 0.00s, 1 test, 1 skipped
   [junit4] 
   [junit4] Suite: org.apache.solr.cloud.TestShortCircuitedRequests
   [junit4] Completed [542/921 (1!)] on J3 in 6.76s, 1 test
   [junit4] 
   [junit4] Suite: org.apache.solr.cloud.TestSegmentSorting
   [junit4] Completed [543/921 (1!)] on J4 in 12.55s, 2 tests
   [junit4] 
   [junit4] Suite: org.apache.solr.cloud.TestTolerantUpdateProcessorCloud
   [junit4] Completed [544/921 (1!)] on J3 in 9.78s, 19 tests
   [junit4] 
   [junit4] Suite: org.apache.solr.cloud.TestStressInPlaceUpdates
   [junit4] Completed [545/921 (1!)] on J1 in 16.76s, 1 test
   [junit4] 
   [junit4] Suite: org.apache.solr.cloud.TestTolerantUpdateProcessorRandomCloud
   [junit4] Completed [546/921 (1!)] on J4 in 10.87s, 2 tests
   [junit4] 
   [junit4] Suite: org.apache.solr.cloud.TestRebalanceLeaders
   [junit4] Completed [547/921 (1!)] on J0 in 28.01s, 3 tests
   [junit4] 
   [junit4] Suite: org.apache.solr.cloud.VMParamsZkACLAndCredentialsProvidersTest
   [junit4] Completed [548/921 (1!)] on J1 in 3.77s, 4 tests
   [junit4] 
   [junit4] Suite: org.apache.solr.cloud.ZkControllerTest
   [junit4] Completed [549/921 (1!)] on J0 in 8.75s, 4 tests
   [junit4] 
   [junit4] Suite: org.apache.solr.cloud.ZkNodePropsTest
   [junit4] Completed [550/921 (1!)] on J0 in 0.25s, 1 test
   [junit4] 
   [junit4] Suite: org.apache.solr.cloud.api.collections.AsyncCallRequestStatusResponseTest
   [junit4] Completed [551/921 (1!)] on J0 in 3.25s, 1 test
   [junit4] 
   [junit4] Suite: org.apache.solr.cloud.ZkFailoverTest
   [junit4] Completed [552/921 (1!)] on J1 in 14.01s, 1 test
   [junit4] 
   [junit4] Suite: org.apache.solr.cloud.api.collections.CollectionReloadTest
   [junit4] Completed [553/921 (1!)] on J0 in 6.75s, 1 test
   [junit4] 
   [junit4] Suite: org.apache.solr.cloud.api.collections.CollectionTooManyReplicasTest
   [junit4] Completed [554/921 (1!)] on J1 in 14.51s, 3 tests
   [junit4] 
   [junit4] Suite: org.apache.solr.cloud.UnloadDistributedZkTest
   [junit4] Completed [555/921 (1!)] on J3 in 44.02s, 1 test
   [junit4] 
   [junit4] Suite: org.apache.solr.cloud.ZkCLITest
   [junit4] Completed [556/921 (1!)] on J4 in 42.02s, 15 tests
   [junit4] 
   [junit4] Suite: org.apache.solr.cloud.api.collections.ConcurrentCreateCollectionTest
   [junit4] Completed [557/921 (1!)] on J3 in 4.00s, 1 test
   [junit4] 
   [junit4] HEARTBEAT J2 PID(3770228@localhost): 2020-11-09T18:37:05, stalled for 69.0s at: TestStressLiveNodes.testStress
   [junit4] Suite: org.apache.solr.cloud.TestTlogReplica
   [junit4] Completed [558/921 (1!)] on J5 in 66.59s, 14 tests, 1 skipped
   [junit4] 
   [junit4] Suite: org.apache.solr.cloud.api.collections.CollectionsAPIAsyncDistributedZkTest
   [junit4] Completed [559/921 (1!)] on J0 in 41.76s, 4 tests
   [junit4] 
   [junit4] Suite: org.apache.solr.cloud.api.collections.SimpleCollectionCreateDeleteTest
   [junit4] Completed [560/921 (1!)] on J3 in 22.76s, 3 tests
   [junit4] 
   [junit4] Suite: org.apache.solr.cloud.api.collections.SplitByPrefixTest
   [junit4] Completed [561/921 (1!)] on J5 in 29.76s, 1 test
   [junit4] 
   [junit4] Suite: org.apache.solr.cloud.api.collections.TestHdfsCloudBackupRestore
   [junit4] Completed [562/921 (1!)] on J5 in 0.25s, 2 tests, 2 skipped
   [junit4] 
   [junit4] Suite: org.apache.solr.cloud.api.collections.TestCollectionsAPIViaSolrCloudCluster
   [junit4] Completed [563/921 (1!)] on J3 in 21.01s, 3 tests
   [junit4] 
   [junit4] Suite: org.apache.solr.cloud.api.collections.TestCollectionAPI
   [junit4] Completed [564/921 (1!)] on J0 in 33.02s, 2 tests
   [junit4] 
   [junit4] Suite: org.apache.solr.cloud.api.collections.TestLocalFSCloudBackupRestore
   [junit4] Completed [565/921 (1!)] on J5 in 20.54s, 2 tests
   [junit4] 
   [junit4] Suite: org.apache.solr.cloud.api.collections.TestReplicaProperties
   [junit4] Completed [566/921 (1!)] on J3 in 15.76s, 1 test
   [junit4] 
   [junit4] HEARTBEAT J2 PID(3770228@localhost): 2020-11-09T18:38:05, stalled for  129s at: TestStressLiveNodes.testStress
   [junit4] Suite: org.apache.solr.cloud.api.collections.TestRequestStatusCollectionAPI
   [junit4] Completed [567/921 (1!)] on J0 in 20.76s, 1 test
   [junit4] 
   [junit4] Suite: org.apache.solr.cloud.autoscaling.HdfsAutoAddReplicasIntegrationTest
   [junit4] IGNOR/A 0.00s J0 | HdfsAutoAddReplicasIntegrationTest.testAddCollectionPropAfterCreation
   [junit4]    > Assumption #1: 'nightly' test group is disabled (@Nightly(value=""))
   [junit4] IGNOR/A 0.00s J0 | HdfsAutoAddReplicasIntegrationTest.testClusterPropOverridesCollecitonProp
   [junit4]    > Assumption #1: 'nightly' test group is disabled (@Nightly(value=""))
   [junit4] IGNOR/A 0.00s J0 | HdfsAutoAddReplicasIntegrationTest.testSimple
   [junit4]    > Assumption #1: 'nightly' test group is disabled (@Nightly(value=""))
   [junit4] IGNOR/A 0.00s J0 | HdfsAutoAddReplicasIntegrationTest.testRapidStopStartStopWithPropChange
   [junit4]    > Assumption #1: 'awaitsfix' test group is disabled (@AwaitsFix(bugUrl="https://issues.apache.org/jira/browse/SOLR-13811"))
   [junit4] Completed [568/921 (1!)] on J0 in 0.00s, 4 tests, 4 skipped
   [junit4] 
   [junit4] Suite: org.apache.solr.cloud.api.collections.CollectionsAPIDistributedZkTest
   [junit4] Completed [569/921 (1!)] on J1 in 95.03s, 19 tests
   [junit4] 
   [junit4] Suite: org.apache.solr.cloud.autoscaling.HttpTriggerListenerTest
   [junit4] Completed [570/921 (1!)] on J0 in 8.50s, 1 test
   [junit4] 
   [junit4] Suite: org.apache.solr.cloud.autoscaling.ExecutePlanActionTest
   [junit4] Completed [571/921 (1!)] on J3 in 40.78s, 4 tests
   [junit4] 
   [junit4] Suite: org.apache.solr.cloud.autoscaling.SearchRateTriggerIntegrationTest
   [junit4] IGNOR/A 0.00s J3 | SearchRateTriggerIntegrationTest.testAboveSearchRate
   [junit4]    > Assumption #1: 'nightly' test group is disabled (@Nightly(value=""))
   [junit4] IGNOR/A 0.00s J3 | SearchRateTriggerIntegrationTest.testDeleteNode
   [junit4]    > Assumption #1: 'awaitsfix' test group is disabled (@AwaitsFix(bugUrl="https://issues.apache.org/jira/browse/SOLR-13163"))
   [junit4] IGNOR/A 0.00s J3 | SearchRateTriggerIntegrationTest.testBelowSearchRate
   [junit4]    > Assumption #1: 'nightly' test group is disabled (@Nightly(value=""))
   [junit4] Completed [572/921 (1!)] on J3 in 0.00s, 3 tests, 3 skipped
   [junit4] 
   [junit4] Suite: org.apache.solr.cloud.autoscaling.SearchRateTriggerTest
   [junit4] IGNOR/A 0.00s J3 | SearchRateTriggerTest.testTrigger
   [junit4]    > Assumption #1: 'awaitsfix' test group is disabled (@AwaitsFix(bugUrl="https://issues.apache.org/jira/browse/SOLR-12028"))
   [junit4] Completed [573/921 (1!)] on J3 in 19.51s, 3 tests, 1 skipped
   [junit4] 
   [junit4] HEARTBEAT J2 PID(3770228@localhost): 2020-11-09T18:39:05, stalled for  189s at: TestStressLiveNodes.testStress
   [junit4] Suite: org.apache.solr.cloud.autoscaling.IndexSizeTriggerSizeEstimationTest
   [junit4] Completed [574/921 (1!)] on J0 in 49.77s, 1 test
   [junit4] 
   [junit4] Suite: org.apache.solr.cloud.autoscaling.SystemLogListenerTest
   [junit4] Completed [575/921 (1!)] on J3 in 26.76s, 1 test
   [junit4] 
   [junit4] HEARTBEAT J1 PID(3770231@localhost): 2020-11-09T18:39:29, stalled for 69.2s at: IndexSizeTriggerMixedBoundsTest.testMixedBounds
   [junit4] Suite: org.apache.solr.cloud.autoscaling.ComputePlanActionTest
   [junit4] IGNOR/A 0.00s J5 | ComputePlanActionTest.testNodeLost
   [junit4]    > Assumption #1: 'awaitsfix' test group is disabled (@AwaitsFix(bugUrl="https://issues.apache.org/jira/browse/SOLR-12028"))
   [junit4] Completed [576/921 (1!)] on J5 in 94.79s, 10 tests, 1 skipped
   [junit4] 
   [junit4] Suite: org.apache.solr.cloud.autoscaling.TriggerEventQueueTest
   [junit4] Completed [577/921 (1!)] on J5 in 0.25s, 1 test
   [junit4] 
   [junit4] Suite: org.apache.solr.cloud.autoscaling.TestPolicyCloud
   [junit4] Completed [578/921 (1!)] on J0 in 23.77s, 8 tests
   [junit4] 
   [junit4] Suite: org.apache.solr.cloud.autoscaling.sim.TestSimComputePlanAction
   [junit4] IGNOR/A 0.00s J5 | TestSimComputePlanAction.testNodeLost
   [junit4]    > Assumption #1: 'awaitsfix' test group is disabled (@AwaitsFix(bugUrl="https://issues.apache.org/jira/browse/SOLR-12028"))
   [junit4] Completed [579/921 (1!)] on J5 in 0.50s, 3 tests, 1 skipped
   [junit4] 
   [junit4] Suite: org.apache.solr.cloud.autoscaling.sim.TestSimDistribStateManager
   [junit4] Completed [580/921 (1!)] on J0 in 2.75s, 10 tests
   [junit4] 
   [junit4] Suite: org.apache.solr.cloud.api.collections.ShardSplitTest
   [junit4] IGNOR/A 0.00s J4 | ShardSplitTest.testSplitAfterFailedSplit2
   [junit4]    > Assumption #1: 'nightly' test group is disabled (@Nightly())
   [junit4] IGNOR/A 0.00s J4 | ShardSplitTest.test
   [junit4]    > Assumption #1: 'nightly' test group is disabled (@Nightly())
   [junit4] IGNOR/A 0.00s J4 | ShardSplitTest.testSplitWithChaosMonkey
   [junit4]    > Assumption #1: 'nightly' test group is disabled (@Nightly())
   [junit4] Completed [581/921 (1!)] on J4 in 160.80s, 11 tests, 3 skipped
   [junit4] 
   [junit4] Suite: org.apache.solr.cloud.autoscaling.sim.TestSimExecutePlanAction
   [junit4] Completed [582/921 (1!)] on J0 in 0.75s, 2 tests
   [junit4] 
   [junit4] Suite: org.apache.solr.cloud.autoscaling.sim.TestSimExtremeIndexing
   [junit4] IGNOR/A 0.00s J4 | TestSimExtremeIndexing.testScaleUp
   [junit4]    > Assumption #1: 'awaitsfix' test group is disabled (@AwaitsFix(bugUrl="https://issues.apache.org/jira/browse/SOLR-12923"))
   [junit4] Completed [583/921 (1!)] on J4 in 0.00s, 1 test, 1 skipped
   [junit4] 
   [junit4] Suite: org.apache.solr.cloud.autoscaling.sim.TestSimDistributedQueue
   [junit4] Completed [584/921 (1!)] on J5 in 5.75s, 4 tests
   [junit4] 
   [junit4] Suite: org.apache.solr.cloud.autoscaling.sim.TestSimNodeAddedTrigger
   [junit4] Completed [585/921 (1!)] on J5 in 0.50s, 4 tests
   [junit4] 
   [junit4] Suite: org.apache.solr.cloud.autoscaling.sim.TestSimNodeLostTrigger
   [junit4] Completed [586/921 (1!)] on J5 in 0.50s, 4 tests
   [junit4] 
   [junit4] Suite: org.apache.solr.cloud.autoscaling.sim.TestSimPolicyCloud
   [junit4] Completed [587/921 (1!)] on J5 in 1.00s, 7 tests
   [junit4] 
   [junit4] Suite: org.apache.solr.cloud.autoscaling.sim.TestSimGenericDistributedQueue
   [junit4] Completed [588/921 (1!)] on J0 in 7.75s, 5 tests
   [junit4] 
   [junit4] Suite: org.apache.solr.cloud.autoscaling.sim.TestSimScenario
   [junit4] Completed [589/921 (1!)] on J5 in 5.00s, 4 tests
   [junit4] 
   [junit4] Suite: org.apache.solr.cloud.autoscaling.sim.TestSimUtils
   [junit4] Completed [590/921 (1!)] on J5 in 0.26s, 1 test
   [junit4] 
   [junit4] Suite: org.apache.solr.cloud.autoscaling.TriggerCooldownIntegrationTest
   [junit4] Completed [591/921 (1!)] on J3 in 26.01s, 1 test
   [junit4] 
   [junit4] Suite: org.apache.solr.cloud.hdfs.HdfsBasicDistributedZkTest
   [junit4] IGNOR/A 0.00s J3 | HdfsBasicDistributedZkTest.test
   [junit4]    > Assumption #1: 'nightly' test group is disabled (@Nightly(value=""))
   [junit4] Completed [593/921 (1!)] on J3 in 0.00s, 1 test, 1 skipped
   [junit4] 
   [junit4] Suite: org.apache.solr.cloud.autoscaling.sim.TestSimTriggerIntegration
   [junit4] Completed [594/921 (1!)] on J0 in 8.25s, 11 tests
   [junit4] 
   [junit4] Suite: org.apache.solr.cloud.hdfs.HdfsChaosMonkeyNothingIsSafeTest
   [junit4] IGNOR/A 0.00s J3 | HdfsChaosMonkeyNothingIsSafeTest.test
   [junit4]    > Assumption #1: 'nightly' test group is disabled (@Nightly(value=""))
   [junit4] Completed [595/921 (1!)] on J3 in 0.00s, 1 test, 1 skipped
   [junit4] 
   [junit4] Suite: org.apache.solr.cloud.hdfs.HdfsChaosMonkeySafeLeaderTest
   [junit4] IGNOR/A 0.00s J0 | HdfsChaosMonkeySafeLeaderTest.test
   [junit4]    > Assumption #1: 'nightly' test group is disabled (@Nightly(value=""))
   [junit4] Completed [596/921 (1!)] on J0 in 0.00s, 1 test, 1 skipped
   [junit4] 
   [junit4] Suite: org.apache.solr.cloud.autoscaling.sim.TestSnapshotCloudManager
   [junit4] Completed [597/921 (1!)] on J5 in 6.01s, 5 tests
   [junit4] 
   [junit4] Suite: org.apache.solr.cloud.hdfs.HdfsTlogReplayBufferedWhileIndexingTest
   [junit4] IGNOR/A 0.00s J3 | HdfsTlogReplayBufferedWhileIndexingTest.test
   [junit4]    > Assumption #1: 'nightly' test group is disabled (@Nightly(value=""))
   [junit4] Completed [598/921 (1!)] on J3 in 0.00s, 1 test, 1 skipped
   [junit4] 
   [junit4] Suite: org.apache.solr.cloud.hdfs.HdfsUnloadDistributedZkTest
   [junit4] IGNOR/A 0.00s J0 | HdfsUnloadDistributedZkTest.test
   [junit4]    > Assumption #1: 'nightly' test group is disabled (@Nightly(value=""))
   [junit4] Completed [599/921 (1!)] on J0 in 0.00s, 1 test, 1 skipped
   [junit4] 
   [junit4] Suite: org.apache.solr.cloud.hdfs.HdfsWriteToMultipleCollectionsTest
   [junit4] IGNOR/A 0.00s J5 | HdfsWriteToMultipleCollectionsTest.test
   [junit4]    > Assumption #1: 'nightly' test group is disabled (@Nightly())
   [junit4] Completed [600/921 (1!)] on J5 in 0.00s, 1 test, 1 skipped
   [junit4] 
   [junit4] Suite: org.apache.solr.cloud.rule.ImplicitSnitchTest
   [junit4] Completed [601/921 (1!)] on J5 in 0.25s, 11 tests, 1 skipped
   [junit4] 
   [junit4] Suite: org.apache.solr.core.AlternateDirectoryTest
   [junit4] Completed [602/921 (1!)] on J5 in 0.50s, 2 tests
   [junit4] 
   [junit4] Suite: org.apache.solr.cloud.overseer.ZkStateReaderTest
   [junit4] Completed [603/921 (1!)] on J3 in 3.75s, 7 tests
   [junit4] 
   [junit4] Suite: org.apache.solr.core.BlobRepositoryMockingTest
   [junit4] Completed [604/921 (1!)] on J3 in 0.07s, 5 tests
   [junit4] 
   [junit4] Suite: org.apache.solr.core.BlobRepositoryCloudTest
   [junit4] Completed [605/921 (1!)] on J5 in 5.25s, 1 test
   [junit4] 
   [junit4] Suite: org.apache.solr.core.TestBackupRepositoryFactory
   [junit4] Completed [606/921 (1!)] on J5 in 0.25s, 4 tests
   [junit4] 
   [junit4] Suite: org.apache.solr.core.SolrCoreTest
   [junit4] Completed [607/921 (1!)] on J3 in 3.50s, 8 tests
   [junit4] 
   [junit4] Suite: org.apache.solr.core.TestBadConfig
   [junit4] Completed [608/921 (1!)] on J5 in 2.00s, 14 tests
   [junit4] 
   [junit4] Suite: org.apache.solr.cloud.overseer.ZkStateWriterTest
   [junit4] Completed [609/921 (1!)] on J0 in 9.76s, 5 tests
   [junit4] 
   [junit4] HEARTBEAT J2 PID(3770228@localhost): 2020-11-09T18:40:05, stalled for  249s at: TestStressLiveNodes.testStress
   [junit4] Suite: org.apache.solr.core.TestCorePropertiesReload
   [junit4] Completed [610/921 (1!)] on J0 in 0.75s, 1 test
   [junit4] 
   [junit4] Suite: org.apache.solr.core.TestCoreContainer
   [junit4] IGNOR/A 0.00s J3 | TestCoreContainer.assertAllowPathFromSolrXmlWin
   [junit4]    > Assumption #1: got: <false>, expected: is <true>
   [junit4] IGNOR/A 0.00s J3 | TestCoreContainer.assertAllowPathWindows
   [junit4]    > Assumption #1: got: <false>, expected: is <true>
   [junit4] Completed [611/921 (1!)] on J3 in 3.51s, 16 tests, 2 skipped
   [junit4] 
   [junit4] Suite: org.apache.solr.cloud.autoscaling.IndexSizeTriggerMixedBoundsTest
   [junit4] Completed [612/921 (1!)] on J1 in 107.04s, 1 test
   [junit4] 
   [junit4] Suite: org.apache.solr.core.TestCoreDiscovery
   [junit4] Completed [613/921 (1!)] on J5 in 2.25s, 13 tests
   [junit4] 
   [junit4] Suite: org.apache.solr.core.TestSimpleTextCodec
   [junit4] Completed [614/921 (1!)] on J5 in 0.25s, 1 test
   [junit4] 
   [junit4] Suite: org.apache.solr.cloud.TestStressLiveNodes
   [junit4] Completed [615/921 (1!)] on J2 in 253.83s, 1 test
   [junit4] 
   [junit4] Suite: org.apache.solr.core.TestSolrDeletionPolicy1
   [junit4] Completed [616/921 (1!)] on J2 in 0.75s, 3 tests
   [junit4] 
   [junit4] Suite: org.apache.solr.core.TestSolrDeletionPolicy2
   [junit4] Completed [617/921 (1!)] on J2 in 0.50s, 1 test
   [junit4] 
   [junit4] Suite: org.apache.solr.core.TestSolrIndexConfig
   [junit4] Completed [618/921 (1!)] on J2 in 0.50s, 2 tests
   [junit4] 
   [junit4] Suite: org.apache.solr.core.TestSolrConfigHandler
   [junit4] Completed [619/921 (1!)] on J5 in 5.26s, 5 tests
   [junit4] 
   [junit4] Suite: org.apache.solr.core.TestSolrXml
   [junit4] Completed [620/921 (1!)] on J2 in 0.25s, 23 tests, 1 skipped
   [junit4] 
   [junit4] Suite: org.apache.solr.handler.TestCSVLoader
   [junit4] Completed [621/921 (1!)] on J5 in 0.50s, 6 tests
   [junit4] 
   [junit4] Suite: org.apache.solr.core.TestDynamicLoadingUrl
   [junit4] Completed [622/921 (1!)] on J1 in 9.81s, 1 test
   [junit4] 
   [junit4] Suite: org.apache.solr.core.TestCustomStream
   [junit4] Completed [623/921 (1!)] on J0 in 11.76s, 1 test
   [junit4] 
   [junit4] Suite: org.apache.solr.handler.TestReplicationHandlerBackup
   [junit4] Completed [624/921 (1!)] on J1 in 1.00s, 2 tests
   [junit4] 
   [junit4] Suite: org.apache.solr.handler.TestReplicationHandlerDiskOverFlow
   [junit4] Completed [625/921 (1!)] on J0 in 1.50s, 1 test
   [junit4] 
   [junit4] Suite: org.apache.solr.handler.TestConfigReload
   [junit4] Completed [626/921 (1!)] on J2 in 9.80s, 1 test
   [junit4] 
   [junit4] Suite: org.apache.solr.handler.TestReqParamsAPI
   [junit4] Completed [627/921 (1!)] on J1 in 4.51s, 1 test
   [junit4] 
   [junit4] Suite: org.apache.solr.handler.V2StandaloneTest
   [junit4] Completed [628/921 (1!)] on J1 in 0.25s, 1 test
   [junit4] 
   [junit4] Suite: org.apache.solr.handler.XmlUpdateRequestHandlerTest
   [junit4] Completed [629/921 (1!)] on J1 in 0.50s, 5 tests
   [junit4] 
   [junit4] Suite: org.apache.solr.handler.XsltUpdateRequestHandlerTest
   [junit4] Completed [630/921 (1!)] on J1 in 0.75s, 2 tests
   [junit4] 
   [junit4] Suite: org.apache.solr.handler.V2ApiIntegrationTest
   [junit4] Completed [631/921 (1!)] on J2 in 3.76s, 7 tests
   [junit4] 
   [junit4] Suite: org.apache.solr.handler.TestContainerPlugin
   [junit4] Completed [632/921 (1!)] on J5 in 14.01s, 2 tests
   [junit4] 
   [junit4] Suite: org.apache.solr.handler.admin.AdminHandlersProxyTest
   [junit4] Completed [633/921 (1!)] on J1 in 2.51s, 4 tests
   [junit4] 
   [junit4] Suite: org.apache.solr.handler.TestSystemCollAutoCreate
   [junit4] Completed [634/921 (1!)] on J0 in 11.01s, 1 test
   [junit4] 
   [junit4] Suite: org.apache.solr.core.TestDynamicLoading
   [junit4] Completed [635/921 (1!)] on J3 in 24.05s, 1 test
   [junit4] 
   [junit4] Suite: org.apache.solr.handler.admin.MetricsHandlerTest
   [junit4] Completed [636/921 (1!)] on J3 in 0.51s, 5 tests
   [junit4] 
   [junit4] Suite: org.apache.solr.handler.admin.HealthCheckHandlerTest
   [junit4] Completed [637/921 (1!)] on J5 in 3.76s, 5 tests
   [junit4] 
   [junit4] Suite: org.apache.solr.handler.admin.DaemonStreamApiTest
   [junit4] Completed [638/921 (1!)] on J2 in 4.77s, 1 test
   [junit4] 
   [junit4] Suite: org.apache.solr.handler.admin.SolrEnvironmentTest
   [junit4] Completed [639/921 (1!)] on J2 in 0.01s, 6 tests
   [junit4] 
   [junit4] Suite: org.apache.solr.handler.admin.ShowFileRequestHandlerTest
   [junit4] Completed [640/921 (1!)] on J5 in 0.75s, 4 tests
   [junit4] 
   [junit4] Suite: org.apache.solr.handler.admin.IndexSizeEstimatorTest
   [junit4] Completed [641/921 (1!)] on J1 in 4.76s, 2 tests
   [junit4] 
   [junit4] Suite: org.apache.solr.handler.admin.SplitHandlerTest
   [junit4] Completed [642/921 (1!)] on J2 in 1.00s, 3 tests
   [junit4] 
   [junit4] Suite: org.apache.solr.handler.admin.SystemInfoHandlerTest
   [junit4] Completed [643/921 (1!)] on J1 in 0.25s, 1 test
   [junit4] 
   [junit4] Suite: org.apache.solr.handler.admin.TestApiFramework
   [junit4] Completed [644/921 (1!)] on J2 in 0.25s, 4 tests
   [junit4] 
   [junit4] Suite: org.apache.solr.handler.admin.ThreadDumpHandlerTest
   [junit4] IGNOR/A 0.00s J1 | ThreadDumpHandlerTest.testMonitorBlocked
   [junit4]    > Assumption #1: 'nightly' test group is disabled (@Nightly())
   [junit4] IGNOR/A 0.00s J1 | ThreadDumpHandlerTest.testOwnableSyncWaiting
   [junit4]    > Assumption #1: 'nightly' test group is disabled (@Nightly())
   [junit4] Completed [645/921 (1!)] on J1 in 0.50s, 4 tests, 2 skipped
   [junit4] 
   [junit4] Suite: org.apache.solr.handler.admin.ZookeeperReadAPITest
   [junit4] Completed [646/921 (1!)] on J2 in 1.75s, 1 test
   [junit4] 
   [junit4] Suite: org.apache.solr.handler.admin.ZookeeperStatusHandlerTest
   [junit4] Completed [647/921 (1!)] on J1 in 1.50s, 6 tests
   [junit4] 
   [junit4] Suite: org.apache.solr.handler.component.DebugComponentTest
   [junit4] Completed [648/921 (1!)] on J1 in 0.50s, 5 tests
   [junit4] 
   [junit4] Suite: org.apache.solr.handler.component.DistributedDebugComponentTest
   [junit4] Completed [649/921 (1!)] on J1 in 0.76s, 5 tests
   [junit4] 
   [junit4] Suite: org.apache.solr.handler.component.DistributedFacetPivotLongTailTest
   [junit4] Completed [650/921 (1!)] on J1 in 3.01s, 1 test
   [junit4] 
   [junit4] Suite: org.apache.solr.cloud.autoscaling.sim.TestSimLargeCluster
   [junit4] IGNOR/A 0.00s J4 | TestSimLargeCluster.testBasic
   [junit4]    > Assumption #1: 'awaitsfix' test group is disabled (@AwaitsFix(bugUrl="https://issues.apache.org/jira/browse/SOLR-12028"))
   [junit4] Completed [651/921 (1!)] on J4 in 63.28s, 6 tests, 1 skipped
   [junit4] 
   [junit4] Suite: org.apache.solr.handler.component.DistributedFacetPivotSmallAdvancedTest
   [junit4] Completed [652/921 (1!)] on J1 in 1.25s, 1 test
   [junit4] 
   [junit4] Suite: org.apache.solr.handler.component.DistributedFacetPivotSmallTest
   [junit4] Completed [653/921 (1!)] on J4 in 2.76s, 1 test
   [junit4] 
   [junit4] Suite: org.apache.solr.handler.admin.StatsReloadRaceTest
   [junit4] Completed [654/921 (1!)] on J5 in 11.76s, 1 test
   [junit4] 
   [junit4] Suite: org.apache.solr.handler.component.DistributedFacetPivotWhiteBoxTest
   [junit4] Completed [655/921 (1!)] on J1 in 2.26s, 1 test
   [junit4] 
   [junit4] Suite: org.apache.solr.handler.component.CustomTermsComponentTest
   [junit4] Completed [656/921 (1!)] on J2 in 8.76s, 1 test
   [junit4] 
   [junit4] Suite: org.apache.solr.handler.component.MoreLikeThisComponentTest
   [junit4] Completed [657/921 (1!)] on J2 in 0.50s, 9 tests
   [junit4] 
   [junit4] Suite: org.apache.solr.handler.component.PhrasesIdentificationComponentTest
   [junit4] Completed [658/921 (1!)] on J2 in 0.52s, 10 tests
   [junit4] 
   [junit4] Suite: org.apache.solr.handler.component.DistributedMLTComponentTest
   [junit4] Completed [659/921 (1!)] on J4 in 2.25s, 1 test
   [junit4] 
   [junit4] Suite: org.apache.solr.handler.component.DistributedQueryComponentCustomSortTest
   [junit4] Completed [660/921 (1!)] on J5 in 2.25s, 1 test
   [junit4] 
   [junit4] Suite: org.apache.solr.handler.component.SuggestComponentContextFilterQueryTest
   [junit4] Completed [661/921 (1!)] on J4 in 1.04s, 10 tests, 1 skipped
   [junit4] 
   [junit4] Suite: org.apache.solr.handler.admin.MetricsHistoryHandlerTest
   [junit4] Completed [662/921 (1!)] on J3 in 17.01s, 1 test
   [junit4] 
   [junit4] Suite: org.apache.solr.handler.component.InfixSuggestersTest
   [junit4] Completed [663/921 (1!)] on J1 in 4.26s, 7 tests
   [junit4] 
   [junit4] Suite: org.apache.solr.handler.component.TermVectorComponentTest
   [junit4] Completed [664/921 (1!)] on J3 in 0.75s, 2 tests
   [junit4] 
   [junit4] Suite: org.apache.solr.handler.component.TermsComponentTest
   [junit4] Completed [665/921 (1!)] on J1 in 3.26s, 21 tests
   [junit4] 
   [junit4] Suite: org.apache.solr.handler.component.SuggestComponentTest
   [junit4] Completed [666/921 (1!)] on J5 in 5.51s, 12 tests
   [junit4] 
   [junit4] Suite: org.apache.solr.handler.component.TestHttpShardHandlerFactory
   [junit4] Completed [667/921 (1!)] on J5 in 0.51s, 22 tests
   [junit4] 
   [junit4] Suite: org.apache.solr.handler.component.TestExpandComponent
   [junit4] Completed [668/921 (1!)] on J1 in 0.77s, 4 tests
   [junit4] 
   [junit4] Suite: org.apache.solr.handler.component.TermVectorComponentDistributedTest
   [junit4] Completed [669/921 (1!)] on J4 in 5.26s, 1 test
   [junit4] 
   [junit4] Suite: org.apache.solr.handler.loader.JavabinLoaderTest
   [junit4] Completed [670/921 (1!)] on J5 in 0.50s, 1 test
   [junit4] 
   [junit4] Suite: org.apache.solr.handler.tagger.EmbeddedSolrNoSerializeTest
   [junit4] Completed [671/921 (1!)] on J1 in 0.50s, 4 tests, 1 skipped
   [junit4] 
   [junit4] Suite: org.apache.solr.handler.component.StatsComponentTest
   [junit4] Completed [672/921 (1!)] on J2 in 8.03s, 22 tests
   [junit4] 
   [junit4] Suite: org.apache.solr.handler.tagger.Tagger2Test
   [junit4] IGNOR/A 0.00s J5 | Tagger2Test.testStopWords
   [junit4]    > Assumption #1: 'awaitsfix' test group is disabled (@AwaitsFix(bugUrl="https://issues.apache.org/jira/browse/LUCENE-8344"))
   [junit4] Completed [673/921 (1!)] on J5 in 0.26s, 5 tests, 2 skipped
   [junit4] 
   [junit4] Suite: org.apache.solr.handler.tagger.RandomizedTaggerTest
   [junit4] Completed [674/921 (1!)] on J4 in 0.76s, 10 tests
   [junit4] 
   [junit4] Suite: org.apache.solr.handler.tagger.TaggingAttributeTest
   [junit4] Completed [675/921 (1!)] on J2 in 0.25s, 1 test
   [junit4] 
   [junit4] Suite: org.apache.solr.handler.tagger.TaggerTest
   [junit4] Completed [676/921 (1!)] on J1 in 0.50s, 7 tests, 1 skipped
   [junit4] 
   [junit4] Suite: org.apache.solr.handler.tagger.XmlInterpolationTest
   [junit4] Completed [677/921 (1!)] on J5 in 0.25s, 4 tests
   [junit4] 
   [junit4] Suite: org.apache.solr.highlight.FastVectorHighlighterTest
   [junit4] Completed [678/921 (1!)] on J4 in 0.50s, 2 tests
   [junit4] 
   [junit4] Suite: org.apache.solr.highlight.HighlighterConfigTest
   [junit4] Completed [679/921 (1!)] on J2 in 0.50s, 1 test
   [junit4] 
   [junit4] Suite: org.apache.solr.highlight.HighlighterMaxOffsetTest
   [junit4] Completed [680/921 (1!)] on J1 in 0.50s, 6 tests
   [junit4] 
   [junit4] Suite: org.apache.solr.index.TestSlowCompositeReaderWrapper
   [junit4] Completed [681/921 (1!)] on J2 in 0.25s, 3 tests
   [junit4] 
   [junit4] Suite: org.apache.solr.highlight.HighlighterTest
   [junit4] Completed [682/921 (1!)] on J5 in 1.00s, 35 tests
   [junit4] 
   [junit4] Suite: org.apache.solr.internal.csv.CSVStrategyTest
   [junit4] Completed [683/921 (1!)] on J5 in 0.00s, 5 tests
   [junit4] 
   [junit4] Suite: org.apache.solr.index.WrapperMergePolicyFactoryTest
   [junit4] Completed [684/921 (1!)] on J2 in 0.25s, 4 tests
   [junit4] 
   [junit4] Suite: org.apache.solr.highlight.HighlighterWithoutStoredIdTest
   [junit4] Completed [685/921 (1!)] on J4 in 1.00s, 35 tests
   [junit4] 
   [junit4] Suite: org.apache.solr.index.UninvertDocValuesMergePolicyTest
   [junit4] Completed [686/921 (1!)] on J1 in 0.75s, 2 tests
   [junit4] 
   [junit4] Suite: org.apache.solr.internal.csv.CSVUtilsTest
   [junit4] Completed [687/921 (1!)] on J5 in 0.00s, 14 tests
   [junit4] 
   [junit4] Suite: org.apache.solr.internal.csv.CharBufferTest
   [junit4] Completed [688/921 (1!)] on J2 in 0.00s, 13 tests
   [junit4] 
   [junit4] Suite: org.apache.solr.legacy.TestNumericTokenStream
   [junit4] Completed [689/921 (1!)] on J5 in 0.26s, 6 tests
   [junit4] 
   [junit4] Suite: org.apache.solr.handler.admin.MBeansHandlerTest
   [junit4] Completed [690/921 (1!)] on J0 in 27.26s, 4 tests
   [junit4] 
   [junit4] Suite: org.apache.solr.metrics.SolrMetricManagerTest
   [junit4] Completed [691/921 (1!)] on J0 in 0.26s, 7 tests
   [junit4] 
   [junit4] Suite: org.apache.solr.legacy.TestNumericRangeQuery32
   [junit4] Completed [692/921 (1!)] on J4 in 2.51s, 18 tests
   [junit4] 
   [junit4] Suite: org.apache.solr.metrics.SolrCoreMetricManagerTest
   [junit4] Completed [693/921 (1!)] on J5 in 2.00s, 4 tests
   [junit4] 
   [junit4] Suite: org.apache.solr.metrics.MetricsDisabledCloudTest
   [junit4] Completed [694/921 (1!)] on J2 in 2.51s, 1 test
   [junit4] 
   [junit4] Suite: org.apache.solr.response.TestJavabinTupleStreamParser
   [junit4] Completed [695/921 (1!)] on J2 in 0.26s, 3 tests
   [junit4] 
   [junit4] Suite: org.apache.solr.response.TestPHPSerializedResponseWriter
   [junit4] Completed [696/921 (1!)] on J2 in 0.50s, 2 tests
   [junit4] 
   [junit4] Suite: org.apache.solr.response.TestPushWriter
   [junit4] Completed [697/921 (1!)] on J2 in 0.25s, 2 tests
   [junit4] 
   [junit4] Suite: org.apache.solr.response.TestRawResponseWriter
   [junit4] Completed [698/921 (1!)] on J2 in 0.50s, 3 tests
   [junit4] 
   [junit4] Suite: org.apache.solr.legacy.TestNumericRangeQuery64
   [junit4] Completed [699/921 (1!)] on J1 in 5.51s, 23 tests
   [junit4] 
   [junit4] Suite: org.apache.solr.response.TestRawTransformer
   [junit4] Completed [700/921 (1!)] on J2 in 0.50s, 1 test
   [junit4] 
   [junit4] Suite: org.apache.solr.response.TestRetrieveFieldsOptimizer
   [junit4] Completed [701/921 (1!)] on J1 in 0.25s, 1 test
   [junit4] 
   [junit4] Suite: org.apache.solr.metrics.reporters.SolrJmxReporterCloudTest
   [junit4] Completed [702/921 (1!)] on J0 in 4.76s, 1 test
   [junit4] 
   [junit4] Suite: org.apache.solr.response.transform.TestExplainDocTransformer
   [junit4] Completed [703/921 (1!)] on J2 in 0.50s, 1 test
   [junit4] 
   [junit4] Suite: org.apache.solr.response.transform.TestSubQueryTransformer
   [junit4] Completed [704/921 (1!)] on J1 in 0.50s, 10 tests
   [junit4] 
   [junit4] Suite: org.apache.solr.metrics.reporters.SolrJmxReporterTest
   [junit4] Completed [705/921 (1!)] on J4 in 4.25s, 4 tests
   [junit4] 
   [junit4] Suite: org.apache.solr.response.transform.TestSubQueryTransformerCrossCore
   [junit4] Completed [706/921 (1!)] on J0 in 0.51s, 3 tests
   [junit4] 
   [junit4] Suite: org.apache.solr.rest.TestRestManager
   [junit4] Completed [707/921 (1!)] on J2 in 0.51s, 4 tests
   [junit4] 
   [junit4] Suite: org.apache.solr.rest.schema.TestCopyFieldCollectionResource
   [junit4] Completed [708/921 (1!)] on J4 in 0.50s, 5 tests
   [junit4] 
   [junit4] Suite: org.apache.solr.rest.schema.TestSchemaNameResource
   [junit4] Completed [709/921 (1!)] on J0 in 0.51s, 1 test
   [junit4] 
   [junit4] Suite: org.apache.solr.rest.schema.TestSchemaResource
   [junit4] Completed [710/921 (1!)] on J2 in 0.50s, 3 tests
   [junit4] 
   [junit4] Suite: org.apache.solr.rest.schema.TestSchemaSimilarityResource
   [junit4] Completed [711/921 (1!)] on J4 in 0.50s, 1 test
   [junit4] 
   [junit4] Suite: org.apache.solr.rest.schema.TestSerializedLuceneMatchVersion
   [junit4] Completed [712/921 (1!)] on J2 in 0.25s, 2 tests
   [junit4] 
   [junit4] Suite: org.apache.solr.rest.schema.TestSchemaVersionResource
   [junit4] Completed [713/921 (1!)] on J0 in 0.50s, 1 test
   [junit4] 
   [junit4] Suite: org.apache.solr.res

[...truncated too long message...]

VFaceting-seed#[617FEADC4EFE4241]-worker) [     ] o.a.s.c.CoreContainer Shutting down CoreContainer instance=570359733
   [junit4]   2> 38553 INFO  (coreCloseExecutor-19-thread-1) [     ] o.a.s.c.SolrCore [collection1]  CLOSING SolrCore org.apache.solr.core.SolrCore@10a16cc8
   [junit4]   2> 38554 INFO  (coreCloseExecutor-19-thread-1) [     ] o.a.s.m.SolrMetricManager Closing metric reporters for registry=solr.core.collection1 tag=SolrCore@10a16cc8
   [junit4]   2> 38554 INFO  (coreCloseExecutor-19-thread-1) [     ] o.a.s.m.r.SolrJmxReporter Closing reporter [org.apache.solr.metrics.reporters.SolrJmxReporter@714814d7: rootName = null, domain = solr.core.collection1, service url = null, agent id = null] for registry solr.core.collection1/com.codahale.metrics.MetricRegistry@5fd228cd
   [junit4]   2> 38631 INFO  (coreCloseExecutor-19-thread-1) [     ] o.a.s.u.DirectUpdateHandler2 Committing on IndexWriter.close()  ... SKIPPED (unnecessary).
   [junit4]   2> 38671 INFO  (SUITE-TestRandomDVFaceting-seed#[617FEADC4EFE4241]-worker) [     ] o.a.s.m.SolrMetricManager Closing metric reporters for registry=solr.node tag=null
   [junit4]   2> 38671 INFO  (SUITE-TestRandomDVFaceting-seed#[617FEADC4EFE4241]-worker) [     ] o.a.s.m.r.SolrJmxReporter Closing reporter [org.apache.solr.metrics.reporters.SolrJmxReporter@2731c9fe: rootName = null, domain = solr.node, service url = null, agent id = null] for registry solr.node/com.codahale.metrics.MetricRegistry@72975124
   [junit4]   2> 38677 INFO  (SUITE-TestRandomDVFaceting-seed#[617FEADC4EFE4241]-worker) [     ] o.a.s.m.SolrMetricManager Closing metric reporters for registry=solr.jvm tag=null
   [junit4]   2> 38677 INFO  (SUITE-TestRandomDVFaceting-seed#[617FEADC4EFE4241]-worker) [     ] o.a.s.m.r.SolrJmxReporter Closing reporter [org.apache.solr.metrics.reporters.SolrJmxReporter@27dfcadc: rootName = null, domain = solr.jvm, service url = null, agent id = null] for registry solr.jvm/com.codahale.metrics.MetricRegistry@24f3769d
   [junit4]   2> 38677 INFO  (SUITE-TestRandomDVFaceting-seed#[617FEADC4EFE4241]-worker) [     ] o.a.s.m.SolrMetricManager Closing metric reporters for registry=solr.jetty tag=null
   [junit4]   2> 38677 INFO  (SUITE-TestRandomDVFaceting-seed#[617FEADC4EFE4241]-worker) [     ] o.a.s.m.r.SolrJmxReporter Closing reporter [org.apache.solr.metrics.reporters.SolrJmxReporter@45c462c3: rootName = null, domain = solr.jetty, service url = null, agent id = null] for registry solr.jetty/com.codahale.metrics.MetricRegistry@5d23aae6
   [junit4]   2> NOTE: leaving temporary files on disk at: /home/jenkins/workspace/Lucene-Solr-8.x-Linux/solr/build/solr-core/test/J1/temp/solr.TestRandomDVFaceting_617FEADC4EFE4241-001
   [junit4]   2> NOTE: test params are: codec=Asserting(Lucene87): {small3_ss=PostingsFormat(name=LuceneVarGapFixedInterval), foo_ds_dv=PostingsFormat(name=LuceneFixedGap), foo_f_dv=PostingsFormat(name=Direct), small_i=PostingsFormat(name=LuceneFixedGap), small3_is=PostingsFormat(name=LuceneFixedGap), small_s=PostingsFormat(name=LuceneVarGapFixedInterval), score_f=PostingsFormat(name=LuceneVarGapFixedInterval), score_d=PostingsFormat(name=LuceneFixedGap), id=PostingsFormat(name=LuceneFixedGap), foo_i=PostingsFormat(name=Direct), foo_fs_dv=PostingsFormat(name=LuceneVarGapFixedInterval), foo_l=PostingsFormat(name=LuceneFixedGap), small4_ss=Lucene84, small2_s=PostingsFormat(name=LuceneVarGapFixedInterval), small2_i=PostingsFormat(name=LuceneFixedGap), foo_ls_dv=PostingsFormat(name=LuceneFixedGap), small2_is=Lucene84, foo_ds=PostingsFormat(name=Direct), foo_fs=Lucene84, foo_d_dv=Lucene84, score_f_dv=PostingsFormat(name=Direct), foo_d=PostingsFormat(name=LuceneFixedGap), score_d_dv=Lucene84, small2_ss=PostingsFormat(name=Direct), foo_f=PostingsFormat(name=LuceneVarGapFixedInterval), foo_l_dv=Lucene84, foo_ls=PostingsFormat(name=Direct)}, docValues:{small2_s_dv=DocValuesFormat(name=Lucene80), score_f_p=DocValuesFormat(name=Lucene80), id_dv=DocValuesFormat(name=Lucene80), score_d_p=DocValuesFormat(name=Direct), small2_is_p=DocValuesFormat(name=Lucene80), small3_is_dv=DocValuesFormat(name=Direct), foo_ds_dv=DocValuesFormat(name=Asserting), foo_f_dv=DocValuesFormat(name=Direct), foo_ds_p=DocValuesFormat(name=Lucene80), foo_l_p=DocValuesFormat(name=Direct), foo_i_p=DocValuesFormat(name=Asserting), small2_i_dv=DocValuesFormat(name=Direct), small4_ss_dv=DocValuesFormat(name=Asserting), small_s_dv=DocValuesFormat(name=Lucene80), foo_i_dv=DocValuesFormat(name=Lucene80), small2_ss_dv=DocValuesFormat(name=Asserting), foo_fs_dv=DocValuesFormat(name=Lucene80), small2_is_dv=DocValuesFormat(name=Lucene80), small_i_p=DocValuesFormat(name=Lucene80), small2_i_p=DocValuesFormat(name=Lucene80), small_i_dv=DocValuesFormat(name=Direct), small3_is_p=DocValuesFormat(name=Lucene80), foo_ls_dv=DocValuesFormat(name=Asserting), foo_f_p=DocValuesFormat(name=Lucene80), foo_ls_p=DocValuesFormat(name=Lucene80), foo_d_p=DocValuesFormat(name=Direct), foo_fs_p=DocValuesFormat(name=Asserting), score_f_dv=DocValuesFormat(name=Direct), foo_d_dv=DocValuesFormat(name=Lucene80), score_d_dv=DocValuesFormat(name=Lucene80), foo_l_dv=DocValuesFormat(name=Lucene80), small3_ss_dv=DocValuesFormat(name=Lucene80)}, maxPointsInLeafNode=764, maxMBSortInHeap=7.039423455454549, sim=Asserting(RandomSimilarity(queryNorm=false): {}), locale=ar-TD, timezone=Asia/Kathmandu
   [junit4]   2> NOTE: Linux 5.4.0-52-generic amd64/AdoptOpenJDK 12.0.2 (64-bit)/cpus=16,threads=1,free=161486208,total=314572800
   [junit4]   2> NOTE: All tests run in this JVM: [TestRandomDVFaceting]
   [junit4] Completed [5/5 (5!)] on J1 in 38.10s, 1 test, 1 failure <<< FAILURES!
   [junit4] 
   [junit4] 
   [junit4] Tests with failures [seed: 617FEADC4EFE4241]:
   [junit4]   - org.apache.solr.TestRandomDVFaceting.testRandomFaceting
   [junit4]   - org.apache.solr.TestRandomDVFaceting.testRandomFaceting
   [junit4]   - org.apache.solr.TestRandomDVFaceting.testRandomFaceting
   [junit4]   - org.apache.solr.TestRandomDVFaceting.testRandomFaceting
   [junit4]   - org.apache.solr.TestRandomDVFaceting.testRandomFaceting
   [junit4] 
   [junit4] 
   [junit4] JVM J0:     0.68 ..    39.70 =    39.02s
   [junit4] JVM J1:     0.69 ..    39.92 =    39.23s
   [junit4] JVM J2:     0.69 ..    39.47 =    38.78s
   [junit4] JVM J3:     0.69 ..    39.54 =    38.85s
   [junit4] JVM J4:     0.69 ..    39.80 =    39.11s
   [junit4] Execution time total: 39 seconds
   [junit4] Tests summary: 5 suites, 5 tests, 5 failures

BUILD FAILED
/home/jenkins/workspace/Lucene-Solr-8.x-Linux/lucene/common-build.xml:1599: The following error occurred while executing this line:
/home/jenkins/workspace/Lucene-Solr-8.x-Linux/lucene/common-build.xml:1126: There were test failures: 5 suites, 5 tests, 5 failures [seed: 617FEADC4EFE4241]

Total time: 40 seconds

[repro] Setting last failure code to 256

[repro] Failures w/original seeds:
[repro]   5/5 failed: org.apache.solr.TestRandomDVFaceting
[repro] Exiting with code 256
+ mv lucene/build lucene/build.repro
+ mv solr/build solr/build.repro
+ mv lucene/build.orig lucene/build
+ mv solr/build.orig solr/build
Setting ANT_1_8_2_HOME=/home/jenkins/tools/hudson.tasks.Ant_AntInstallation/ANT_1.8.2
Archiving artifacts
[Java] Sleeping for 5 seconds due to JENKINS-32191...
[Java] Parsing console log (workspace: '/home/jenkins/workspace/Lucene-Solr-8.x-Linux')
[Java] Successfully parsed console log
[Java] -> found 112 issues (skipped 103 duplicates)
[Java] Post processing issues on 'Master' with source code encoding 'UTF-8'
[Java] Creating SCM blamer to obtain author and commit information for affected files
[Java] Creating SCM miner to obtain statistics for affected repository files
[Java] Resolving file names for all issues in source directory '/home/jenkins/workspace/Lucene-Solr-8.x-Linux'
[Java] -> resolved paths in source directory (53 found, 0 not found)
[Java] Resolving module names from module definitions (build.xml, pom.xml, or Manifest.mf files)
[Java] -> resolved module names for 112 issues
[Java] Resolving package names (or namespaces) by parsing the affected files
[Java] -> resolved package names of 53 affected files
[Java] No filter has been set, publishing all 112 issues
[Java] Creating fingerprints for all affected code blocks to track issues over different builds
[Java] -> created fingerprints for 112 issues (skipped 0 issues)
[Java] Copying affected files to Jenkins' build folder '/home/jenkins/jobs/Lucene-Solr-8.x-Linux/builds/4953/files-with-issues'
[Java] -> 53 copied, 0 not in workspace, 0 not-found, 0 with I/O error
[Java] Using reference build 'Lucene-Solr-8.x-Linux #4952' to compute new, fixed, and outstanding issues
[Java] Issues delta (vs. reference build): outstanding: 112, new: 0, fixed: 0
[Java] No quality gates have been set - skipping
[Java] Health report is disabled - skipping
[Java] Created analysis result for 112 issues (found 0 new issues, fixed 0 issues)
[Java] Attaching ResultAction with ID 'java' to run 'Lucene-Solr-8.x-Linux #4953'.
[Checks API] No suitable checks publisher found.
Setting ANT_1_8_2_HOME=/home/jenkins/tools/hudson.tasks.Ant_AntInstallation/ANT_1.8.2
Recording test results
Setting ANT_1_8_2_HOME=/home/jenkins/tools/hudson.tasks.Ant_AntInstallation/ANT_1.8.2
[Checks API] No suitable checks publisher found.
Build step 'Publish JUnit test result report' changed build result to UNSTABLE
Email was triggered for: Unstable (Test Failures)
Sending email for trigger: Unstable (Test Failures)
Setting ANT_1_8_2_HOME=/home/jenkins/tools/hudson.tasks.Ant_AntInstallation/ANT_1.8.2
Setting ANT_1_8_2_HOME=/home/jenkins/tools/hudson.tasks.Ant_AntInstallation/ANT_1.8.2
Setting ANT_1_8_2_HOME=/home/jenkins/tools/hudson.tasks.Ant_AntInstallation/ANT_1.8.2
Setting ANT_1_8_2_HOME=/home/jenkins/tools/hudson.tasks.Ant_AntInstallation/ANT_1.8.2
Setting ANT_1_8_2_HOME=/home/jenkins/tools/hudson.tasks.Ant_AntInstallation/ANT_1.8.2
Setting ANT_1_8_2_HOME=/home/jenkins/tools/hudson.tasks.Ant_AntInstallation/ANT_1.8.2

Mime
View raw message