lucene-builds mailing list archives

Site index · List index
Message view « Date » · « Thread »
Top « Date » · « Thread »
From Policeman Jenkins Server <jenk...@thetaphi.de>
Subject [JENKINS] Lucene-Solr-master-Linux (64bit/jdk-11.0.6) - Build # 28578 - Unstable!
Date Mon, 09 Nov 2020 18:12:52 GMT
Build: https://jenkins.thetaphi.de/job/Lucene-Solr-master-Linux/28578/
Java: 64bit/jdk-11.0.6 -XX:+UseCompressedOops -XX:+UseSerialGC

1 tests failed.
FAILED:  org.apache.solr.TestRandomDVFaceting.testRandomFaceting

Error Message:
java.lang.AssertionError: mismatch: 'h'!='i' @ facet_counts/facet_fields/small2_s/[4]

Stack Trace:
java.lang.AssertionError: mismatch: 'h'!='i' @ facet_counts/facet_fields/small2_s/[4]
	at __randomizedtesting.SeedInfo.seed([B5B1388600FFF27D:B8D9185355063AC2]:0)
	at org.junit.Assert.fail(Assert.java:89)
	at org.apache.solr.TestRandomDVFaceting.doFacetTests(TestRandomDVFaceting.java:292)
	at org.apache.solr.TestRandomDVFaceting.doFacetTests(TestRandomDVFaceting.java:175)
	at org.apache.solr.TestRandomDVFaceting.testRandomFaceting(TestRandomDVFaceting.java:158)
	at java.base/jdk.internal.reflect.NativeMethodAccessorImpl.invoke0(Native Method)
	at java.base/jdk.internal.reflect.NativeMethodAccessorImpl.invoke(NativeMethodAccessorImpl.java:62)
	at java.base/jdk.internal.reflect.DelegatingMethodAccessorImpl.invoke(DelegatingMethodAccessorImpl.java:43)
	at java.base/java.lang.reflect.Method.invoke(Method.java:566)
	at com.carrotsearch.randomizedtesting.RandomizedRunner.invoke(RandomizedRunner.java:1754)
	at com.carrotsearch.randomizedtesting.RandomizedRunner$8.evaluate(RandomizedRunner.java:942)
	at com.carrotsearch.randomizedtesting.RandomizedRunner$9.evaluate(RandomizedRunner.java:978)
	at com.carrotsearch.randomizedtesting.RandomizedRunner$10.evaluate(RandomizedRunner.java:992)
	at com.carrotsearch.randomizedtesting.rules.SystemPropertiesRestoreRule$1.evaluate(SystemPropertiesRestoreRule.java:57)
	at org.junit.rules.RunRules.evaluate(RunRules.java:20)
	at org.apache.lucene.util.TestRuleSetupTeardownChained$1.evaluate(TestRuleSetupTeardownChained.java:49)
	at org.apache.lucene.util.AbstractBeforeAfterRule$1.evaluate(AbstractBeforeAfterRule.java:45)
	at org.apache.lucene.util.TestRuleThreadAndTestName$1.evaluate(TestRuleThreadAndTestName.java:48)
	at org.apache.lucene.util.TestRuleIgnoreAfterMaxFailures$1.evaluate(TestRuleIgnoreAfterMaxFailures.java:64)
	at org.apache.lucene.util.TestRuleMarkFailure$1.evaluate(TestRuleMarkFailure.java:47)
	at org.junit.rules.RunRules.evaluate(RunRules.java:20)
	at com.carrotsearch.randomizedtesting.rules.StatementAdapter.evaluate(StatementAdapter.java:36)
	at com.carrotsearch.randomizedtesting.ThreadLeakControl$StatementRunner.run(ThreadLeakControl.java:370)
	at com.carrotsearch.randomizedtesting.ThreadLeakControl.forkTimeoutingTask(ThreadLeakControl.java:819)
	at com.carrotsearch.randomizedtesting.ThreadLeakControl$3.evaluate(ThreadLeakControl.java:470)
	at com.carrotsearch.randomizedtesting.RandomizedRunner.runSingleTest(RandomizedRunner.java:951)
	at com.carrotsearch.randomizedtesting.RandomizedRunner$5.evaluate(RandomizedRunner.java:836)
	at com.carrotsearch.randomizedtesting.RandomizedRunner$6.evaluate(RandomizedRunner.java:887)
	at com.carrotsearch.randomizedtesting.RandomizedRunner$7.evaluate(RandomizedRunner.java:898)
	at com.carrotsearch.randomizedtesting.rules.StatementAdapter.evaluate(StatementAdapter.java:36)
	at com.carrotsearch.randomizedtesting.rules.SystemPropertiesRestoreRule$1.evaluate(SystemPropertiesRestoreRule.java:57)
	at org.junit.rules.RunRules.evaluate(RunRules.java:20)
	at org.apache.lucene.util.AbstractBeforeAfterRule$1.evaluate(AbstractBeforeAfterRule.java:45)
	at com.carrotsearch.randomizedtesting.rules.StatementAdapter.evaluate(StatementAdapter.java:36)
	at org.apache.lucene.util.TestRuleStoreClassName$1.evaluate(TestRuleStoreClassName.java:41)
	at com.carrotsearch.randomizedtesting.rules.NoShadowingOrOverridesOnMethodsRule$1.evaluate(NoShadowingOrOverridesOnMethodsRule.java:40)
	at com.carrotsearch.randomizedtesting.rules.NoShadowingOrOverridesOnMethodsRule$1.evaluate(NoShadowingOrOverridesOnMethodsRule.java:40)
	at com.carrotsearch.randomizedtesting.rules.StatementAdapter.evaluate(StatementAdapter.java:36)
	at com.carrotsearch.randomizedtesting.rules.StatementAdapter.evaluate(StatementAdapter.java:36)
	at org.apache.lucene.util.TestRuleAssertionsRequired$1.evaluate(TestRuleAssertionsRequired.java:53)
	at org.apache.lucene.util.TestRuleMarkFailure$1.evaluate(TestRuleMarkFailure.java:47)
	at org.apache.lucene.util.TestRuleIgnoreAfterMaxFailures$1.evaluate(TestRuleIgnoreAfterMaxFailures.java:64)
	at org.apache.lucene.util.TestRuleIgnoreTestSuites$1.evaluate(TestRuleIgnoreTestSuites.java:54)
	at org.junit.rules.RunRules.evaluate(RunRules.java:20)
	at com.carrotsearch.randomizedtesting.rules.StatementAdapter.evaluate(StatementAdapter.java:36)
	at com.carrotsearch.randomizedtesting.ThreadLeakControl$StatementRunner.run(ThreadLeakControl.java:370)
	at com.carrotsearch.randomizedtesting.ThreadLeakControl.lambda$forkTimeoutingTask$0(ThreadLeakControl.java:826)
	at java.base/java.lang.Thread.run(Thread.java:834)




Build Log:
[...truncated 2883 lines...]
  2> 86494 ERROR (TEST-TestRandomDVFaceting.testRandomFaceting-seed#[B5B1388600FFF27D])
[     ] o.a.s.TestRandomDVFaceting ERROR: mismatch facet response: mismatch: 'h'!='i' @ facet_counts/facet_fields/small2_s/[4]
  2>  expected ={
  2>   "response":{"numFound":18,"start":0,"numFoundExact":true,"docs":[]
  2>   },
  2>   "facet_counts":{
  2>     "facet_queries":{},
  2>     "facet_fields":{
  2>       "small2_s":[
  2>         "o",2,
  2>         "",2,
  2>         "h",1,
  2>         "t",1,
  2>         "u",1]},
  2>     "facet_ranges":{},
  2>     "facet_intervals":{},
  2>     "facet_heatmaps":{}}}
  2> 
  2>  response = {
  2>   "response":{"numFound":18,"start":0,"numFoundExact":true,"docs":[]
  2>   },
  2>   "facet_counts":{
  2>     "facet_queries":{},
  2>     "facet_fields":{
  2>       "small2_s":[
  2>         "o",2,
  2>         "",2,
  2>         "i",1,
  2>         "t",1,
  2>         "}",1]},
  2>     "facet_ranges":{},
  2>     "facet_intervals":{},
  2>     "facet_heatmaps":{}}}
  2> 
  2>  request = facet=true&wt=json&indent=true&omitHeader=true&q=*:*&rows=0&facet.sort=count&facet.field=small2_s&facet.method=uif
  2> 86496 INFO  (TEST-TestRandomDVFaceting.testRandomFaceting-seed#[B5B1388600FFF27D])
[     ] o.a.s.SolrTestCaseJ4 ###Ending testRandomFaceting
   >     java.lang.AssertionError: mismatch: 'h'!='i' @ facet_counts/facet_fields/small2_s/[4]
   >         at __randomizedtesting.SeedInfo.seed([B5B1388600FFF27D:B8D9185355063AC2]:0)
   >         at org.junit.Assert.fail(Assert.java:89)
   >         at org.apache.solr.TestRandomDVFaceting.doFacetTests(TestRandomDVFaceting.java:292)
   >         at org.apache.solr.TestRandomDVFaceting.doFacetTests(TestRandomDVFaceting.java:175)
   >         at org.apache.solr.TestRandomDVFaceting.testRandomFaceting(TestRandomDVFaceting.java:158)
   >         at java.base/jdk.internal.reflect.NativeMethodAccessorImpl.invoke0(Native
Method)
   >         at java.base/jdk.internal.reflect.NativeMethodAccessorImpl.invoke(NativeMethodAccessorImpl.java:62)
   >         at java.base/jdk.internal.reflect.DelegatingMethodAccessorImpl.invoke(DelegatingMethodAccessorImpl.java:43)
   >         at java.base/java.lang.reflect.Method.invoke(Method.java:566)
   >         at com.carrotsearch.randomizedtesting.RandomizedRunner.invoke(RandomizedRunner.java:1754)
   >         at com.carrotsearch.randomizedtesting.RandomizedRunner$8.evaluate(RandomizedRunner.java:942)
   >         at com.carrotsearch.randomizedtesting.RandomizedRunner$9.evaluate(RandomizedRunner.java:978)
   >         at com.carrotsearch.randomizedtesting.RandomizedRunner$10.evaluate(RandomizedRunner.java:992)
   >         at com.carrotsearch.randomizedtesting.rules.SystemPropertiesRestoreRule$1.evaluate(SystemPropertiesRestoreRule.java:57)
   >         at org.junit.rules.RunRules.evaluate(RunRules.java:20)
   >         at org.apache.lucene.util.TestRuleSetupTeardownChained$1.evaluate(TestRuleSetupTeardownChained.java:49)
   >         at org.apache.lucene.util.AbstractBeforeAfterRule$1.evaluate(AbstractBeforeAfterRule.java:45)
   >         at org.apache.lucene.util.TestRuleThreadAndTestName$1.evaluate(TestRuleThreadAndTestName.java:48)
   >         at org.apache.lucene.util.TestRuleIgnoreAfterMaxFailures$1.evaluate(TestRuleIgnoreAfterMaxFailures.java:64)
   >         at org.apache.lucene.util.TestRuleMarkFailure$1.evaluate(TestRuleMarkFailure.java:47)
   >         at org.junit.rules.RunRules.evaluate(RunRules.java:20)
   >         at com.carrotsearch.randomizedtesting.rules.StatementAdapter.evaluate(StatementAdapter.java:36)
   >         at com.carrotsearch.randomizedtesting.ThreadLeakControl$StatementRunner.run(ThreadLeakControl.java:370)
   >         at com.carrotsearch.randomizedtesting.ThreadLeakControl.forkTimeoutingTask(ThreadLeakControl.java:819)
   >         at com.carrotsearch.randomizedtesting.ThreadLeakControl$3.evaluate(ThreadLeakControl.java:470)
   >         at com.carrotsearch.randomizedtesting.RandomizedRunner.runSingleTest(RandomizedRunner.java:951)
   >         at com.carrotsearch.randomizedtesting.RandomizedRunner$5.evaluate(RandomizedRunner.java:836)
   >         at com.carrotsearch.randomizedtesting.RandomizedRunner$6.evaluate(RandomizedRunner.java:887)
   >         at com.carrotsearch.randomizedtesting.RandomizedRunner$7.evaluate(RandomizedRunner.java:898)
   >         at com.carrotsearch.randomizedtesting.rules.StatementAdapter.evaluate(StatementAdapter.java:36)
   >         at com.carrotsearch.randomizedtesting.rules.SystemPropertiesRestoreRule$1.evaluate(SystemPropertiesRestoreRule.java:57)
   >         at org.junit.rules.RunRules.evaluate(RunRules.java:20)
   >         at org.apache.lucene.util.AbstractBeforeAfterRule$1.evaluate(AbstractBeforeAfterRule.java:45)
   >         at com.carrotsearch.randomizedtesting.rules.StatementAdapter.evaluate(StatementAdapter.java:36)
   >         at org.apache.lucene.util.TestRuleStoreClassName$1.evaluate(TestRuleStoreClassName.java:41)
   >         at com.carrotsearch.randomizedtesting.rules.NoShadowingOrOverridesOnMethodsRule$1.evaluate(NoShadowingOrOverridesOnMethodsRule.java:40)
   >         at com.carrotsearch.randomizedtesting.rules.NoShadowingOrOverridesOnMethodsRule$1.evaluate(NoShadowingOrOverridesOnMethodsRule.java:40)
   >         at com.carrotsearch.randomizedtesting.rules.StatementAdapter.evaluate(StatementAdapter.java:36)
   >         at com.carrotsearch.randomizedtesting.rules.StatementAdapter.evaluate(StatementAdapter.java:36)
   >         at org.apache.lucene.util.TestRuleAssertionsRequired$1.evaluate(TestRuleAssertionsRequired.java:53)
   >         at org.apache.lucene.util.TestRuleMarkFailure$1.evaluate(TestRuleMarkFailure.java:47)
   >         at org.apache.lucene.util.TestRuleIgnoreAfterMaxFailures$1.evaluate(TestRuleIgnoreAfterMaxFailures.java:64)
   >         at org.apache.lucene.util.TestRuleIgnoreTestSuites$1.evaluate(TestRuleIgnoreTestSuites.java:54)
   >         at org.junit.rules.RunRules.evaluate(RunRules.java:20)
   >         at com.carrotsearch.randomizedtesting.rules.StatementAdapter.evaluate(StatementAdapter.java:36)
   >         at com.carrotsearch.randomizedtesting.ThreadLeakControl$StatementRunner.run(ThreadLeakControl.java:370)
   >         at com.carrotsearch.randomizedtesting.ThreadLeakControl.lambda$forkTimeoutingTask$0(ThreadLeakControl.java:826)
   >         at java.base/java.lang.Thread.run(Thread.java:834)
  2> NOTE: reproduce with: gradlew test --tests TestRandomDVFaceting.testRandomFaceting
-Dtests.seed=B5B1388600FFF27D -Dtests.multiplier=3 -Dtests.slow=true -Dtests.locale=sv-AX
-Dtests.timezone=Pacific/Yap -Dtests.asserts=true -Dtests.file.encoding=UTF-8
  2> 86510 INFO  (SUITE-TestRandomDVFaceting-seed#[B5B1388600FFF27D]-worker) [     ] o.a.s.SolrTestCaseJ4
###deleteCore
  2> 86510 INFO  (SUITE-TestRandomDVFaceting-seed#[B5B1388600FFF27D]-worker) [     ] o.a.s.c.CoreContainer
Shutting down CoreContainer instance=169095002
  2> 86524 INFO  (coreCloseExecutor-1191-thread-1) [     ] o.a.s.c.SolrCore [collection1]
 CLOSING SolrCore org.apache.solr.core.SolrCore@64221f08
  2> 86524 INFO  (coreCloseExecutor-1191-thread-1) [     ] o.a.s.m.SolrMetricManager Closing
metric reporters for registry=solr.core.collection1 tag=SolrCore@64221f08
  2> 86524 INFO  (coreCloseExecutor-1191-thread-1) [     ] o.a.s.m.r.SolrJmxReporter Closing
reporter [org.apache.solr.metrics.reporters.SolrJmxReporter@60de4978: rootName = null, domain
= solr.core.collection1, service url = null, agent id = null] for registry solr.core.collection1/com.codahale.metrics.MetricRegistry@631bdeb3
  2> 86548 INFO  (coreCloseExecutor-1191-thread-1) [     ] o.a.s.u.DirectUpdateHandler2
Committing on IndexWriter.close()  ... SKIPPED (unnecessary).
  2> 86571 INFO  (SUITE-TestRandomDVFaceting-seed#[B5B1388600FFF27D]-worker) [     ] o.a.s.m.SolrMetricManager
Closing metric reporters for registry=solr.node tag=null
  2> 86571 INFO  (SUITE-TestRandomDVFaceting-seed#[B5B1388600FFF27D]-worker) [     ] o.a.s.m.r.SolrJmxReporter
Closing reporter [org.apache.solr.metrics.reporters.SolrJmxReporter@6d530a8d: rootName = null,
domain = solr.node, service url = null, agent id = null] for registry solr.node/com.codahale.metrics.MetricRegistry@3f192e25
  2> 86576 INFO  (SUITE-TestRandomDVFaceting-seed#[B5B1388600FFF27D]-worker) [     ] o.a.s.m.SolrMetricManager
Closing metric reporters for registry=solr.jvm tag=null
  2> 86576 INFO  (SUITE-TestRandomDVFaceting-seed#[B5B1388600FFF27D]-worker) [     ] o.a.s.m.r.SolrJmxReporter
Closing reporter [org.apache.solr.metrics.reporters.SolrJmxReporter@5fac1b8a: rootName = null,
domain = solr.jvm, service url = null, agent id = null] for registry solr.jvm/com.codahale.metrics.MetricRegistry@9b9a8e9
  2> 86578 INFO  (SUITE-TestRandomDVFaceting-seed#[B5B1388600FFF27D]-worker) [     ] o.a.s.m.SolrMetricManager
Closing metric reporters for registry=solr.jetty tag=null
  2> 86579 INFO  (SUITE-TestRandomDVFaceting-seed#[B5B1388600FFF27D]-worker) [     ] o.a.s.m.r.SolrJmxReporter
Closing reporter [org.apache.solr.metrics.reporters.SolrJmxReporter@73232202: rootName = null,
domain = solr.jetty, service url = null, agent id = null] for registry solr.jetty/com.codahale.metrics.MetricRegistry@136296ff
  2> NOTE: leaving temporary files on disk at: /home/jenkins/workspace/Lucene-Solr-master-Linux/solr/core/build/tmp/tests-tmp/solr.TestRandomDVFaceting_B5B1388600FFF27D-001
  2> NOTE: test params are: codec=Asserting(Lucene90): {small3_ss=PostingsFormat(name=LuceneVarGapFixedInterval),
foo_ds_dv=FST50, foo_f_dv=PostingsFormat(name=MockRandom), small_i=FST50, small3_is=FST50,
small_s=PostingsFormat(name=LuceneVarGapFixedInterval), score_f=FST50, score_d=PostingsFormat(name=LuceneVarGapFixedInterval),
id=PostingsFormat(name=LuceneVarGapFixedInterval), foo_i=PostingsFormat(name=MockRandom),
foo_fs_dv=PostingsFormat(name=LuceneVarGapFixedInterval), foo_l=PostingsFormat(name=LuceneVarGapFixedInterval),
small4_ss=PostingsFormat(name=MockRandom), small2_s=PostingsFormat(name=LuceneVarGapFixedInterval),
small2_i=FST50, foo_ls_dv=FST50, small2_is=PostingsFormat(name=MockRandom), foo_ds=Lucene84,
foo_fs=PostingsFormat(name=MockRandom), foo_d_dv=Lucene84, score_f_dv=PostingsFormat(name=MockRandom),
foo_d=PostingsFormat(name=LuceneVarGapFixedInterval), score_d_dv=Lucene84, small2_ss=Lucene84,
foo_f=FST50, foo_l_dv=Lucene84, foo_ls=Lucene84}, docValues:{small2_s_dv=DocValuesFormat(name=Lucene80),
score_f_p=DocValuesFormat(name=Lucene80), id_dv=DocValuesFormat(name=Lucene80), score_d_p=DocValuesFormat(name=Lucene80),
small2_is_p=DocValuesFormat(name=Asserting), small3_is_dv=DocValuesFormat(name=Lucene80),
foo_ds_dv=DocValuesFormat(name=Asserting), foo_f_dv=DocValuesFormat(name=Lucene80), foo_ds_p=DocValuesFormat(name=Asserting),
foo_l_p=DocValuesFormat(name=Lucene80), foo_i_p=DocValuesFormat(name=Asserting), small2_i_dv=DocValuesFormat(name=Lucene80),
small4_ss_dv=DocValuesFormat(name=Asserting), small_s_dv=DocValuesFormat(name=Lucene80), foo_i_dv=DocValuesFormat(name=Asserting),
small2_ss_dv=DocValuesFormat(name=Asserting), foo_fs_dv=DocValuesFormat(name=Asserting), small2_is_dv=DocValuesFormat(name=Asserting),
small_i_p=DocValuesFormat(name=Lucene80), small2_i_p=DocValuesFormat(name=Lucene80), small_i_dv=DocValuesFormat(name=Lucene80),
small3_is_p=DocValuesFormat(name=Lucene80), foo_ls_dv=DocValuesFormat(name=Asserting), foo_f_p=DocValuesFormat(name=Lucene80),
foo_ls_p=DocValuesFormat(name=Asserting), foo_d_p=DocValuesFormat(name=Lucene80), foo_fs_p=DocValuesFormat(name=Asserting),
score_f_dv=DocValuesFormat(name=Lucene80), foo_d_dv=DocValuesFormat(name=Lucene80), score_d_dv=DocValuesFormat(name=Lucene80),
foo_l_dv=DocValuesFormat(name=Lucene80), small3_ss_dv=DocValuesFormat(name=Lucene80)}, maxPointsInLeafNode=502,
maxMBSortInHeap=6.347361632829282, sim=Asserting(RandomSimilarity(queryNorm=true): {}), locale=sv-AX,
timezone=Pacific/Yap
  2> NOTE: Linux 5.4.0-52-generic amd64/AdoptOpenJDK 11.0.6 (64-bit)/cpus=16,threads=1,free=109337952,total=259784704
  2> NOTE: All tests run in this JVM: [TestGroupingSearch, TestMultiValuedNumericRangeQuery,
ConjunctionSolrSpellCheckerTest, SpellingQueryConverterTest, TestHighFrequencyDictionaryFactory,
TestFreeTextSuggestions, TestDynamicFieldCollectionResource, TestFieldCollectionResource,
TestFieldTypeCollectionResource, SolrPluginUtilsTest, TestSolrJacksonAnnotation, TestHttpServletCarrier,
HLLUtilTest, PrimUtilsTest, TimeZoneUtilsTest, UtilsToolTest, DistributedQueryComponentCustomSortTest,
DistributedFacetExistsSmallTest, DistributedMLTComponentTest, TermsComponentTest, DistributedExpandComponentTest,
TestPivotHelperCode, InfixSuggestersTest, TestReqParamsAPI, TestSQLHandlerNonCloud, XmlInterpolationTest,
DocumentAnalysisRequestHandlerTest, JavabinLoaderTest, TestConfigsApi, CoreAdminRequestStatusTest,
MetricsHistoryHandlerTest, SegmentsInfoRequestHandlerTest, InfoHandlerTest, TestSystemCollAutoCreate,
TestRandomDVFaceting]

WARNING: Test org.apache.solr.TestDistributedSearch wrote 27,829,544 bytes of output.
WARNING: Test org.apache.solr.client.solrj.impl.ConnectionReuseTest wrote 17,568,049 bytes
of output.
WARNING: Test org.apache.solr.TestRandomFaceting wrote 27,632,589 bytes of output.
WARNING: Test org.apache.solr.update.TestInPlaceUpdatesStandalone wrote 47,686,525 bytes of
output.
WARNING: Test org.apache.solr.schema.DocValuesTest wrote 11,333,318 bytes of output.
WARNING: Test org.apache.solr.schema.TestCloudSchemaless wrote 11,618,968 bytes of output.
WARNING: Test org.apache.solr.schema.TestBulkSchemaConcurrent wrote 208,991,279 bytes of output.
WARNING: Test org.apache.solr.cloud.ChaosMonkeySafeLeaderWithPullReplicasTest wrote 15,688,907
bytes of output.
WARNING: Test org.apache.solr.cloud.SplitShardTest wrote 12,773,324 bytes of output.
WARNING: Test org.apache.solr.cloud.TestStressCloudBlindAtomicUpdates wrote 45,692,100 bytes
of output.
WARNING: Test org.apache.solr.search.facet.TestCloudJSONFacetSKGEquiv wrote 20,758,741 bytes
of output.
WARNING: Test org.apache.solr.cloud.TestRandomFlRTGCloud wrote 29,135,848 bytes of output.
WARNING: Test org.apache.solr.search.TestRandomCollapseQParserPlugin wrote 25,631,187 bytes
of output.
WARNING: Test org.apache.solr.search.TestRangeQuery wrote 27,551,973 bytes of output.
WARNING: Test org.apache.solr.search.facet.TestJsonFacets wrote 28,975,563 bytes of output.
WARNING: Test org.apache.solr.search.facet.TestCloudJSONFacetJoinDomain wrote 22,888,725 bytes
of output.
WARNING: Test org.apache.solr.cloud.ChaosMonkeyNothingIsSafeTest wrote 15,775,068 bytes of
output.
WARNING: Test org.apache.solr.search.facet.TestCloudJSONFacetSKG wrote 22,052,385 bytes of
output.
WARNING: Test org.apache.solr.request.TestIntervalFaceting wrote 24,572,300 bytes of output.
:solr:core:test (FAILURE): 4587 test(s), 1 failure(s), 209 skipped

4587 tests completed, 1 failed, 209 skipped
There were failing tests. See the results at: file:///home/jenkins/workspace/Lucene-Solr-master-Linux/solr/core/build/test-results/test/

> Task :solr:server:test NO-SOURCE
> Task :solr:solr-ref-guide:test NO-SOURCE
> Task :solr:solrj:test
:solr:solrj:test (SUCCESS): 1667 test(s), 19 skipped

> Task :solr:test-framework:test
:solr:test-framework:test (SUCCESS): 9 test(s)

> Task :solr:webapp:test NO-SOURCE

> Task :lucene:analysis:common:test
:lucene:analysis:common:test (SUCCESS): 1628 test(s), 9 skipped

> Task :lucene:analysis:icu:test
:lucene:analysis:icu:test (SUCCESS): 149 test(s), 11 skipped

> Task :lucene:analysis:kuromoji:test
:lucene:analysis:kuromoji:test (SUCCESS): 160 test(s), 7 skipped

> Task :lucene:analysis:morfologik:test
:lucene:analysis:morfologik:test (SUCCESS): 18 test(s)

> Task :lucene:analysis:nori:test
:lucene:analysis:nori:test (SUCCESS): 69 test(s), 4 skipped

> Task :lucene:analysis:opennlp:test
:lucene:analysis:opennlp:test (SUCCESS): 26 test(s)

> Task :lucene:analysis:phonetic:test
:lucene:analysis:phonetic:test (SUCCESS): 41 test(s)

> Task :lucene:analysis:smartcn:test
:lucene:analysis:smartcn:test (SUCCESS): 21 test(s)

> Task :lucene:analysis:stempel:test
:lucene:analysis:stempel:test (SUCCESS): 15 test(s)

> Task :solr:contrib:analysis-extras:test
:solr:contrib:analysis-extras:test (SUCCESS): 30 test(s)

> Task :solr:contrib:analytics:test
:solr:contrib:analytics:test (SUCCESS): 472 test(s)

> Task :solr:contrib:clustering:test
:solr:contrib:clustering:test (SUCCESS): 15 test(s)

> Task :solr:contrib:extraction:test
:solr:contrib:extraction:test (SUCCESS): 20 test(s)

> Task :solr:contrib:jaegertracer-configurator:test
:solr:contrib:jaegertracer-configurator:test (SUCCESS): 3 test(s)

> Task :solr:contrib:langid:test
:solr:contrib:langid:test (SUCCESS): 43 test(s)

> Task :solr:contrib:ltr:test
:solr:contrib:ltr:test (SUCCESS): 127 test(s), 1 skipped

> Task :solr:contrib:prometheus-exporter:test
:solr:contrib:prometheus-exporter:test (SUCCESS): 17 test(s), 5 skipped

> Task :solr:contrib:prometheus-exporter:cleanTaskTmp
> Task :solr:contrib:ltr:cleanTaskTmp
> Task :solr:contrib:langid:cleanTaskTmp
> Task :solr:contrib:jaegertracer-configurator:cleanTaskTmp
> Task :solr:contrib:extraction:cleanTaskTmp
> Task :solr:contrib:clustering:cleanTaskTmp
> Task :solr:contrib:analytics:cleanTaskTmp
> Task :solr:contrib:analysis-extras:cleanTaskTmp
> Task :lucene:analysis:stempel:cleanTaskTmp
> Task :lucene:analysis:smartcn:cleanTaskTmp
> Task :lucene:analysis:phonetic:cleanTaskTmp
> Task :lucene:analysis:opennlp:cleanTaskTmp
> Task :lucene:analysis:nori:cleanTaskTmp
> Task :lucene:analysis:morfologik:cleanTaskTmp
> Task :lucene:analysis:kuromoji:cleanTaskTmp
> Task :lucene:analysis:icu:cleanTaskTmp
> Task :lucene:analysis:common:cleanTaskTmp
> Task :solr:webapp:cleanTaskTmp
> Task :solr:test-framework:cleanTaskTmp
> Task :solr:solrj:cleanTaskTmp
> Task :solr:solr-ref-guide:cleanTaskTmp
> Task :solr:server:cleanTaskTmp
> Task :solr:core:cleanTaskTmp
> Task :lucene:test-framework:cleanTaskTmp
> Task :lucene:suggest:cleanTaskTmp
> Task :lucene:spatial3d:cleanTaskTmp
> Task :lucene:spatial-extras:cleanTaskTmp
> Task :lucene:sandbox:cleanTaskTmp
> Task :lucene:replicator:cleanTaskTmp
> Task :lucene:queryparser:cleanTaskTmp
> Task :lucene:queries:cleanTaskTmp
> Task :lucene:monitor:cleanTaskTmp
> Task :lucene:misc:cleanTaskTmp
> Task :lucene:memory:cleanTaskTmp
> Task :lucene:luke:cleanTaskTmp
> Task :lucene:join:cleanTaskTmp
> Task :lucene:highlighter:cleanTaskTmp
> Task :lucene:grouping:cleanTaskTmp
> Task :lucene:facet:cleanTaskTmp
> Task :lucene:expressions:cleanTaskTmp
> Task :lucene:demo:cleanTaskTmp
> Task :lucene:core:cleanTaskTmp
> Task :lucene:codecs:cleanTaskTmp
> Task :lucene:classification:cleanTaskTmp
> Task :lucene:benchmark:cleanTaskTmp
> Task :cleanGradleTmp
> Task :lucene:backward-codecs:check
> Task :lucene:benchmark:check
> Task :lucene:classification:check
> Task :lucene:codecs:check
> Task :lucene:core:check
> Task :lucene:demo:check
> Task :lucene:core:renderSiteJavadoc
> Task :lucene:backward-codecs:renderSiteJavadoc
> Task :lucene:facet:renderSiteJavadoc
> Task :lucene:memory:renderSiteJavadoc
> Task :lucene:queries:renderSiteJavadoc
> Task :lucene:highlighter:renderSiteJavadoc
> Task :lucene:sandbox:renderSiteJavadoc
> Task :lucene:queryparser:renderSiteJavadoc
> Task :lucene:spatial3d:renderSiteJavadoc
> Task :lucene:spatial-extras:renderSiteJavadoc
> Task :lucene:analysis:common:renderSiteJavadoc
> Task :lucene:benchmark:renderSiteJavadoc
> Task :lucene:grouping:renderSiteJavadoc
> Task :lucene:classification:renderSiteJavadoc
> Task :lucene:codecs:renderSiteJavadoc
> Task :lucene:expressions:renderSiteJavadoc
> Task :lucene:demo:renderSiteJavadoc
> Task :lucene:documentation:changesToHtml
> Task :lucene:documentation:copyDocumentationAssets
> Task :lucene:documentation:markdownToHtml
> Task :lucene:documentation:createDocumentationIndex
> Task :lucene:join:renderSiteJavadoc
> Task :lucene:misc:renderSiteJavadoc
> Task :lucene:suggest:renderSiteJavadoc
> Task :lucene:analysis:icu:renderSiteJavadoc
> Task :lucene:analysis:kuromoji:renderSiteJavadoc
> Task :lucene:analysis:morfologik:renderSiteJavadoc
> Task :lucene:analysis:nori:renderSiteJavadoc
> Task :lucene:analysis:opennlp:renderSiteJavadoc
> Task :lucene:analysis:phonetic:renderSiteJavadoc
> Task :lucene:analysis:smartcn:renderSiteJavadoc
> Task :lucene:analysis:stempel:renderSiteJavadoc
> Task :lucene:luke:renderSiteJavadoc
> Task :lucene:monitor:renderSiteJavadoc
> Task :lucene:replicator:renderSiteJavadoc
> Task :lucene:test-framework:renderSiteJavadoc
> Task :lucene:documentation:documentation
> Task :lucene:documentation:checkBrokenLinks
> Task :lucene:documentation:check
> Task :lucene:expressions:check
> Task :lucene:facet:check
> Task :lucene:grouping:check
> Task :lucene:highlighter:check
> Task :lucene:join:check
> Task :lucene:luke:check
> Task :lucene:memory:check
> Task :lucene:misc:check
> Task :lucene:monitor:check
> Task :lucene:packaging:check
> Task :lucene:queries:check
> Task :lucene:queryparser:check
> Task :lucene:replicator:check
> Task :lucene:sandbox:check
> Task :lucene:spatial-extras:check
> Task :lucene:spatial3d:check
> Task :lucene:suggest:check
> Task :lucene:test-framework:check
> Task :solr:contrib:check
> Task :solr:core:check
> Task :solr:docker:check
> Task :solr:server:renderSiteJavadoc SKIPPED
> Task :solr:solrj:renderSiteJavadoc
> Task :solr:core:renderSiteJavadoc
> Task :solr:documentation:changesToHtml
> Task :solr:documentation:copyDocumentationAssets
> Task :solr:documentation:markdownToHtml
> Task :solr:documentation:createDocumentationIndex
> Task :solr:solr-ref-guide:renderSiteJavadoc SKIPPED
> Task :lucene:backward-codecs:renderJavadoc
> Task :lucene:backward-codecs:javadoc SKIPPED
> Task :lucene:facet:renderJavadoc
> Task :lucene:memory:renderJavadoc
> Task :lucene:queries:renderJavadoc
> Task :lucene:highlighter:renderJavadoc
> Task :lucene:sandbox:renderJavadoc
> Task :lucene:queryparser:renderJavadoc
> Task :lucene:spatial3d:renderJavadoc
> Task :lucene:spatial-extras:renderJavadoc
> Task :lucene:analysis:common:renderJavadoc
> Task :lucene:benchmark:renderJavadoc
> Task :lucene:benchmark:javadoc SKIPPED
> Task :lucene:grouping:renderJavadoc
> Task :lucene:classification:renderJavadoc
> Task :lucene:classification:javadoc SKIPPED
> Task :lucene:codecs:renderJavadoc
> Task :lucene:codecs:javadoc SKIPPED
> Task :lucene:core:javadoc SKIPPED
> Task :lucene:expressions:renderJavadoc
> Task :lucene:demo:renderJavadoc
> Task :lucene:demo:javadoc SKIPPED
> Task :lucene:expressions:javadoc SKIPPED
> Task :lucene:facet:javadoc SKIPPED
> Task :lucene:grouping:javadoc SKIPPED
> Task :lucene:highlighter:javadoc SKIPPED
> Task :lucene:join:renderJavadoc
> Task :lucene:join:javadoc SKIPPED
> Task :lucene:misc:renderJavadoc
> Task :lucene:suggest:renderJavadoc
> Task :lucene:analysis:icu:renderJavadoc
> Task :lucene:analysis:kuromoji:renderJavadoc
> Task :lucene:analysis:morfologik:renderJavadoc
> Task :lucene:analysis:nori:renderJavadoc
> Task :lucene:analysis:opennlp:renderJavadoc
> Task :lucene:analysis:phonetic:renderJavadoc
> Task :lucene:analysis:smartcn:renderJavadoc
> Task :lucene:analysis:stempel:renderJavadoc
> Task :lucene:luke:renderJavadoc
> Task :lucene:luke:javadoc SKIPPED
> Task :lucene:memory:javadoc SKIPPED
> Task :lucene:misc:javadoc SKIPPED
> Task :lucene:monitor:renderJavadoc
> Task :lucene:monitor:javadoc SKIPPED
> Task :lucene:queries:javadoc SKIPPED
> Task :lucene:queryparser:javadoc SKIPPED
> Task :lucene:replicator:renderJavadoc
> Task :lucene:replicator:javadoc SKIPPED
> Task :lucene:sandbox:javadoc SKIPPED
> Task :lucene:spatial-extras:javadoc SKIPPED
> Task :lucene:spatial3d:javadoc SKIPPED
> Task :lucene:suggest:javadoc SKIPPED
> Task :lucene:test-framework:renderJavadoc
> Task :lucene:test-framework:javadoc SKIPPED
> Task :solr:core:renderJavadoc
> Task :solr:core:javadoc SKIPPED
> Task :solr:test-framework:renderJavadoc
> Task :solr:test-framework:javadoc SKIPPED
> Task :solr:webapp:renderJavadoc SKIPPED
> Task :solr:webapp:javadoc SKIPPED
> Task :lucene:analysis:common:javadoc SKIPPED
> Task :lucene:analysis:icu:javadoc SKIPPED
> Task :lucene:analysis:kuromoji:javadoc SKIPPED
> Task :lucene:analysis:morfologik:javadoc SKIPPED
> Task :lucene:analysis:nori:javadoc SKIPPED
> Task :lucene:analysis:opennlp:javadoc SKIPPED
> Task :lucene:analysis:phonetic:javadoc SKIPPED
> Task :lucene:analysis:smartcn:javadoc SKIPPED
> Task :lucene:analysis:stempel:javadoc SKIPPED
> Task :solr:contrib:analysis-extras:renderJavadoc
> Task :solr:contrib:analysis-extras:javadoc SKIPPED
> Task :solr:contrib:analytics:renderJavadoc
> Task :solr:contrib:analytics:javadoc SKIPPED
> Task :solr:contrib:clustering:renderJavadoc
> Task :solr:contrib:clustering:javadoc SKIPPED
> Task :solr:contrib:extraction:renderJavadoc
> Task :solr:contrib:extraction:javadoc SKIPPED
> Task :solr:contrib:jaegertracer-configurator:renderJavadoc
> Task :solr:contrib:jaegertracer-configurator:javadoc SKIPPED
> Task :solr:contrib:langid:renderJavadoc
> Task :solr:contrib:langid:javadoc SKIPPED
> Task :solr:contrib:ltr:renderJavadoc
> Task :solr:contrib:ltr:javadoc SKIPPED
> Task :solr:contrib:prometheus-exporter:renderJavadoc
> Task :solr:contrib:prometheus-exporter:javadoc SKIPPED
> Task :precommit
> Task :check
> Task :solr:test-framework:renderSiteJavadoc
> Task :solr:webapp:renderSiteJavadoc SKIPPED
> Task :solr:contrib:analysis-extras:renderSiteJavadoc
> Task :solr:contrib:analytics:renderSiteJavadoc
> Task :solr:contrib:clustering:renderSiteJavadoc
> Task :solr:contrib:extraction:renderSiteJavadoc
> Task :solr:contrib:jaegertracer-configurator:renderSiteJavadoc
> Task :solr:contrib:langid:renderSiteJavadoc
> Task :solr:contrib:ltr:renderSiteJavadoc
> Task :solr:contrib:prometheus-exporter:renderSiteJavadoc
> Task :solr:documentation:documentation
> Task :solr:documentation:checkBrokenLinks
> Task :solr:documentation:check
> Task :solr:example:check
> Task :solr:packaging:check
> Task :solr:server:check
> Task :lucene:documentation:assemble
> Task :solr:documentation:copyChangesToHtmlForMiniSite
> Task :solr:documentation:copyMiniDocumentationAssets
> Task :solr:documentation:createMiniDocumentationIndex
> Task :solr:documentation:documentationMinimal
> Task :solr:documentation:assemble
> Task :documentation

> Task :solr:solr-ref-guide:jrubyPrepare
WARNING: An illegal reflective access operation has occurred
WARNING: Illegal reflective access by com.headius.backport9.modules.Modules (file:/home/jenkins/.gradle/caches/modules-2/files-2.1/org.jruby/jruby-complete/9.2.9.0/8e44ce7a1417966d89957bd766a148601e28828b/jruby-complete-9.2.9.0.jar)
to method sun.nio.ch.NativeThread.signal(long)
WARNING: Please consider reporting this to the maintainers of com.headius.backport9.modules.Modules
WARNING: Use --illegal-access=warn to enable warnings of further illegal reflective access
operations
WARNING: All illegal access operations will be denied in a future release
Successfully installed ffi-1.13.1-java
Successfully installed rb-inotify-0.10.1
Successfully installed rb-fsevent-0.10.4
Successfully installed sass-listen-4.0.0
Successfully installed forwardable-extended-2.6.0
Successfully installed listen-3.2.1

Ruby Sass has reached end-of-life and should no longer be used.

* If you use Sass as a command-line tool, we recommend using Dart Sass, the new
  primary implementation: https://sass-lang.com/install

* If you use Sass as a plug-in for a Ruby web framework, we recommend using the
  sassc gem: https://github.com/sass/sassc-ruby#readme

* For more details, please refer to the Sass blog:
  https://sass-lang.com/blog/posts/7828841

Successfully installed sass-3.7.4
Successfully installed public_suffix-4.0.6
Successfully installed temple-0.8.2
Successfully installed asciidoctor-2.0.11
Successfully installed safe_yaml-1.0.5
Successfully installed rouge-1.11.1
Successfully installed pathutil-0.16.2
Successfully installed mercenary-0.3.6
Successfully installed liquid-4.0.3
Successfully installed kramdown-1.17.0
Successfully installed jekyll-watch-1.5.1
Successfully installed jekyll-sass-converter-1.5.2
Successfully installed colorator-1.1.0
Successfully installed addressable-2.7.0
Successfully installed concurrent-ruby-1.0.5-java
Successfully installed tilt-2.0.10
Successfully installed slim-4.0.1
Successfully installed jekyll-3.5.2
Successfully installed jekyll-asciidoc-3.0.0
25 gems installed

> Task :solr:solr-ref-guide:prepareLocalJavadocLinksSiteSources
Syncing source files to /home/jenkins/workspace/Lucene-Solr-master-Linux/solr/solr-ref-guide/build/local-jdoc-links-site-content
using props:
  htmlSolrJavadocs -> link:../../../documentation/build/site
  htmlLuceneJavadocs -> link:../../../../lucene/documentation/build/site
  htmlOutDir -> ../local-jdoc-links-site
  javadocLink -> https://docs.oracle.com/en/java/javase/11/docs/api/
  solrGuideDraftStatus -> DRAFT
  solrRootPath -> /home/jenkins/workspace/Lucene-Solr-master-Linux/solr/
  solrDocsVersion -> 9.0
  solrGuideVersionPath -> 9_0
  buildDate -> 2020-11-09
  buildYear -> 2020
  ivyCommonsCodec -> 1.13
  ivyDropwizardMetrics -> 4.1.5
  ivyLog4j -> 2.13.2
  ivyOpennlpTools -> 1.9.1
  ivyTika -> 1.24
  ivyZookeeper -> 3.6.2
Building up tree of all known pages
WARNING: An illegal reflective access operation has occurred
WARNING: Illegal reflective access by org.jruby.util.SecurityHelper (file:/home/jenkins/.gradle/caches/modules-2/files-2.1/org.jruby/jruby-core/9.2.6.0/653601d48b38528e76840c6eac1ae46e2dae1a74/jruby-core-9.2.6.0.jar)
to field java.lang.reflect.Field.modifiers
WARNING: Please consider reporting this to the maintainers of org.jruby.util.SecurityHelper
WARNING: Use --illegal-access=warn to enable warnings of further illegal reflective access
operations
WARNING: All illegal access operations will be denied in a future release
Looping over pages to build nav data
Creating /home/jenkins/workspace/Lucene-Solr-master-Linux/solr/solr-ref-guide/build/local-jdoc-links-site-content/_data/scrollnav.json
Creating /home/jenkins/workspace/Lucene-Solr-master-Linux/solr/solr-ref-guide/build/local-jdoc-links-site-content/_data/sidebar.json

> Task :solr:solr-ref-guide:buildLocalJavadocLinksSite
WARNING: An illegal reflective access operation has occurred
WARNING: Illegal reflective access by com.headius.backport9.modules.Modules (file:/home/jenkins/.gradle/caches/modules-2/files-2.1/org.jruby/jruby-complete/9.2.9.0/8e44ce7a1417966d89957bd766a148601e28828b/jruby-complete-9.2.9.0.jar)
to method sun.nio.ch.NativeThread.signal(long)
WARNING: Please consider reporting this to the maintainers of com.headius.backport9.modules.Modules
WARNING: Use --illegal-access=warn to enable warnings of further illegal reflective access
operations
WARNING: All illegal access operations will be denied in a future release
Configuration file: /home/jenkins/workspace/Lucene-Solr-master-Linux/solr/solr-ref-guide/build/local-jdoc-links-site-content/_config.yml
            Source: /home/jenkins/workspace/Lucene-Solr-master-Linux/solr/solr-ref-guide/build/local-jdoc-links-site-content
       Destination: ../local-jdoc-links-site
 Incremental build: disabled. Enable with --incremental
      Generating... 
asciidoctor: WARNING: skipping reference to missing attribute: config_name
asciidoctor: WARNING: skipping reference to missing attribute: file_name
                    done in 14.01 seconds.
 Auto-regeneration: disabled. Use --watch to enable.

> Task :solr:solr-ref-guide:checkLocalJavadocLinksSite
Processed 2443 links (1998 relative) to 3514 anchors in 243 files

> Task :solr:solr-ref-guide:prepareSiteSources
Syncing source files to /home/jenkins/workspace/Lucene-Solr-master-Linux/solr/solr-ref-guide/build/html-site-content
using props:
  htmlSolrJavadocs -> https://lucene.apache.org/solr/9_0_0/
  htmlLuceneJavadocs -> https://lucene.apache.org/core/9_0_0/
  htmlOutDir -> ../html-site
  javadocLink -> https://docs.oracle.com/en/java/javase/11/docs/api/
  solrGuideDraftStatus -> DRAFT
  solrRootPath -> /home/jenkins/workspace/Lucene-Solr-master-Linux/solr/
  solrDocsVersion -> 9.0
  solrGuideVersionPath -> 9_0
  buildDate -> 2020-11-09
  buildYear -> 2020
  ivyCommonsCodec -> 1.13
  ivyDropwizardMetrics -> 4.1.5
  ivyLog4j -> 2.13.2
  ivyOpennlpTools -> 1.9.1
  ivyTika -> 1.24
  ivyZookeeper -> 3.6.2
Building up tree of all known pages
WARNING: An illegal reflective access operation has occurred
WARNING: Illegal reflective access by org.jruby.util.SecurityHelper (file:/home/jenkins/.gradle/caches/modules-2/files-2.1/org.jruby/jruby-core/9.2.6.0/653601d48b38528e76840c6eac1ae46e2dae1a74/jruby-core-9.2.6.0.jar)
to field java.lang.reflect.Field.modifiers
WARNING: Please consider reporting this to the maintainers of org.jruby.util.SecurityHelper
WARNING: Use --illegal-access=warn to enable warnings of further illegal reflective access
operations
WARNING: All illegal access operations will be denied in a future release
Looping over pages to build nav data
Creating /home/jenkins/workspace/Lucene-Solr-master-Linux/solr/solr-ref-guide/build/html-site-content/_data/scrollnav.json
Creating /home/jenkins/workspace/Lucene-Solr-master-Linux/solr/solr-ref-guide/build/html-site-content/_data/sidebar.json

> Task :solr:solr-ref-guide:buildSite
WARNING: An illegal reflective access operation has occurred
WARNING: Illegal reflective access by com.headius.backport9.modules.Modules (file:/home/jenkins/.gradle/caches/modules-2/files-2.1/org.jruby/jruby-complete/9.2.9.0/8e44ce7a1417966d89957bd766a148601e28828b/jruby-complete-9.2.9.0.jar)
to method sun.nio.ch.NativeThread.signal(long)
WARNING: Please consider reporting this to the maintainers of com.headius.backport9.modules.Modules
WARNING: Use --illegal-access=warn to enable warnings of further illegal reflective access
operations
WARNING: All illegal access operations will be denied in a future release
Configuration file: /home/jenkins/workspace/Lucene-Solr-master-Linux/solr/solr-ref-guide/build/html-site-content/_config.yml
            Source: /home/jenkins/workspace/Lucene-Solr-master-Linux/solr/solr-ref-guide/build/html-site-content
       Destination: ../html-site
 Incremental build: disabled. Enable with --incremental
      Generating... 
asciidoctor: WARNING: skipping reference to missing attribute: config_name
asciidoctor: WARNING: skipping reference to missing attribute: file_name
                    done in 14.327 seconds.
 Auto-regeneration: disabled. Use --watch to enable.

> Task :solr:solr-ref-guide:checkSite
Processed 2443 links (1760 relative) to 3514 anchors in 243 files

> Task :solr:solr-ref-guide:check
> Task :solr:solrj:check
> Task :solr:test-framework:check
> Task :solr:webapp:check
> Task :lucene:analysis:common:check
> Task :lucene:analysis:icu:check
> Task :lucene:analysis:kuromoji:check
> Task :lucene:analysis:morfologik:check
> Task :lucene:analysis:nori:check
> Task :lucene:analysis:opennlp:check
> Task :lucene:analysis:phonetic:check
> Task :lucene:analysis:smartcn:check
> Task :lucene:analysis:stempel:check
> Task :solr:contrib:analysis-extras:check
> Task :solr:contrib:analytics:check
> Task :solr:contrib:clustering:check
> Task :solr:contrib:extraction:check
> Task :solr:contrib:jaegertracer-configurator:check
> Task :solr:contrib:langid:check
> Task :solr:contrib:ltr:check
> Task :solr:contrib:prometheus-exporter:check
> Task :solr:docker:package:check
The slowest tests (exceeding 500 ms) during this run:
  198.89s TestStressLiveNodes.testStress (:solr:core)
  73.50s TestLeaderElectionZkExpiry.testLeaderElectionWithZkExpiry (:solr:core)
  60.79s ZkControllerTest.testPublishAndWaitForDownStates (:solr:core)
  60.55s ZkControllerTest.testReadConfigName (:solr:core)
  60.38s ZkControllerTest.testGetHostName (:solr:core)
  58.89s PeerSyncReplicationTest.test (:solr:core)
  46.36s ChaosMonkeyNothingIsSafeWithPullReplicasTest.test (:solr:core)
  45.35s ReplicationFactorTest.test (:solr:core)
  45.01s ShardSplitTest.testSplitAfterFailedSplit (:solr:core)
  43.38s SyncSliceTest.test (:solr:core)

ERROR: The following test(s) have failed:
  - org.apache.solr.TestRandomDVFaceting.testRandomFaceting (:solr:core)
    Test output: /home/jenkins/workspace/Lucene-Solr-master-Linux/solr/core/build/test-results/test/outputs/OUTPUT-org.apache.solr.TestRandomDVFaceting.txt
    Reproduce with: gradlew :solr:core:test --tests "org.apache.solr.TestRandomDVFaceting.testRandomFaceting"
-Ptests.jvms=6 -Ptests.haltonfailure=false "-Ptests.jvmargs=-XX:+UseCompressedOops -XX:+UseSerialGC"
-Ptests.seed=B5B1388600FFF27D -Ptests.multiplier=3 -Ptests.badapples=false -Ptests.file.encoding=US-ASCII


Deprecated Gradle features were used in this build, making it incompatible with Gradle 7.0.
Use '--warning-mode all' to show the individual deprecation warnings.
See https://docs.gradle.org/6.6.1/userguide/command_line_interface.html#sec:command_line_warnings

BUILD SUCCESSFUL in 41m 36s
853 actionable tasks: 853 executed
Build step 'Invoke Gradle script' changed build result to SUCCESS
Archiving artifacts
java.lang.InterruptedException: no matches found within 10000
	at hudson.FilePath$ValidateAntFileMask.hasMatch(FilePath.java:2875)
	at hudson.FilePath$ValidateAntFileMask.invoke(FilePath.java:2754)
	at hudson.FilePath$ValidateAntFileMask.invoke(FilePath.java:2735)
	at hudson.FilePath.act(FilePath.java:1076)
	at hudson.FilePath.act(FilePath.java:1059)
	at hudson.FilePath.validateAntFileMask(FilePath.java:2733)
	at hudson.tasks.ArtifactArchiver.perform(ArtifactArchiver.java:270)
	at hudson.tasks.BuildStepCompatibilityLayer.perform(BuildStepCompatibilityLayer.java:80)
	at hudson.tasks.BuildStepMonitor$1.perform(BuildStepMonitor.java:20)
	at hudson.model.AbstractBuild$AbstractBuildExecution.perform(AbstractBuild.java:804)
	at hudson.model.AbstractBuild$AbstractBuildExecution.performAllBuildSteps(AbstractBuild.java:753)
	at hudson.model.Build$BuildExecution.post2(Build.java:177)
	at hudson.model.AbstractBuild$AbstractBuildExecution.post(AbstractBuild.java:698)
	at hudson.model.Run.execute(Run.java:1932)
	at hudson.model.FreeStyleBuild.run(FreeStyleBuild.java:43)
	at hudson.model.ResourceController.execute(ResourceController.java:97)
	at hudson.model.Executor.run(Executor.java:429)
No artifacts found that match the file pattern "**/*.events,heapdumps/**,**/*_pid*.log". Configuration
error?
[Java] Sleeping for 5 seconds due to JENKINS-32191...
[Java] Parsing console log (workspace: '/home/jenkins/workspace/Lucene-Solr-master-Linux')
[Java] Successfully parsed console log
[Java] -> found 0 issues (skipped 0 duplicates)
[Java] Skipping post processing
[Java] No filter has been set, publishing all 0 issues
[Java] Using reference build 'Lucene-Solr-master-Linux #28577' to compute new, fixed, and
outstanding issues
[Java] Issues delta (vs. reference build): outstanding: 0, new: 0, fixed: 0
[Java] No quality gates have been set - skipping
[Java] Health report is disabled - skipping
[Java] Created analysis result for 0 issues (found 0 new issues, fixed 0 issues)
[Java] Attaching ResultAction with ID 'java' to run 'Lucene-Solr-master-Linux #28578'.
[Checks API] No suitable checks publisher found.
Recording test results
[Checks API] No suitable checks publisher found.
Build step 'Publish JUnit test result report' changed build result to UNSTABLE
Email was triggered for: Unstable (Test Failures)
Sending email for trigger: Unstable (Test Failures)

Mime
View raw message