lucene-builds mailing list archives

Site index · List index
Message view « Date » · « Thread »
Top « Date » · « Thread »
From Policeman Jenkins Server <jenk...@thetaphi.de>
Subject [JENKINS] Lucene-Solr-cloud2refimpl-MacOSX (64bit/jdk-12.0.2) - Build # 7 - Still Failing!
Date Tue, 06 Oct 2020 21:45:18 GMT
Build: https://jenkins.thetaphi.de/job/Lucene-Solr-cloud2refimpl-MacOSX/7/
Java: 64bit/jdk-12.0.2 -XX:+UseCompressedOops -XX:+UseSerialGC

6 tests failed.
FAILED:  org.apache.lucene.codecs.uniformsplit.TestUniformSplitPostingFormat.testCheckIntegrityReadsAllBytes

Error Message:
java.lang.AssertionError

Stack Trace:
java.lang.AssertionError
	at __randomizedtesting.SeedInfo.seed([70F59416C696FFB6:D3785CA67682B1F]:0)
	at org.junit.Assert.fail(Assert.java:86)
	at org.junit.Assert.assertTrue(Assert.java:41)
	at org.junit.Assert.assertTrue(Assert.java:52)
	at org.apache.lucene.codecs.uniformsplit.TestUniformSplitPostingFormat.checkEncodingCalled(TestUniformSplitPostingFormat.java:63)
	at java.base/jdk.internal.reflect.NativeMethodAccessorImpl.invoke0(Native Method)
	at java.base/jdk.internal.reflect.NativeMethodAccessorImpl.invoke(NativeMethodAccessorImpl.java:62)
	at java.base/jdk.internal.reflect.DelegatingMethodAccessorImpl.invoke(DelegatingMethodAccessorImpl.java:43)
	at java.base/java.lang.reflect.Method.invoke(Method.java:567)
	at com.carrotsearch.randomizedtesting.RandomizedRunner.invoke(RandomizedRunner.java:1754)
	at com.carrotsearch.randomizedtesting.RandomizedRunner$10.evaluate(RandomizedRunner.java:1000)
	at org.apache.lucene.util.TestRuleSetupTeardownChained$1.evaluate(TestRuleSetupTeardownChained.java:49)
	at org.apache.lucene.util.AbstractBeforeAfterRule$1.evaluate(AbstractBeforeAfterRule.java:45)
	at org.apache.lucene.util.TestRuleThreadAndTestName$1.evaluate(TestRuleThreadAndTestName.java:48)
	at org.apache.lucene.util.TestRuleIgnoreAfterMaxFailures$1.evaluate(TestRuleIgnoreAfterMaxFailures.java:64)
	at org.apache.lucene.util.TestRuleMarkFailure$1.evaluate(TestRuleMarkFailure.java:47)
	at com.carrotsearch.randomizedtesting.rules.StatementAdapter.evaluate(StatementAdapter.java:36)
	at com.carrotsearch.randomizedtesting.ThreadLeakControl$StatementRunner.run(ThreadLeakControl.java:370)
	at com.carrotsearch.randomizedtesting.ThreadLeakControl.forkTimeoutingTask(ThreadLeakControl.java:819)
	at com.carrotsearch.randomizedtesting.ThreadLeakControl$3.evaluate(ThreadLeakControl.java:470)
	at com.carrotsearch.randomizedtesting.RandomizedRunner.runSingleTest(RandomizedRunner.java:951)
	at com.carrotsearch.randomizedtesting.RandomizedRunner$5.evaluate(RandomizedRunner.java:836)
	at com.carrotsearch.randomizedtesting.RandomizedRunner$6.evaluate(RandomizedRunner.java:887)
	at com.carrotsearch.randomizedtesting.RandomizedRunner$7.evaluate(RandomizedRunner.java:898)
	at org.apache.lucene.util.AbstractBeforeAfterRule$1.evaluate(AbstractBeforeAfterRule.java:45)
	at com.carrotsearch.randomizedtesting.rules.StatementAdapter.evaluate(StatementAdapter.java:36)
	at org.apache.lucene.util.TestRuleStoreClassName$1.evaluate(TestRuleStoreClassName.java:41)
	at com.carrotsearch.randomizedtesting.rules.NoShadowingOrOverridesOnMethodsRule$1.evaluate(NoShadowingOrOverridesOnMethodsRule.java:40)
	at com.carrotsearch.randomizedtesting.rules.NoShadowingOrOverridesOnMethodsRule$1.evaluate(NoShadowingOrOverridesOnMethodsRule.java:40)
	at com.carrotsearch.randomizedtesting.rules.StatementAdapter.evaluate(StatementAdapter.java:36)
	at org.apache.lucene.util.TestRuleAssertionsRequired$1.evaluate(TestRuleAssertionsRequired.java:53)
	at org.apache.lucene.util.TestRuleMarkFailure$1.evaluate(TestRuleMarkFailure.java:47)
	at org.apache.lucene.util.TestRuleIgnoreAfterMaxFailures$1.evaluate(TestRuleIgnoreAfterMaxFailures.java:64)
	at org.apache.lucene.util.TestRuleIgnoreTestSuites$1.evaluate(TestRuleIgnoreTestSuites.java:54)
	at com.carrotsearch.randomizedtesting.rules.StatementAdapter.evaluate(StatementAdapter.java:36)
	at com.carrotsearch.randomizedtesting.ThreadLeakControl$StatementRunner.run(ThreadLeakControl.java:370)
	at com.carrotsearch.randomizedtesting.ThreadLeakControl.lambda$forkTimeoutingTask$0(ThreadLeakControl.java:826)
	at java.base/java.lang.Thread.run(Thread.java:835)


FAILED:  org.apache.lucene.codecs.uniformsplit.sharedterms.TestSTUniformSplitPostingFormat.testCheckIntegrityReadsAllBytes

Error Message:
java.lang.AssertionError

Stack Trace:
java.lang.AssertionError
	at __randomizedtesting.SeedInfo.seed([70F59416C696FFB6:D3785CA67682B1F]:0)
	at org.junit.Assert.fail(Assert.java:86)
	at org.junit.Assert.assertTrue(Assert.java:41)
	at org.junit.Assert.assertTrue(Assert.java:52)
	at org.apache.lucene.codecs.uniformsplit.TestUniformSplitPostingFormat.checkEncodingCalled(TestUniformSplitPostingFormat.java:63)
	at java.base/jdk.internal.reflect.NativeMethodAccessorImpl.invoke0(Native Method)
	at java.base/jdk.internal.reflect.NativeMethodAccessorImpl.invoke(NativeMethodAccessorImpl.java:62)
	at java.base/jdk.internal.reflect.DelegatingMethodAccessorImpl.invoke(DelegatingMethodAccessorImpl.java:43)
	at java.base/java.lang.reflect.Method.invoke(Method.java:567)
	at com.carrotsearch.randomizedtesting.RandomizedRunner.invoke(RandomizedRunner.java:1754)
	at com.carrotsearch.randomizedtesting.RandomizedRunner$10.evaluate(RandomizedRunner.java:1000)
	at org.apache.lucene.util.TestRuleSetupTeardownChained$1.evaluate(TestRuleSetupTeardownChained.java:49)
	at org.apache.lucene.util.AbstractBeforeAfterRule$1.evaluate(AbstractBeforeAfterRule.java:45)
	at org.apache.lucene.util.TestRuleThreadAndTestName$1.evaluate(TestRuleThreadAndTestName.java:48)
	at org.apache.lucene.util.TestRuleIgnoreAfterMaxFailures$1.evaluate(TestRuleIgnoreAfterMaxFailures.java:64)
	at org.apache.lucene.util.TestRuleMarkFailure$1.evaluate(TestRuleMarkFailure.java:47)
	at com.carrotsearch.randomizedtesting.rules.StatementAdapter.evaluate(StatementAdapter.java:36)
	at com.carrotsearch.randomizedtesting.ThreadLeakControl$StatementRunner.run(ThreadLeakControl.java:370)
	at com.carrotsearch.randomizedtesting.ThreadLeakControl.forkTimeoutingTask(ThreadLeakControl.java:819)
	at com.carrotsearch.randomizedtesting.ThreadLeakControl$3.evaluate(ThreadLeakControl.java:470)
	at com.carrotsearch.randomizedtesting.RandomizedRunner.runSingleTest(RandomizedRunner.java:951)
	at com.carrotsearch.randomizedtesting.RandomizedRunner$5.evaluate(RandomizedRunner.java:836)
	at com.carrotsearch.randomizedtesting.RandomizedRunner$6.evaluate(RandomizedRunner.java:887)
	at com.carrotsearch.randomizedtesting.RandomizedRunner$7.evaluate(RandomizedRunner.java:898)
	at org.apache.lucene.util.AbstractBeforeAfterRule$1.evaluate(AbstractBeforeAfterRule.java:45)
	at com.carrotsearch.randomizedtesting.rules.StatementAdapter.evaluate(StatementAdapter.java:36)
	at org.apache.lucene.util.TestRuleStoreClassName$1.evaluate(TestRuleStoreClassName.java:41)
	at com.carrotsearch.randomizedtesting.rules.NoShadowingOrOverridesOnMethodsRule$1.evaluate(NoShadowingOrOverridesOnMethodsRule.java:40)
	at com.carrotsearch.randomizedtesting.rules.NoShadowingOrOverridesOnMethodsRule$1.evaluate(NoShadowingOrOverridesOnMethodsRule.java:40)
	at com.carrotsearch.randomizedtesting.rules.StatementAdapter.evaluate(StatementAdapter.java:36)
	at org.apache.lucene.util.TestRuleAssertionsRequired$1.evaluate(TestRuleAssertionsRequired.java:53)
	at org.apache.lucene.util.TestRuleMarkFailure$1.evaluate(TestRuleMarkFailure.java:47)
	at org.apache.lucene.util.TestRuleIgnoreAfterMaxFailures$1.evaluate(TestRuleIgnoreAfterMaxFailures.java:64)
	at org.apache.lucene.util.TestRuleIgnoreTestSuites$1.evaluate(TestRuleIgnoreTestSuites.java:54)
	at com.carrotsearch.randomizedtesting.rules.StatementAdapter.evaluate(StatementAdapter.java:36)
	at com.carrotsearch.randomizedtesting.ThreadLeakControl$StatementRunner.run(ThreadLeakControl.java:370)
	at com.carrotsearch.randomizedtesting.ThreadLeakControl.lambda$forkTimeoutingTask$0(ThreadLeakControl.java:826)
	at java.base/java.lang.Thread.run(Thread.java:835)


FAILED:  org.apache.lucene.analysis.synonym.TestSynonymFilterFactory.testFormat

Error Message:
java.lang.AssertionError: token 1 does not exist

Stack Trace:
java.lang.AssertionError: token 1 does not exist
	at __randomizedtesting.SeedInfo.seed([70F59416C696FFB6:FA422DF7903332B0]:0)
	at org.junit.Assert.fail(Assert.java:88)
	at org.junit.Assert.assertTrue(Assert.java:41)
	at org.apache.lucene.analysis.BaseTokenStreamTestCase.assertTokenStreamContents(BaseTokenStreamTestCase.java:195)
	at org.apache.lucene.analysis.BaseTokenStreamTestCase.assertTokenStreamContents(BaseTokenStreamTestCase.java:319)
	at org.apache.lucene.analysis.BaseTokenStreamTestCase.assertTokenStreamContents(BaseTokenStreamTestCase.java:323)
	at org.apache.lucene.analysis.BaseTokenStreamTestCase.assertTokenStreamContents(BaseTokenStreamTestCase.java:327)
	at org.apache.lucene.analysis.BaseTokenStreamTestCase.assertTokenStreamContents(BaseTokenStreamTestCase.java:351)
	at org.apache.lucene.analysis.synonym.TestSynonymFilterFactory.checkSolrSynonyms(TestSynonymFilterFactory.java:38)
	at org.apache.lucene.analysis.synonym.TestSynonymFilterFactory.testFormat(TestSynonymFilterFactory.java:70)
	at java.base/jdk.internal.reflect.NativeMethodAccessorImpl.invoke0(Native Method)
	at java.base/jdk.internal.reflect.NativeMethodAccessorImpl.invoke(NativeMethodAccessorImpl.java:62)
	at java.base/jdk.internal.reflect.DelegatingMethodAccessorImpl.invoke(DelegatingMethodAccessorImpl.java:43)
	at java.base/java.lang.reflect.Method.invoke(Method.java:567)
	at com.carrotsearch.randomizedtesting.RandomizedRunner.invoke(RandomizedRunner.java:1754)
	at com.carrotsearch.randomizedtesting.RandomizedRunner$8.evaluate(RandomizedRunner.java:942)
	at com.carrotsearch.randomizedtesting.RandomizedRunner$9.evaluate(RandomizedRunner.java:978)
	at com.carrotsearch.randomizedtesting.RandomizedRunner$10.evaluate(RandomizedRunner.java:992)
	at org.apache.lucene.util.TestRuleSetupTeardownChained$1.evaluate(TestRuleSetupTeardownChained.java:49)
	at org.apache.lucene.util.AbstractBeforeAfterRule$1.evaluate(AbstractBeforeAfterRule.java:45)
	at org.apache.lucene.util.TestRuleThreadAndTestName$1.evaluate(TestRuleThreadAndTestName.java:48)
	at org.apache.lucene.util.TestRuleIgnoreAfterMaxFailures$1.evaluate(TestRuleIgnoreAfterMaxFailures.java:64)
	at org.apache.lucene.util.TestRuleMarkFailure$1.evaluate(TestRuleMarkFailure.java:47)
	at com.carrotsearch.randomizedtesting.rules.StatementAdapter.evaluate(StatementAdapter.java:36)
	at com.carrotsearch.randomizedtesting.ThreadLeakControl$StatementRunner.run(ThreadLeakControl.java:370)
	at com.carrotsearch.randomizedtesting.ThreadLeakControl.forkTimeoutingTask(ThreadLeakControl.java:819)
	at com.carrotsearch.randomizedtesting.ThreadLeakControl$3.evaluate(ThreadLeakControl.java:470)
	at com.carrotsearch.randomizedtesting.RandomizedRunner.runSingleTest(RandomizedRunner.java:951)
	at com.carrotsearch.randomizedtesting.RandomizedRunner$5.evaluate(RandomizedRunner.java:836)
	at com.carrotsearch.randomizedtesting.RandomizedRunner$6.evaluate(RandomizedRunner.java:887)
	at com.carrotsearch.randomizedtesting.RandomizedRunner$7.evaluate(RandomizedRunner.java:898)
	at org.apache.lucene.util.AbstractBeforeAfterRule$1.evaluate(AbstractBeforeAfterRule.java:45)
	at com.carrotsearch.randomizedtesting.rules.StatementAdapter.evaluate(StatementAdapter.java:36)
	at org.apache.lucene.util.TestRuleStoreClassName$1.evaluate(TestRuleStoreClassName.java:41)
	at com.carrotsearch.randomizedtesting.rules.NoShadowingOrOverridesOnMethodsRule$1.evaluate(NoShadowingOrOverridesOnMethodsRule.java:40)
	at com.carrotsearch.randomizedtesting.rules.NoShadowingOrOverridesOnMethodsRule$1.evaluate(NoShadowingOrOverridesOnMethodsRule.java:40)
	at com.carrotsearch.randomizedtesting.rules.StatementAdapter.evaluate(StatementAdapter.java:36)
	at org.apache.lucene.util.TestRuleAssertionsRequired$1.evaluate(TestRuleAssertionsRequired.java:53)
	at org.apache.lucene.util.TestRuleMarkFailure$1.evaluate(TestRuleMarkFailure.java:47)
	at org.apache.lucene.util.TestRuleIgnoreAfterMaxFailures$1.evaluate(TestRuleIgnoreAfterMaxFailures.java:64)
	at org.apache.lucene.util.TestRuleIgnoreTestSuites$1.evaluate(TestRuleIgnoreTestSuites.java:54)
	at com.carrotsearch.randomizedtesting.rules.StatementAdapter.evaluate(StatementAdapter.java:36)
	at com.carrotsearch.randomizedtesting.ThreadLeakControl$StatementRunner.run(ThreadLeakControl.java:370)
	at com.carrotsearch.randomizedtesting.ThreadLeakControl.lambda$forkTimeoutingTask$0(ThreadLeakControl.java:826)
	at java.base/java.lang.Thread.run(Thread.java:835)


FAILED:  org.apache.lucene.analysis.synonym.TestSynonymFilterFactory.testSynonyms

Error Message:
java.lang.AssertionError: token 1 does not exist

Stack Trace:
java.lang.AssertionError: token 1 does not exist
	at __randomizedtesting.SeedInfo.seed([70F59416C696FFB6:2D4EE6C818DB474C]:0)
	at org.junit.Assert.fail(Assert.java:88)
	at org.junit.Assert.assertTrue(Assert.java:41)
	at org.apache.lucene.analysis.BaseTokenStreamTestCase.assertTokenStreamContents(BaseTokenStreamTestCase.java:195)
	at org.apache.lucene.analysis.BaseTokenStreamTestCase.assertTokenStreamContents(BaseTokenStreamTestCase.java:319)
	at org.apache.lucene.analysis.BaseTokenStreamTestCase.assertTokenStreamContents(BaseTokenStreamTestCase.java:323)
	at org.apache.lucene.analysis.BaseTokenStreamTestCase.assertTokenStreamContents(BaseTokenStreamTestCase.java:327)
	at org.apache.lucene.analysis.BaseTokenStreamTestCase.assertTokenStreamContents(BaseTokenStreamTestCase.java:351)
	at org.apache.lucene.analysis.synonym.TestSynonymFilterFactory.checkSolrSynonyms(TestSynonymFilterFactory.java:38)
	at org.apache.lucene.analysis.synonym.TestSynonymFilterFactory.testSynonyms(TestSynonymFilterFactory.java:56)
	at java.base/jdk.internal.reflect.NativeMethodAccessorImpl.invoke0(Native Method)
	at java.base/jdk.internal.reflect.NativeMethodAccessorImpl.invoke(NativeMethodAccessorImpl.java:62)
	at java.base/jdk.internal.reflect.DelegatingMethodAccessorImpl.invoke(DelegatingMethodAccessorImpl.java:43)
	at java.base/java.lang.reflect.Method.invoke(Method.java:567)
	at com.carrotsearch.randomizedtesting.RandomizedRunner.invoke(RandomizedRunner.java:1754)
	at com.carrotsearch.randomizedtesting.RandomizedRunner$8.evaluate(RandomizedRunner.java:942)
	at com.carrotsearch.randomizedtesting.RandomizedRunner$9.evaluate(RandomizedRunner.java:978)
	at com.carrotsearch.randomizedtesting.RandomizedRunner$10.evaluate(RandomizedRunner.java:992)
	at org.apache.lucene.util.TestRuleSetupTeardownChained$1.evaluate(TestRuleSetupTeardownChained.java:49)
	at org.apache.lucene.util.AbstractBeforeAfterRule$1.evaluate(AbstractBeforeAfterRule.java:45)
	at org.apache.lucene.util.TestRuleThreadAndTestName$1.evaluate(TestRuleThreadAndTestName.java:48)
	at org.apache.lucene.util.TestRuleIgnoreAfterMaxFailures$1.evaluate(TestRuleIgnoreAfterMaxFailures.java:64)
	at org.apache.lucene.util.TestRuleMarkFailure$1.evaluate(TestRuleMarkFailure.java:47)
	at com.carrotsearch.randomizedtesting.rules.StatementAdapter.evaluate(StatementAdapter.java:36)
	at com.carrotsearch.randomizedtesting.ThreadLeakControl$StatementRunner.run(ThreadLeakControl.java:370)
	at com.carrotsearch.randomizedtesting.ThreadLeakControl.forkTimeoutingTask(ThreadLeakControl.java:819)
	at com.carrotsearch.randomizedtesting.ThreadLeakControl$3.evaluate(ThreadLeakControl.java:470)
	at com.carrotsearch.randomizedtesting.RandomizedRunner.runSingleTest(RandomizedRunner.java:951)
	at com.carrotsearch.randomizedtesting.RandomizedRunner$5.evaluate(RandomizedRunner.java:836)
	at com.carrotsearch.randomizedtesting.RandomizedRunner$6.evaluate(RandomizedRunner.java:887)
	at com.carrotsearch.randomizedtesting.RandomizedRunner$7.evaluate(RandomizedRunner.java:898)
	at org.apache.lucene.util.AbstractBeforeAfterRule$1.evaluate(AbstractBeforeAfterRule.java:45)
	at com.carrotsearch.randomizedtesting.rules.StatementAdapter.evaluate(StatementAdapter.java:36)
	at org.apache.lucene.util.TestRuleStoreClassName$1.evaluate(TestRuleStoreClassName.java:41)
	at com.carrotsearch.randomizedtesting.rules.NoShadowingOrOverridesOnMethodsRule$1.evaluate(NoShadowingOrOverridesOnMethodsRule.java:40)
	at com.carrotsearch.randomizedtesting.rules.NoShadowingOrOverridesOnMethodsRule$1.evaluate(NoShadowingOrOverridesOnMethodsRule.java:40)
	at com.carrotsearch.randomizedtesting.rules.StatementAdapter.evaluate(StatementAdapter.java:36)
	at org.apache.lucene.util.TestRuleAssertionsRequired$1.evaluate(TestRuleAssertionsRequired.java:53)
	at org.apache.lucene.util.TestRuleMarkFailure$1.evaluate(TestRuleMarkFailure.java:47)
	at org.apache.lucene.util.TestRuleIgnoreAfterMaxFailures$1.evaluate(TestRuleIgnoreAfterMaxFailures.java:64)
	at org.apache.lucene.util.TestRuleIgnoreTestSuites$1.evaluate(TestRuleIgnoreTestSuites.java:54)
	at com.carrotsearch.randomizedtesting.rules.StatementAdapter.evaluate(StatementAdapter.java:36)
	at com.carrotsearch.randomizedtesting.ThreadLeakControl$StatementRunner.run(ThreadLeakControl.java:370)
	at com.carrotsearch.randomizedtesting.ThreadLeakControl.lambda$forkTimeoutingTask$0(ThreadLeakControl.java:826)
	at java.base/java.lang.Thread.run(Thread.java:835)


FAILED:  org.apache.lucene.util.TestSysoutsLimits.testOverSoftLimit

Error Message:
java.lang.AssertionError: 

Stack Trace:
java.lang.AssertionError: 
	at org.junit.Assert.fail(Assert.java:88)
	at org.junit.Assert.assertTrue(Assert.java:41)
	at org.apache.lucene.util.TestSysoutsLimits.testOverSoftLimit(TestSysoutsLimits.java:60)
	at java.base/jdk.internal.reflect.NativeMethodAccessorImpl.invoke0(Native Method)
	at java.base/jdk.internal.reflect.NativeMethodAccessorImpl.invoke(NativeMethodAccessorImpl.java:62)
	at java.base/jdk.internal.reflect.DelegatingMethodAccessorImpl.invoke(DelegatingMethodAccessorImpl.java:43)
	at java.base/java.lang.reflect.Method.invoke(Method.java:567)
	at org.junit.runners.model.FrameworkMethod$1.runReflectiveCall(FrameworkMethod.java:50)
	at org.junit.internal.runners.model.ReflectiveCallable.run(ReflectiveCallable.java:12)
	at org.junit.runners.model.FrameworkMethod.invokeExplosively(FrameworkMethod.java:47)
	at org.junit.internal.runners.statements.InvokeMethod.evaluate(InvokeMethod.java:17)
	at org.junit.internal.runners.statements.RunBefores.evaluate(RunBefores.java:26)
	at org.junit.internal.runners.statements.RunAfters.evaluate(RunAfters.java:27)
	at org.apache.lucene.util.TestRuleMarkFailure$1.evaluate(TestRuleMarkFailure.java:47)
	at com.carrotsearch.randomizedtesting.rules.StatementAdapter.evaluate(StatementAdapter.java:36)
	at com.carrotsearch.randomizedtesting.rules.StatementAdapter.evaluate(StatementAdapter.java:36)
	at org.junit.rules.RunRules.evaluate(RunRules.java:20)
	at org.junit.runners.ParentRunner.runLeaf(ParentRunner.java:325)
	at org.junit.runners.BlockJUnit4ClassRunner.runChild(BlockJUnit4ClassRunner.java:78)
	at org.junit.runners.BlockJUnit4ClassRunner.runChild(BlockJUnit4ClassRunner.java:57)
	at org.junit.runners.ParentRunner$3.run(ParentRunner.java:290)
	at org.junit.runners.ParentRunner$1.schedule(ParentRunner.java:71)
	at org.junit.runners.ParentRunner.runChildren(ParentRunner.java:288)
	at org.junit.runners.ParentRunner.access$000(ParentRunner.java:58)
	at org.junit.runners.ParentRunner$2.evaluate(ParentRunner.java:268)
	at com.carrotsearch.randomizedtesting.rules.StatementAdapter.evaluate(StatementAdapter.java:36)
	at org.junit.rules.RunRules.evaluate(RunRules.java:20)
	at org.junit.runners.ParentRunner.run(ParentRunner.java:363)
	at org.gradle.api.internal.tasks.testing.junit.JUnitTestClassExecutor.runTestClass(JUnitTestClassExecutor.java:110)
	at org.gradle.api.internal.tasks.testing.junit.JUnitTestClassExecutor.execute(JUnitTestClassExecutor.java:58)
	at org.gradle.api.internal.tasks.testing.junit.JUnitTestClassExecutor.execute(JUnitTestClassExecutor.java:38)
	at org.gradle.api.internal.tasks.testing.junit.AbstractJUnitTestClassProcessor.processTestClass(AbstractJUnitTestClassProcessor.java:62)
	at org.gradle.api.internal.tasks.testing.SuiteTestClassProcessor.processTestClass(SuiteTestClassProcessor.java:51)
	at java.base/jdk.internal.reflect.NativeMethodAccessorImpl.invoke0(Native Method)
	at java.base/jdk.internal.reflect.NativeMethodAccessorImpl.invoke(NativeMethodAccessorImpl.java:62)
	at java.base/jdk.internal.reflect.DelegatingMethodAccessorImpl.invoke(DelegatingMethodAccessorImpl.java:43)
	at java.base/java.lang.reflect.Method.invoke(Method.java:567)
	at org.gradle.internal.dispatch.ReflectionDispatch.dispatch(ReflectionDispatch.java:36)
	at org.gradle.internal.dispatch.ReflectionDispatch.dispatch(ReflectionDispatch.java:24)
	at org.gradle.internal.dispatch.ContextClassLoaderDispatch.dispatch(ContextClassLoaderDispatch.java:33)
	at org.gradle.internal.dispatch.ProxyDispatchAdapter$DispatchingInvocationHandler.invoke(ProxyDispatchAdapter.java:94)
	at com.sun.proxy.$Proxy2.processTestClass(Unknown Source)
	at org.gradle.api.internal.tasks.testing.worker.TestWorker.processTestClass(TestWorker.java:118)
	at java.base/jdk.internal.reflect.NativeMethodAccessorImpl.invoke0(Native Method)
	at java.base/jdk.internal.reflect.NativeMethodAccessorImpl.invoke(NativeMethodAccessorImpl.java:62)
	at java.base/jdk.internal.reflect.DelegatingMethodAccessorImpl.invoke(DelegatingMethodAccessorImpl.java:43)
	at java.base/java.lang.reflect.Method.invoke(Method.java:567)
	at org.gradle.internal.dispatch.ReflectionDispatch.dispatch(ReflectionDispatch.java:36)
	at org.gradle.internal.dispatch.ReflectionDispatch.dispatch(ReflectionDispatch.java:24)
	at org.gradle.internal.remote.internal.hub.MessageHubBackedObjectConnection$DispatchWrapper.dispatch(MessageHubBackedObjectConnection.java:182)
	at org.gradle.internal.remote.internal.hub.MessageHubBackedObjectConnection$DispatchWrapper.dispatch(MessageHubBackedObjectConnection.java:164)
	at org.gradle.internal.remote.internal.hub.MessageHub$Handler.run(MessageHub.java:413)
	at org.gradle.internal.concurrent.ExecutorPolicy$CatchAndRecordFailures.onExecute(ExecutorPolicy.java:64)
	at org.gradle.internal.concurrent.ManagedExecutorImpl$1.run(ManagedExecutorImpl.java:48)
	at java.base/java.util.concurrent.ThreadPoolExecutor.runWorker(ThreadPoolExecutor.java:1128)
	at java.base/java.util.concurrent.ThreadPoolExecutor$Worker.run(ThreadPoolExecutor.java:628)
	at org.gradle.internal.concurrent.ThreadFactoryImpl$ManagedThreadRunnable.run(ThreadFactoryImpl.java:56)
	at java.base/java.lang.Thread.run(Thread.java:835)


FAILED:  org.apache.lucene.util.TestSysoutsLimits.OverHardLimit

Error Message:
java.lang.AssertionError: 

Stack Trace:
java.lang.AssertionError: 
	at org.junit.Assert.fail(Assert.java:88)
	at org.junit.Assert.assertTrue(Assert.java:41)
	at org.apache.lucene.util.TestSysoutsLimits.OverHardLimit(TestSysoutsLimits.java:102)
	at java.base/jdk.internal.reflect.NativeMethodAccessorImpl.invoke0(Native Method)
	at java.base/jdk.internal.reflect.NativeMethodAccessorImpl.invoke(NativeMethodAccessorImpl.java:62)
	at java.base/jdk.internal.reflect.DelegatingMethodAccessorImpl.invoke(DelegatingMethodAccessorImpl.java:43)
	at java.base/java.lang.reflect.Method.invoke(Method.java:567)
	at org.junit.runners.model.FrameworkMethod$1.runReflectiveCall(FrameworkMethod.java:50)
	at org.junit.internal.runners.model.ReflectiveCallable.run(ReflectiveCallable.java:12)
	at org.junit.runners.model.FrameworkMethod.invokeExplosively(FrameworkMethod.java:47)
	at org.junit.internal.runners.statements.InvokeMethod.evaluate(InvokeMethod.java:17)
	at org.junit.internal.runners.statements.RunBefores.evaluate(RunBefores.java:26)
	at org.junit.internal.runners.statements.RunAfters.evaluate(RunAfters.java:27)
	at org.apache.lucene.util.TestRuleMarkFailure$1.evaluate(TestRuleMarkFailure.java:47)
	at com.carrotsearch.randomizedtesting.rules.StatementAdapter.evaluate(StatementAdapter.java:36)
	at com.carrotsearch.randomizedtesting.rules.StatementAdapter.evaluate(StatementAdapter.java:36)
	at org.junit.rules.RunRules.evaluate(RunRules.java:20)
	at org.junit.runners.ParentRunner.runLeaf(ParentRunner.java:325)
	at org.junit.runners.BlockJUnit4ClassRunner.runChild(BlockJUnit4ClassRunner.java:78)
	at org.junit.runners.BlockJUnit4ClassRunner.runChild(BlockJUnit4ClassRunner.java:57)
	at org.junit.runners.ParentRunner$3.run(ParentRunner.java:290)
	at org.junit.runners.ParentRunner$1.schedule(ParentRunner.java:71)
	at org.junit.runners.ParentRunner.runChildren(ParentRunner.java:288)
	at org.junit.runners.ParentRunner.access$000(ParentRunner.java:58)
	at org.junit.runners.ParentRunner$2.evaluate(ParentRunner.java:268)
	at com.carrotsearch.randomizedtesting.rules.StatementAdapter.evaluate(StatementAdapter.java:36)
	at org.junit.rules.RunRules.evaluate(RunRules.java:20)
	at org.junit.runners.ParentRunner.run(ParentRunner.java:363)
	at org.gradle.api.internal.tasks.testing.junit.JUnitTestClassExecutor.runTestClass(JUnitTestClassExecutor.java:110)
	at org.gradle.api.internal.tasks.testing.junit.JUnitTestClassExecutor.execute(JUnitTestClassExecutor.java:58)
	at org.gradle.api.internal.tasks.testing.junit.JUnitTestClassExecutor.execute(JUnitTestClassExecutor.java:38)
	at org.gradle.api.internal.tasks.testing.junit.AbstractJUnitTestClassProcessor.processTestClass(AbstractJUnitTestClassProcessor.java:62)
	at org.gradle.api.internal.tasks.testing.SuiteTestClassProcessor.processTestClass(SuiteTestClassProcessor.java:51)
	at java.base/jdk.internal.reflect.NativeMethodAccessorImpl.invoke0(Native Method)
	at java.base/jdk.internal.reflect.NativeMethodAccessorImpl.invoke(NativeMethodAccessorImpl.java:62)
	at java.base/jdk.internal.reflect.DelegatingMethodAccessorImpl.invoke(DelegatingMethodAccessorImpl.java:43)
	at java.base/java.lang.reflect.Method.invoke(Method.java:567)
	at org.gradle.internal.dispatch.ReflectionDispatch.dispatch(ReflectionDispatch.java:36)
	at org.gradle.internal.dispatch.ReflectionDispatch.dispatch(ReflectionDispatch.java:24)
	at org.gradle.internal.dispatch.ContextClassLoaderDispatch.dispatch(ContextClassLoaderDispatch.java:33)
	at org.gradle.internal.dispatch.ProxyDispatchAdapter$DispatchingInvocationHandler.invoke(ProxyDispatchAdapter.java:94)
	at com.sun.proxy.$Proxy2.processTestClass(Unknown Source)
	at org.gradle.api.internal.tasks.testing.worker.TestWorker.processTestClass(TestWorker.java:118)
	at java.base/jdk.internal.reflect.NativeMethodAccessorImpl.invoke0(Native Method)
	at java.base/jdk.internal.reflect.NativeMethodAccessorImpl.invoke(NativeMethodAccessorImpl.java:62)
	at java.base/jdk.internal.reflect.DelegatingMethodAccessorImpl.invoke(DelegatingMethodAccessorImpl.java:43)
	at java.base/java.lang.reflect.Method.invoke(Method.java:567)
	at org.gradle.internal.dispatch.ReflectionDispatch.dispatch(ReflectionDispatch.java:36)
	at org.gradle.internal.dispatch.ReflectionDispatch.dispatch(ReflectionDispatch.java:24)
	at org.gradle.internal.remote.internal.hub.MessageHubBackedObjectConnection$DispatchWrapper.dispatch(MessageHubBackedObjectConnection.java:182)
	at org.gradle.internal.remote.internal.hub.MessageHubBackedObjectConnection$DispatchWrapper.dispatch(MessageHubBackedObjectConnection.java:164)
	at org.gradle.internal.remote.internal.hub.MessageHub$Handler.run(MessageHub.java:413)
	at org.gradle.internal.concurrent.ExecutorPolicy$CatchAndRecordFailures.onExecute(ExecutorPolicy.java:64)
	at org.gradle.internal.concurrent.ManagedExecutorImpl$1.run(ManagedExecutorImpl.java:48)
	at java.base/java.util.concurrent.ThreadPoolExecutor.runWorker(ThreadPoolExecutor.java:1128)
	at java.base/java.util.concurrent.ThreadPoolExecutor$Worker.run(ThreadPoolExecutor.java:628)
	at org.gradle.internal.concurrent.ThreadFactoryImpl$ManagedThreadRunnable.run(ThreadFactoryImpl.java:56)
	at java.base/java.lang.Thread.run(Thread.java:835)




Build Log:
[...truncated 19757 lines...]
ERROR: The following test(s) have failed:
  - org.apache.lucene.util.TestSysoutsLimits.testOverSoftLimit (:lucene:test-framework)
    Test output: /Users/jenkins/workspace/Lucene-Solr-cloud2refimpl-MacOSX/lucene/test-framework/build/test-results/test/outputs/OUTPUT-org.apache.lucene.util.TestSysoutsLimits.txt
    Reproduce with: gradlew :lucene:test-framework:test --tests "org.apache.lucene.util.TestSysoutsLimits" -Ptests.seed=70F59416C696FFB6 -Ptests.file.encoding=ISO-8859-1

  - org.apache.lucene.util.TestSysoutsLimits.OverHardLimit (:lucene:test-framework)
    Test output: /Users/jenkins/workspace/Lucene-Solr-cloud2refimpl-MacOSX/lucene/test-framework/build/test-results/test/outputs/OUTPUT-org.apache.lucene.util.TestSysoutsLimits.txt
    Reproduce with: gradlew :lucene:test-framework:test --tests "org.apache.lucene.util.TestSysoutsLimits" -Ptests.seed=70F59416C696FFB6 -Ptests.file.encoding=ISO-8859-1

  - org.apache.lucene.codecs.uniformsplit.sharedterms.TestSTUniformSplitPostingFormat.testCheckIntegrityReadsAllBytes (:lucene:codecs)
    Test output: /Users/jenkins/workspace/Lucene-Solr-cloud2refimpl-MacOSX/lucene/codecs/build/test-results/test/outputs/OUTPUT-org.apache.lucene.codecs.uniformsplit.sharedterms.TestSTUniformSplitPostingFormat.txt
    Reproduce with: gradlew :lucene:codecs:test --tests "org.apache.lucene.codecs.uniformsplit.sharedterms.TestSTUniformSplitPostingFormat" -Ptests.seed=70F59416C696FFB6 -Ptests.file.encoding=ISO-8859-1

  - org.apache.lucene.codecs.uniformsplit.TestUniformSplitPostingFormat.testCheckIntegrityReadsAllBytes (:lucene:codecs)
    Test output: /Users/jenkins/workspace/Lucene-Solr-cloud2refimpl-MacOSX/lucene/codecs/build/test-results/test/outputs/OUTPUT-org.apache.lucene.codecs.uniformsplit.TestUniformSplitPostingFormat.txt
    Reproduce with: gradlew :lucene:codecs:test --tests "org.apache.lucene.codecs.uniformsplit.TestUniformSplitPostingFormat" -Ptests.seed=70F59416C696FFB6 -Ptests.file.encoding=ISO-8859-1

  - org.apache.lucene.analysis.synonym.TestSynonymFilterFactory.testFormat (:lucene:analysis:common)
    Test output: /Users/jenkins/workspace/Lucene-Solr-cloud2refimpl-MacOSX/lucene/analysis/common/build/test-results/test/outputs/OUTPUT-org.apache.lucene.analysis.synonym.TestSynonymFilterFactory.txt
    Reproduce with: gradlew :lucene:analysis:common:test --tests "org.apache.lucene.analysis.synonym.TestSynonymFilterFactory" -Ptests.seed=70F59416C696FFB6 -Ptests.file.encoding=ISO-8859-1

  - org.apache.lucene.analysis.synonym.TestSynonymFilterFactory.testSynonyms (:lucene:analysis:common)
    Test output: /Users/jenkins/workspace/Lucene-Solr-cloud2refimpl-MacOSX/lucene/analysis/common/build/test-results/test/outputs/OUTPUT-org.apache.lucene.analysis.synonym.TestSynonymFilterFactory.txt
    Reproduce with: gradlew :lucene:analysis:common:test --tests "org.apache.lucene.analysis.synonym.TestSynonymFilterFactory" -Ptests.seed=70F59416C696FFB6 -Ptests.file.encoding=ISO-8859-1


FAILURE: Build completed with 50 failures.

1: Task failed with an exception.
-----------
* What went wrong:
Execution failed for task ':checkUnusedConstraints'.
> There are unused pins in your versions.props: 
  [com.fasterxml.woodstox:woodstox-core:6.0.3, org.awaitility:awaitility:4.0.3]
  
  Rerun with --fix to remove them.

* Try:
Run with --stacktrace option to get the stack trace. Run with --info or --debug option to get more log output. Run with --scan to get full insights.
==============================================================================

2: Task failed with an exception.
-----------
* Where:
Script '/Users/jenkins/workspace/Lucene-Solr-cloud2refimpl-MacOSX/gradle/validation/validate-source-patterns.gradle' line: 40

* What went wrong:
Execution failed for task ':validateSourcePatterns'.
> Found 440 violations in source files (invalid logger name [log, uses static class name, not specialized logger], invalid logging pattern [not private static final, uses static class name], nocommit).

* Try:
Run with --stacktrace option to get the stack trace. Run with --info or --debug option to get more log output. Run with --scan to get full insights.
==============================================================================

3: Task failed with an exception.
-----------
* What went wrong:
Execution failed for task ':verifyLocks'.
> Found dependencies that were not in the lock state: [org.awaitility:awaitility]. Please run './gradlew --write-locks'.

* Try:
Run with --stacktrace option to get the stack trace. Run with --info or --debug option to get more log output. Run with --scan to get full insights.
==============================================================================

4: Task failed with an exception.
-----------
* Where:
Script '/Users/jenkins/workspace/Lucene-Solr-cloud2refimpl-MacOSX/gradle/validation/versions-props-sorted.gradle' line: 30

* What went wrong:
Execution failed for task ':versionsPropsAreSorted'.
> /Users/jenkins/workspace/Lucene-Solr-cloud2refimpl-MacOSX/versions.props file is not sorted lexicographically. I wrote a sorted file to /Users/jenkins/workspace/Lucene-Solr-cloud2refimpl-MacOSX/build/versions.props - please review and commit.

* Try:
Run with --stacktrace option to get the stack trace. Run with --info or --debug option to get more log output. Run with --scan to get full insights.
==============================================================================

5: Task failed with an exception.
-----------
* Where:
Script '/Users/jenkins/workspace/Lucene-Solr-cloud2refimpl-MacOSX/gradle/validation/jar-checks.gradle' line: 195

* What went wrong:
Execution failed for task ':lucene:replicator:validateJarChecksums'.
> Dependency checksum validation failed:
    - Dependency checksum missing ('org.eclipse.jetty:jetty-continuation:9.4.31.v20200723'), expected it at: /Users/jenkins/workspace/Lucene-Solr-cloud2refimpl-MacOSX/lucene/licenses/jetty-continuation-9.4.31.v20200723.jar.sha1
    - Dependency checksum missing ('org.eclipse.jetty:jetty-http:9.4.31.v20200723'), expected it at: /Users/jenkins/workspace/Lucene-Solr-cloud2refimpl-MacOSX/lucene/licenses/jetty-http-9.4.31.v20200723.jar.sha1
    - Dependency checksum missing ('org.eclipse.jetty:jetty-io:9.4.31.v20200723'), expected it at: /Users/jenkins/workspace/Lucene-Solr-cloud2refimpl-MacOSX/lucene/licenses/jetty-io-9.4.31.v20200723.jar.sha1
    - Dependency checksum missing ('org.eclipse.jetty:jetty-server:9.4.31.v20200723'), expected it at: /Users/jenkins/workspace/Lucene-Solr-cloud2refimpl-MacOSX/lucene/licenses/jetty-server-9.4.31.v20200723.jar.sha1
    - Dependency checksum missing ('org.eclipse.jetty:jetty-servlet:9.4.31.v20200723'), expected it at: /Users/jenkins/workspace/Lucene-Solr-cloud2refimpl-MacOSX/lucene/licenses/jetty-servlet-9.4.31.v20200723.jar.sha1
    - Dependency checksum missing ('org.eclipse.jetty:jetty-util:9.4.31.v20200723'), expected it at: /Users/jenkins/workspace/Lucene-Solr-cloud2refimpl-MacOSX/lucene/licenses/jetty-util-9.4.31.v20200723.jar.sha1

* Try:
Run with --stacktrace option to get the stack trace. Run with --info or --debug option to get more log output. Run with --scan to get full insights.
==============================================================================

6: Task failed with an exception.
-----------
* Where:
Script '/Users/jenkins/workspace/Lucene-Solr-cloud2refimpl-MacOSX/gradle/validation/jar-checks.gradle' line: 195

* What went wrong:
Execution failed for task ':lucene:test-framework:validateJarChecksums'.
> Dependency checksum validation failed:
    - Dependency checksum missing ('org.hamcrest:hamcrest-core:2.1'), expected it at: /Users/jenkins/workspace/Lucene-Solr-cloud2refimpl-MacOSX/lucene/licenses/hamcrest-core-2.1.jar.sha1
    - Dependency checksum missing ('org.hamcrest:hamcrest:2.1'), expected it at: /Users/jenkins/workspace/Lucene-Solr-cloud2refimpl-MacOSX/lucene/licenses/hamcrest-2.1.jar.sha1

* Try:
Run with --stacktrace option to get the stack trace. Run with --info or --debug option to get more log output. Run with --scan to get full insights.
==============================================================================

7: Task failed with an exception.
-----------
* Where:
Script '/Users/jenkins/workspace/Lucene-Solr-cloud2refimpl-MacOSX/gradle/validation/jar-checks.gradle' line: 262

* What went wrong:
Execution failed for task ':lucene:test-framework:validateJarLicenses'.
> Certain license/ notice files are missing:
    - License file missing ('org.hamcrest:hamcrest:2.1'), expected it at: /Users/jenkins/workspace/Lucene-Solr-cloud2refimpl-MacOSX/lucene/licenses/hamcrest-LICENSE-[type].txt, where [type] can be any of [ASL, BSD, BSD_LIKE, CDDL, CPL, EPL, MIT, MPL, PD, SUN, COMPOUND].

* Try:
Run with --stacktrace option to get the stack trace. Run with --info or --debug option to get more log output. Run with --scan to get full insights.
==============================================================================

8: Task failed with an exception.
-----------
* Where:
Script '/Users/jenkins/workspace/Lucene-Solr-cloud2refimpl-MacOSX/gradle/validation/jar-checks.gradle' line: 195

* What went wrong:
Execution failed for task ':solr:core:validateJarChecksums'.
> Dependency checksum validation failed:
    - Dependency checksum missing ('com.fasterxml.staxmate:staxmate:2.3.1'), expected it at: /Users/jenkins/workspace/Lucene-Solr-cloud2refimpl-MacOSX/solr/licenses/staxmate-2.3.1.jar.sha1
    - Dependency checksum missing ('com.fasterxml.woodstox:woodstox-core:6.0.3'), expected it at: /Users/jenkins/workspace/Lucene-Solr-cloud2refimpl-MacOSX/solr/licenses/woodstox-core-6.0.3.jar.sha1
    - Dependency checksum missing ('com.fasterxml:aalto-xml:1.2.2'), expected it at: /Users/jenkins/workspace/Lucene-Solr-cloud2refimpl-MacOSX/solr/licenses/aalto-xml-1.2.2.jar.sha1
    - Dependency checksum missing ('net.sf.saxon:Saxon-HE:10.1'), expected it at: /Users/jenkins/workspace/Lucene-Solr-cloud2refimpl-MacOSX/solr/licenses/Saxon-HE-10.1.jar.sha1
    - Dependency checksum missing ('org.codehaus.woodstox:stax2-api:4.2'), expected it at: /Users/jenkins/workspace/Lucene-Solr-cloud2refimpl-MacOSX/solr/licenses/stax2-api-4.2.jar.sha1
    - Dependency checksum missing ('xml-apis:xml-apis:1.4.01'), expected it at: /Users/jenkins/workspace/Lucene-Solr-cloud2refimpl-MacOSX/solr/licenses/xml-apis-1.4.01.jar.sha1

* Try:
Run with --stacktrace option to get the stack trace. Run with --info or --debug option to get more log output. Run with --scan to get full insights.
==============================================================================

9: Task failed with an exception.
-----------
* Where:
Script '/Users/jenkins/workspace/Lucene-Solr-cloud2refimpl-MacOSX/gradle/validation/jar-checks.gradle' line: 262

* What went wrong:
Execution failed for task ':solr:core:validateJarLicenses'.
> Certain license/ notice files are missing:
    - License file missing ('com.fasterxml.staxmate:staxmate:2.3.1'), expected it at: /Users/jenkins/workspace/Lucene-Solr-cloud2refimpl-MacOSX/solr/licenses/staxmate-LICENSE-[type].txt, where [type] can be any of [ASL, BSD, BSD_LIKE, CDDL, CPL, EPL, MIT, MPL, PD, SUN, COMPOUND].
    - License file missing ('com.fasterxml.woodstox:woodstox-core:6.0.3'), expected it at: /Users/jenkins/workspace/Lucene-Solr-cloud2refimpl-MacOSX/solr/licenses/woodstox-core-LICENSE-[type].txt or /Users/jenkins/workspace/Lucene-Solr-cloud2refimpl-MacOSX/solr/licenses/woodstox-LICENSE-[type].txt, where [type] can be any of [ASL, BSD, BSD_LIKE, CDDL, CPL, EPL, MIT, MPL, PD, SUN, COMPOUND].
    - License file missing ('com.fasterxml:aalto-xml:1.2.2'), expected it at: /Users/jenkins/workspace/Lucene-Solr-cloud2refimpl-MacOSX/solr/licenses/aalto-xml-LICENSE-[type].txt or /Users/jenkins/workspace/Lucene-Solr-cloud2refimpl-MacOSX/solr/licenses/aalto-LICENSE-[type].txt, where [type] can be any of [ASL, BSD, BSD_LIKE, CDDL, CPL, EPL, MIT, MPL, PD, SUN, COMPOUND].
    - License file missing ('net.sf.saxon:Saxon-HE:10.1'), expected it at: /Users/jenkins/workspace/Lucene-Solr-cloud2refimpl-MacOSX/solr/licenses/Saxon-HE-LICENSE-[type].txt or /Users/jenkins/workspace/Lucene-Solr-cloud2refimpl-MacOSX/solr/licenses/Saxon-LICENSE-[type].txt, where [type] can be any of [ASL, BSD, BSD_LIKE, CDDL, CPL, EPL, MIT, MPL, PD, SUN, COMPOUND].
    - License file missing ('xml-apis:xml-apis:1.4.01'), expected it at: /Users/jenkins/workspace/Lucene-Solr-cloud2refimpl-MacOSX/solr/licenses/xml-apis-LICENSE-[type].txt or /Users/jenkins/workspace/Lucene-Solr-cloud2refimpl-MacOSX/solr/licenses/xml-LICENSE-[type].txt, where [type] can be any of [ASL, BSD, BSD_LIKE, CDDL, CPL, EPL, MIT, MPL, PD, SUN, COMPOUND].

* Try:
Run with --stacktrace option to get the stack trace. Run with --info or --debug option to get more log output. Run with --scan to get full insights.
==============================================================================

10: Task failed with an exception.
-----------
* Where:
Script '/Users/jenkins/workspace/Lucene-Solr-cloud2refimpl-MacOSX/gradle/validation/jar-checks.gradle' line: 195

* What went wrong:
Execution failed for task ':solr:server:validateJarChecksums'.
> Dependency checksum validation failed:
    - Dependency checksum missing ('org.eclipse.jetty.http2:http2-common:9.4.31.v20200723'), expected it at: /Users/jenkins/workspace/Lucene-Solr-cloud2refimpl-MacOSX/solr/licenses/http2-common-9.4.31.v20200723.jar.sha1
    - Dependency checksum missing ('org.eclipse.jetty.http2:http2-hpack:9.4.31.v20200723'), expected it at: /Users/jenkins/workspace/Lucene-Solr-cloud2refimpl-MacOSX/solr/licenses/http2-hpack-9.4.31.v20200723.jar.sha1
    - Dependency checksum missing ('org.eclipse.jetty.http2:http2-server:9.4.31.v20200723'), expected it at: /Users/jenkins/workspace/Lucene-Solr-cloud2refimpl-MacOSX/solr/licenses/http2-server-9.4.31.v20200723.jar.sha1
    - Dependency checksum missing ('org.eclipse.jetty:jetty-alpn-java-server:9.4.31.v20200723'), expected it at: /Users/jenkins/workspace/Lucene-Solr-cloud2refimpl-MacOSX/solr/licenses/jetty-alpn-java-server-9.4.31.v20200723.jar.sha1
    - Dependency checksum missing ('org.eclipse.jetty:jetty-alpn-server:9.4.31.v20200723'), expected it at: /Users/jenkins/workspace/Lucene-Solr-cloud2refimpl-MacOSX/solr/licenses/jetty-alpn-server-9.4.31.v20200723.jar.sha1
    - Dependency checksum missing ('org.eclipse.jetty:jetty-continuation:9.4.31.v20200723'), expected it at: /Users/jenkins/workspace/Lucene-Solr-cloud2refimpl-MacOSX/solr/licenses/jetty-continuation-9.4.31.v20200723.jar.sha1
    - Dependency checksum missing ('org.eclipse.jetty:jetty-deploy:9.4.31.v20200723'), expected it at: /Users/jenkins/workspace/Lucene-Solr-cloud2refimpl-MacOSX/solr/licenses/jetty-deploy-9.4.31.v20200723.jar.sha1
    - Dependency checksum missing ('org.eclipse.jetty:jetty-http:9.4.31.v20200723'), expected it at: /Users/jenkins/workspace/Lucene-Solr-cloud2refimpl-MacOSX/solr/licenses/jetty-http-9.4.31.v20200723.jar.sha1
    - Dependency checksum missing ('org.eclipse.jetty:jetty-io:9.4.31.v20200723'), expected it at: /Users/jenkins/workspace/Lucene-Solr-cloud2refimpl-MacOSX/solr/licenses/jetty-io-9.4.31.v20200723.jar.sha1
    - Dependency checksum missing ('org.eclipse.jetty:jetty-jmx:9.4.31.v20200723'), expected it at: /Users/jenkins/workspace/Lucene-Solr-cloud2refimpl-MacOSX/solr/licenses/jetty-jmx-9.4.31.v20200723.jar.sha1
    - Dependency checksum missing ('org.eclipse.jetty:jetty-rewrite:9.4.31.v20200723'), expected it at: /Users/jenkins/workspace/Lucene-Solr-cloud2refimpl-MacOSX/solr/licenses/jetty-rewrite-9.4.31.v20200723.jar.sha1
    - Dependency checksum missing ('org.eclipse.jetty:jetty-security:9.4.31.v20200723'), expected it at: /Users/jenkins/workspace/Lucene-Solr-cloud2refimpl-MacOSX/solr/licenses/jetty-security-9.4.31.v20200723.jar.sha1
    - Dependency checksum missing ('org.eclipse.jetty:jetty-server:9.4.31.v20200723'), expected it at: /Users/jenkins/workspace/Lucene-Solr-cloud2refimpl-MacOSX/solr/licenses/jetty-server-9.4.31.v20200723.jar.sha1
    - Dependency checksum missing ('org.eclipse.jetty:jetty-servlet:9.4.31.v20200723'), expected it at: /Users/jenkins/workspace/Lucene-Solr-cloud2refimpl-MacOSX/solr/licenses/jetty-servlet-9.4.31.v20200723.jar.sha1
    - Dependency checksum missing ('org.eclipse.jetty:jetty-servlets:9.4.31.v20200723'), expected it at: /Users/jenkins/workspace/Lucene-Solr-cloud2refimpl-MacOSX/solr/licenses/jetty-servlets-9.4.31.v20200723.jar.sha1
    - Dependency checksum missing ('org.eclipse.jetty:jetty-start:9.4.31.v20200723'), expected it at: /Users/jenkins/workspace/Lucene-Solr-cloud2refimpl-MacOSX/solr/licenses/jetty-start-9.4.31.v20200723-shaded.jar.sha1
    - Dependency checksum missing ('org.eclipse.jetty:jetty-util:9.4.31.v20200723'), expected it at: /Users/jenkins/workspace/Lucene-Solr-cloud2refimpl-MacOSX/solr/licenses/jetty-util-9.4.31.v20200723.jar.sha1
    - Dependency checksum missing ('org.eclipse.jetty:jetty-webapp:9.4.31.v20200723'), expected it at: /Users/jenkins/workspace/Lucene-Solr-cloud2refimpl-MacOSX/solr/licenses/jetty-webapp-9.4.31.v20200723.jar.sha1
    - Dependency checksum missing ('org.eclipse.jetty:jetty-xml:9.4.31.v20200723'), expected it at: /Users/jenkins/workspace/Lucene-Solr-cloud2refimpl-MacOSX/solr/licenses/jetty-xml-9.4.31.v20200723.jar.sha1

* Try:
Run with --stacktrace option to get the stack trace. Run with --info or --debug option to get more log output. Run with --scan to get full insights.
==============================================================================

11: Task failed with an exception.
-----------
* Where:
Script '/Users/jenkins/workspace/Lucene-Solr-cloud2refimpl-MacOSX/gradle/validation/jar-checks.gradle' line: 195

* What went wrong:
Execution failed for task ':solr:solrj:validateJarChecksums'.
> Dependency checksum validation failed:
    - Dependency checksum missing ('com.fasterxml.woodstox:woodstox-core:6.0.3'), expected it at: /Users/jenkins/workspace/Lucene-Solr-cloud2refimpl-MacOSX/solr/licenses/woodstox-core-6.0.3.jar.sha1
    - Dependency checksum missing ('org.codehaus.woodstox:stax2-api:4.2'), expected it at: /Users/jenkins/workspace/Lucene-Solr-cloud2refimpl-MacOSX/solr/licenses/stax2-api-4.2.jar.sha1
    - Dependency checksum missing ('org.eclipse.jetty.http2:http2-client:9.4.31.v20200723'), expected it at: /Users/jenkins/workspace/Lucene-Solr-cloud2refimpl-MacOSX/solr/licenses/http2-client-9.4.31.v20200723.jar.sha1
    - Dependency checksum missing ('org.eclipse.jetty.http2:http2-common:9.4.31.v20200723'), expected it at: /Users/jenkins/workspace/Lucene-Solr-cloud2refimpl-MacOSX/solr/licenses/http2-common-9.4.31.v20200723.jar.sha1
    - Dependency checksum missing ('org.eclipse.jetty.http2:http2-hpack:9.4.31.v20200723'), expected it at: /Users/jenkins/workspace/Lucene-Solr-cloud2refimpl-MacOSX/solr/licenses/http2-hpack-9.4.31.v20200723.jar.sha1
    - Dependency checksum missing ('org.eclipse.jetty.http2:http2-http-client-transport:9.4.31.v20200723'), expected it at: /Users/jenkins/workspace/Lucene-Solr-cloud2refimpl-MacOSX/solr/licenses/http2-http-client-transport-9.4.31.v20200723.jar.sha1
    - Dependency checksum missing ('org.eclipse.jetty:jetty-alpn-client:9.4.31.v20200723'), expected it at: /Users/jenkins/workspace/Lucene-Solr-cloud2refimpl-MacOSX/solr/licenses/jetty-alpn-client-9.4.31.v20200723.jar.sha1
    - Dependency checksum missing ('org.eclipse.jetty:jetty-alpn-java-client:9.4.31.v20200723'), expected it at: /Users/jenkins/workspace/Lucene-Solr-cloud2refimpl-MacOSX/solr/licenses/jetty-alpn-java-client-9.4.31.v20200723.jar.sha1
    - Dependency checksum missing ('org.eclipse.jetty:jetty-alpn-java-server:9.4.31.v20200723'), expected it at: /Users/jenkins/workspace/Lucene-Solr-cloud2refimpl-MacOSX/solr/licenses/jetty-alpn-java-server-9.4.31.v20200723.jar.sha1
    - Dependency checksum missing ('org.eclipse.jetty:jetty-alpn-server:9.4.31.v20200723'), expected it at: /Users/jenkins/workspace/Lucene-Solr-cloud2refimpl-MacOSX/solr/licenses/jetty-alpn-server-9.4.31.v20200723.jar.sha1
    - Dependency checksum missing ('org.eclipse.jetty:jetty-client:9.4.31.v20200723'), expected it at: /Users/jenkins/workspace/Lucene-Solr-cloud2refimpl-MacOSX/solr/licenses/jetty-client-9.4.31.v20200723.jar.sha1
    - Dependency checksum missing ('org.eclipse.jetty:jetty-http:9.4.31.v20200723'), expected it at: /Users/jenkins/workspace/Lucene-Solr-cloud2refimpl-MacOSX/solr/licenses/jetty-http-9.4.31.v20200723.jar.sha1
    - Dependency checksum missing ('org.eclipse.jetty:jetty-io:9.4.31.v20200723'), expected it at: /Users/jenkins/workspace/Lucene-Solr-cloud2refimpl-MacOSX/solr/licenses/jetty-io-9.4.31.v20200723.jar.sha1
    - Dependency checksum missing ('org.eclipse.jetty:jetty-security:9.4.31.v20200723'), expected it at: /Users/jenkins/workspace/Lucene-Solr-cloud2refimpl-MacOSX/solr/licenses/jetty-security-9.4.31.v20200723.jar.sha1
    - Dependency checksum missing ('org.eclipse.jetty:jetty-server:9.4.31.v20200723'), expected it at: /Users/jenkins/workspace/Lucene-Solr-cloud2refimpl-MacOSX/solr/licenses/jetty-server-9.4.31.v20200723.jar.sha1
    - Dependency checksum missing ('org.eclipse.jetty:jetty-servlet:9.4.31.v20200723'), expected it at: /Users/jenkins/workspace/Lucene-Solr-cloud2refimpl-MacOSX/solr/licenses/jetty-servlet-9.4.31.v20200723.jar.sha1
    - Dependency checksum missing ('org.eclipse.jetty:jetty-util:9.4.31.v20200723'), expected it at: /Users/jenkins/workspace/Lucene-Solr-cloud2refimpl-MacOSX/solr/licenses/jetty-util-9.4.31.v20200723.jar.sha1
    - Dependency checksum missing ('org.eclipse.jetty:jetty-webapp:9.4.31.v20200723'), expected it at: /Users/jenkins/workspace/Lucene-Solr-cloud2refimpl-MacOSX/solr/licenses/jetty-webapp-9.4.31.v20200723.jar.sha1
    - Dependency checksum missing ('org.eclipse.jetty:jetty-xml:9.4.31.v20200723'), expected it at: /Users/jenkins/workspace/Lucene-Solr-cloud2refimpl-MacOSX/solr/licenses/jetty-xml-9.4.31.v20200723.jar.sha1

* Try:
Run with --stacktrace option to get the stack trace. Run with --info or --debug option to get more log output. Run with --scan to get full insights.
==============================================================================

12: Task failed with an exception.
-----------
* Where:
Script '/Users/jenkins/workspace/Lucene-Solr-cloud2refimpl-MacOSX/gradle/validation/jar-checks.gradle' line: 262

* What went wrong:
Execution failed for task ':solr:solrj:validateJarLicenses'.
> Certain license/ notice files are missing:
    - License file missing ('com.fasterxml.woodstox:woodstox-core:6.0.3'), expected it at: /Users/jenkins/workspace/Lucene-Solr-cloud2refimpl-MacOSX/solr/licenses/woodstox-core-LICENSE-[type].txt or /Users/jenkins/workspace/Lucene-Solr-cloud2refimpl-MacOSX/solr/licenses/woodstox-LICENSE-[type].txt, where [type] can be any of [ASL, BSD, BSD_LIKE, CDDL, CPL, EPL, MIT, MPL, PD, SUN, COMPOUND].

* Try:
Run with --stacktrace option to get the stack trace. Run with --info or --debug option to get more log output. Run with --scan to get full insights.
==============================================================================

13: Task failed with an exception.
-----------
* Where:
Script '/Users/jenkins/workspace/Lucene-Solr-cloud2refimpl-MacOSX/gradle/validation/jar-checks.gradle' line: 195

* What went wrong:
Execution failed for task ':solr:test-framework:validateJarChecksums'.
> Dependency checksum validation failed:
    - Dependency checksum missing ('org.awaitility:awaitility:4.0.3'), expected it at: /Users/jenkins/workspace/Lucene-Solr-cloud2refimpl-MacOSX/solr/licenses/awaitility-4.0.3.jar.sha1
    - Dependency checksum missing ('org.eclipse.jetty:jetty-http:9.4.31.v20200723'), expected it at: /Users/jenkins/workspace/Lucene-Solr-cloud2refimpl-MacOSX/solr/licenses/jetty-http-9.4.31.v20200723.jar.sha1
    - Dependency checksum missing ('org.eclipse.jetty:jetty-io:9.4.31.v20200723'), expected it at: /Users/jenkins/workspace/Lucene-Solr-cloud2refimpl-MacOSX/solr/licenses/jetty-io-9.4.31.v20200723.jar.sha1
    - Dependency checksum missing ('org.eclipse.jetty:jetty-server:9.4.31.v20200723'), expected it at: /Users/jenkins/workspace/Lucene-Solr-cloud2refimpl-MacOSX/solr/licenses/jetty-server-9.4.31.v20200723.jar.sha1
    - Dependency checksum missing ('org.eclipse.jetty:jetty-util:9.4.31.v20200723'), expected it at: /Users/jenkins/workspace/Lucene-Solr-cloud2refimpl-MacOSX/solr/licenses/jetty-util-9.4.31.v20200723.jar.sha1
    - Dependency checksum missing ('org.hamcrest:hamcrest-core:2.1'), expected it at: /Users/jenkins/workspace/Lucene-Solr-cloud2refimpl-MacOSX/solr/licenses/hamcrest-core-2.1.jar.sha1
    - Dependency checksum missing ('org.hamcrest:hamcrest:2.1'), expected it at: /Users/jenkins/workspace/Lucene-Solr-cloud2refimpl-MacOSX/solr/licenses/hamcrest-2.1.jar.sha1

* Try:
Run with --stacktrace option to get the stack trace. Run with --info or --debug option to get more log output. Run with --scan to get full insights.
==============================================================================

14: Task failed with an exception.
-----------
* Where:
Script '/Users/jenkins/workspace/Lucene-Solr-cloud2refimpl-MacOSX/gradle/validation/jar-checks.gradle' line: 262

* What went wrong:
Execution failed for task ':solr:test-framework:validateJarLicenses'.
> Certain license/ notice files are missing:
    - License file missing ('org.awaitility:awaitility:4.0.3'), expected it at: /Users/jenkins/workspace/Lucene-Solr-cloud2refimpl-MacOSX/solr/licenses/awaitility-LICENSE-[type].txt, where [type] can be any of [ASL, BSD, BSD_LIKE, CDDL, CPL, EPL, MIT, MPL, PD, SUN, COMPOUND].
    - License file missing ('org.hamcrest:hamcrest:2.1'), expected it at: /Users/jenkins/workspace/Lucene-Solr-cloud2refimpl-MacOSX/solr/licenses/hamcrest-LICENSE-[type].txt, where [type] can be any of [ASL, BSD, BSD_LIKE, CDDL, CPL, EPL, MIT, MPL, PD, SUN, COMPOUND].

* Try:
Run with --stacktrace option to get the stack trace. Run with --info or --debug option to get more log output. Run with --scan to get full insights.
==============================================================================

15: Task failed with an exception.
-----------
* Where:
Script '/Users/jenkins/workspace/Lucene-Solr-cloud2refimpl-MacOSX/gradle/validation/jar-checks.gradle' line: 195

* What went wrong:
Execution failed for task ':solr:contrib:dataimporthandler:validateJarChecksums'.
> Dependency checksum validation failed:
    - Dependency checksum missing ('xml-apis:xml-apis:1.4.01'), expected it at: /Users/jenkins/workspace/Lucene-Solr-cloud2refimpl-MacOSX/solr/licenses/xml-apis-1.4.01.jar.sha1

* Try:
Run with --stacktrace option to get the stack trace. Run with --info or --debug option to get more log output. Run with --scan to get full insights.
==============================================================================

16: Task failed with an exception.
-----------
* Where:
Script '/Users/jenkins/workspace/Lucene-Solr-cloud2refimpl-MacOSX/gradle/validation/jar-checks.gradle' line: 262

* What went wrong:
Execution failed for task ':solr:contrib:dataimporthandler:validateJarLicenses'.
> Certain license/ notice files are missing:
    - License file missing ('xml-apis:xml-apis:1.4.01'), expected it at: /Users/jenkins/workspace/Lucene-Solr-cloud2refimpl-MacOSX/solr/licenses/xml-apis-LICENSE-[type].txt or /Users/jenkins/workspace/Lucene-Solr-cloud2refimpl-MacOSX/solr/licenses/xml-LICENSE-[type].txt, where [type] can be any of [ASL, BSD, BSD_LIKE, CDDL, CPL, EPL, MIT, MPL, PD, SUN, COMPOUND].

* Try:
Run with --stacktrace option to get the stack trace. Run with --info or --debug option to get more log output. Run with --scan to get full insights.
==============================================================================

17: Task failed with an exception.
-----------
* Where:
Script '/Users/jenkins/workspace/Lucene-Solr-cloud2refimpl-MacOSX/gradle/validation/jar-checks.gradle' line: 195

* What went wrong:
Execution failed for task ':solr:contrib:extraction:validateJarChecksums'.
> Dependency checksum validation failed:
    - Dependency checksum missing ('xml-apis:xml-apis:1.4.01'), expected it at: /Users/jenkins/workspace/Lucene-Solr-cloud2refimpl-MacOSX/solr/licenses/xml-apis-1.4.01.jar.sha1

* Try:
Run with --stacktrace option to get the stack trace. Run with --info or --debug option to get more log output. Run with --scan to get full insights.
==============================================================================

18: Task failed with an exception.
-----------
* Where:
Script '/Users/jenkins/workspace/Lucene-Solr-cloud2refimpl-MacOSX/gradle/validation/jar-checks.gradle' line: 262

* What went wrong:
Execution failed for task ':solr:contrib:extraction:validateJarLicenses'.
> Certain license/ notice files are missing:
    - License file missing ('xml-apis:xml-apis:1.4.01'), expected it at: /Users/jenkins/workspace/Lucene-Solr-cloud2refimpl-MacOSX/solr/licenses/xml-apis-LICENSE-[type].txt or /Users/jenkins/workspace/Lucene-Solr-cloud2refimpl-MacOSX/solr/licenses/xml-LICENSE-[type].txt, where [type] can be any of [ASL, BSD, BSD_LIKE, CDDL, CPL, EPL, MIT, MPL, PD, SUN, COMPOUND].

* Try:
Run with --stacktrace option to get the stack trace. Run with --info or --debug option to get more log output. Run with --scan to get full insights.
==============================================================================

19: Task failed with an exception.
-----------
* Where:
Script '/Users/jenkins/workspace/Lucene-Solr-cloud2refimpl-MacOSX/gradle/validation/jar-checks.gradle' line: 195

* What went wrong:
Execution failed for task ':solr:contrib:prometheus-exporter:validateJarChecksums'.
> Dependency checksum validation failed:
    - Dependency checksum missing ('org.eclipse.jetty:jetty-http:9.4.31.v20200723'), expected it at: /Users/jenkins/workspace/Lucene-Solr-cloud2refimpl-MacOSX/solr/licenses/jetty-http-9.4.31.v20200723.jar.sha1
    - Dependency checksum missing ('org.eclipse.jetty:jetty-io:9.4.31.v20200723'), expected it at: /Users/jenkins/workspace/Lucene-Solr-cloud2refimpl-MacOSX/solr/licenses/jetty-io-9.4.31.v20200723.jar.sha1
    - Dependency checksum missing ('org.eclipse.jetty:jetty-security:9.4.31.v20200723'), expected it at: /Users/jenkins/workspace/Lucene-Solr-cloud2refimpl-MacOSX/solr/licenses/jetty-security-9.4.31.v20200723.jar.sha1
    - Dependency checksum missing ('org.eclipse.jetty:jetty-server:9.4.31.v20200723'), expected it at: /Users/jenkins/workspace/Lucene-Solr-cloud2refimpl-MacOSX/solr/licenses/jetty-server-9.4.31.v20200723.jar.sha1
    - Dependency checksum missing ('org.eclipse.jetty:jetty-servlet:9.4.31.v20200723'), expected it at: /Users/jenkins/workspace/Lucene-Solr-cloud2refimpl-MacOSX/solr/licenses/jetty-servlet-9.4.31.v20200723.jar.sha1
    - Dependency checksum missing ('org.eclipse.jetty:jetty-util:9.4.31.v20200723'), expected it at: /Users/jenkins/workspace/Lucene-Solr-cloud2refimpl-MacOSX/solr/licenses/jetty-util-9.4.31.v20200723.jar.sha1

* Try:
Run with --stacktrace option to get the stack trace. Run with --info or --debug option to get more log output. Run with --scan to get full insights.
==============================================================================

20: Task failed with an exception.
-----------
* Where:
Script '/Users/jenkins/workspace/Lucene-Solr-cloud2refimpl-MacOSX/gradle/validation/missing-docs-check.gradle' line: 105

* What went wrong:
Execution failed for task ':lucene:benchmark:checkMissingDocsDefault'.
> Javadoc verification failed:
  
  /Users/jenkins/workspace/Lucene-Solr-cloud2refimpl-MacOSX/lucene/benchmark/build/docs/javadoc/org/apache/lucene/benchmark/utils/package-summary.html
    missing description: PropertiesUtil
  
  Missing javadocs were found!


* Try:
Run with --stacktrace option to get the stack trace. Run with --info or --debug option to get more log output. Run with --scan to get full insights.
==============================================================================

21: Task failed with an exception.
-----------
* What went wrong:
Execution failed for task ':lucene:suggest:ecjLintMain'.
> Process 'command '/Users/jenkins/tools/java/64bit/jdk-12.0.2/bin/java'' finished with non-zero exit value 255

* Try:
Run with --stacktrace option to get the stack trace. Run with --info or --debug option to get more log output. Run with --scan to get full insights.
==============================================================================

22: Task failed with an exception.
-----------
* What went wrong:
Execution failed for task ':lucene:test-framework:ecjLintMain'.
> Process 'command '/Users/jenkins/tools/java/64bit/jdk-12.0.2/bin/java'' finished with non-zero exit value 255

* Try:
Run with --stacktrace option to get the stack trace. Run with --info or --debug option to get more log output. Run with --scan to get full insights.
==============================================================================

23: Task failed with an exception.
-----------
* What went wrong:
Execution failed for task ':solr:core:ecjLintMain'.
> Process 'command '/Users/jenkins/tools/java/64bit/jdk-12.0.2/bin/java'' finished with non-zero exit value 255

* Try:
Run with --stacktrace option to get the stack trace. Run with --info or --debug option to get more log output. Run with --scan to get full insights.
==============================================================================

24: Task failed with an exception.
-----------
* What went wrong:
Execution failed for task ':solr:core:ecjLintTest'.
> Process 'command '/Users/jenkins/tools/java/64bit/jdk-12.0.2/bin/java'' finished with non-zero exit value 255

* Try:
Run with --stacktrace option to get the stack trace. Run with --info or --debug option to get more log output. Run with --scan to get full insights.
==============================================================================

25: Task failed with an exception.
-----------
* What went wrong:
Execution failed for task ':solr:core:forbiddenApisMain'.
> de.thetaphi.forbiddenapis.ForbiddenApiException: Check for forbidden API calls failed, see log.

* Try:
Run with --stacktrace option to get the stack trace. Run with --info or --debug option to get more log output. Run with --scan to get full insights.
==============================================================================

26: Task failed with an exception.
-----------
* What went wrong:
Execution failed for task ':solr:core:forbiddenApisTest'.
> de.thetaphi.forbiddenapis.ForbiddenApiException: Check for forbidden API calls failed, see log.

* Try:
Run with --stacktrace option to get the stack trace. Run with --info or --debug option to get more log output. Run with --scan to get full insights.
==============================================================================

27: Task failed with an exception.
-----------
* Where:
Script '/Users/jenkins/workspace/Lucene-Solr-cloud2refimpl-MacOSX/gradle/validation/rat-sources.gradle' line: 236

* What went wrong:
Execution failed for task ':solr:core:rat'.
> Found 4 file(s) with errors:
    - Unknown license: /Users/jenkins/workspace/Lucene-Solr-cloud2refimpl-MacOSX/solr/core/src/java/org/apache/solr/core/SolrTinyBuilder.java
    - Unknown license: /Users/jenkins/workspace/Lucene-Solr-cloud2refimpl-MacOSX/solr/core/src/java/org/apache/solr/handler/component/SolrExecutorCompletionService.java
    - Unknown license: /Users/jenkins/workspace/Lucene-Solr-cloud2refimpl-MacOSX/solr/core/src/java/org/apache/solr/metrics/SolrMetricRegistry.java
    - Unknown license: /Users/jenkins/workspace/Lucene-Solr-cloud2refimpl-MacOSX/solr/core/src/java/org/apache/solr/servlet/SolrShutdownHandler.java

* Try:
Run with --stacktrace option to get the stack trace. Run with --info or --debug option to get more log output. Run with --scan to get full insights.
==============================================================================

28: Task failed with an exception.
-----------
* Where:
Script '/Users/jenkins/workspace/Lucene-Solr-cloud2refimpl-MacOSX/gradle/validation/validate-log-calls.gradle' line: 242

* What went wrong:
Execution failed for task ':solr:core:validateLogCalls'.
> Found 264 violations in source files (
  cause: 'hasPlus: true' Suspicious logging call, Parameterize and possibly surround with 'if (log.is*Enabled) {..}'. Help at: 'gradlew helpValidateLogCalls' 
      /Users/jenkins/workspace/Lucene-Solr-cloud2refimpl-MacOSX/solr/core/src/java/org/apache/solr/handler/admin/CollectionsHandler.java:1422, 
  cause: 'hasPlus: true' Suspicious logging call, Parameterize and possibly surround with 'if (log.is*Enabled) {..}'. Help at: 'gradlew helpValidateLogCalls' 
      /Users/jenkins/workspace/Lucene-Solr-cloud2refimpl-MacOSX/solr/core/src/java/org/apache/solr/metrics/SolrMetricManager.java:582, 
  Found an unexpected log level: isdebugenabled, file: /Users/jenkins/workspace/Lucene-Solr-cloud2refimpl-MacOSX/solr/core/src/java/org/apache/solr/metrics/SolrMetricManager.java:1186, 
  cause: 'hasPlus: true' Suspicious logging call, Parameterize and possibly surround with 'if (log.is*Enabled) {..}'. Help at: 'gradlew helpValidateLogCalls' 
      /Users/jenkins/workspace/Lucene-Solr-cloud2refimpl-MacOSX/solr/core/src/java/org/apache/solr/metrics/SolrMetricManager.java:1186, 
  cause: 'hasPlus: true' Suspicious logging call, Parameterize and possibly surround with 'if (log.is*Enabled) {..}'. Help at: 'gradlew helpValidateLogCalls' 
      /Users/jenkins/workspace/Lucene-Solr-cloud2refimpl-MacOSX/solr/core/src/java/org/apache/solr/servlet/HttpSolrCall.java:694, 
  cause: 'hasPlus: true' Suspicious logging call, Parameterize and possibly surround with 'if (log.is*Enabled) {..}'. Help at: 'gradlew helpValidateLogCalls' 
      /Users/jenkins/workspace/Lucene-Solr-cloud2refimpl-MacOSX/solr/core/src/java/org/apache/solr/servlet/HttpSolrCall.java:718, 
  cause: 'hasPlus: true' Suspicious logging call, Parameterize and possibly surround with 'if (log.is*Enabled) {..}'. Help at: 'gradlew helpValidateLogCalls' 
      /Users/jenkins/workspace/Lucene-Solr-cloud2refimpl-MacOSX/solr/core/src/java/org/apache/solr/servlet/HttpSolrCall.java:721, 
  Found an unexpected log level: isdebugenabled, file: /Users/jenkins/workspace/Lucene-Solr-cloud2refimpl-MacOSX/solr/core/src/java/org/apache/solr/servlet/SolrQoSFilter.java:67, 
  cause: 'hasParens true prevLineNotIf true pernicketyLevel true' Suspicious logging call, Parameterize and possibly surround with 'if (log.is*Enabled) {..}'. Help at: 'gradlew helpValidateLogCalls' 
      /Users/jenkins/workspace/Lucene-Solr-cloud2refimpl-MacOSX/solr/core/src/java/org/apache/solr/servlet/SolrQoSFilter.java:67, 
  Found an unexpected log level: isdebugenabled, file: /Users/jenkins/workspace/Lucene-Solr-cloud2refimpl-MacOSX/solr/core/src/java/org/apache/solr/servlet/SolrQoSFilter.java:69, 
  cause: 'hasParens true prevLineNotIf true pernicketyLevel true' Suspicious logging call, Parameterize and possibly surround with 'if (log.is*Enabled) {..}'. Help at: 'gradlew helpValidateLogCalls' 
      /Users/jenkins/workspace/Lucene-Solr-cloud2refimpl-MacOSX/solr/core/src/java/org/apache/solr/servlet/SolrQoSFilter.java:69, 
  Found an unexpected log level: isdebugenabled, file: /Users/jenkins/workspace/Lucene-Solr-cloud2refimpl-MacOSX/solr/core/src/java/org/apache/solr/servlet/SolrQoSFilter.java:97, 
  cause: 'hasParens true prevLineNotIf true pernicketyLevel true' Suspicious logging call, Parameterize and possibly surround with 'if (log.is*Enabled) {..}'. Help at: 'gradlew helpValidateLogCalls' 
      /Users/jenkins/workspace/Lucene-Solr-cloud2refimpl-MacOSX/solr/core/src/java/org/apache/solr/servlet/SolrQoSFilter.java:97, 
  cause: 'hasParens true prevLineNotIf true pernicketyLevel true' Suspicious logging call, Parameterize and possibly surround with 'if (log.is*Enabled) {..}'. Help at: 'gradlew helpValidateLogCalls' 
      /Users/jenkins/workspace/Lucene-Solr-cloud2refimpl-MacOSX/solr/core/src/java/org/apache/solr/servlet/SolrDispatchFilter.java:162, 
  cause: 'hasParens true prevLineNotIf true pernicketyLevel true' Suspicious logging call, Parameterize and possibly surround with 'if (log.is*Enabled) {..}'. Help at: 'gradlew helpValidateLogCalls' 
      /Users/jenkins/workspace/Lucene-Solr-cloud2refimpl-MacOSX/solr/core/src/java/org/apache/solr/core/TransientSolrCoreCacheDefault.java:96, 
  cause: 'hasPlus: true' Suspicious logging call, Parameterize and possibly surround with 'if (log.is*Enabled) {..}'. Help at: 'gradlew helpValidateLogCalls' 
      /Users/jenkins/workspace/Lucene-Solr-cloud2refimpl-MacOSX/solr/core/src/java/org/apache/solr/core/SolrResourceLoader.java:847, 
  Found an unexpected log level: isdebugenabled, file: /Users/jenkins/workspace/Lucene-Solr-cloud2refimpl-MacOSX/solr/core/src/java/org/apache/solr/core/CachingDirectoryFactory.java:170, 
  cause: 'hasParens true prevLineNotIf true pernicketyLevel true' Suspicious logging call, Parameterize and possibly surround with 'if (log.is*Enabled) {..}'. Help at: 'gradlew helpValidateLogCalls' 
      /Users/jenkins/workspace/Lucene-Solr-cloud2refimpl-MacOSX/solr/core/src/java/org/apache/solr/core/CachingDirectoryFactory.java:170, 
  Found an unexpected log level: isdebugenabled, file: /Users/jenkins/workspace/Lucene-Solr-cloud2refimpl-MacOSX/solr/core/src/java/org/apache/solr/core/CachingDirectoryFactory.java:197, 
  cause: 'hasParens true prevLineNotIf true pernicketyLevel true' Suspicious logging call, Parameterize and possibly surround with 'if (log.is*Enabled) {..}'. Help at: 'gradlew helpValidateLogCalls' 
      /Users/jenkins/workspace/Lucene-Solr-cloud2refimpl-MacOSX/solr/core/src/java/org/apache/solr/core/CachingDirectoryFactory.java:197, 
  Found an unexpected log level: isdebugenabled, file: /Users/jenkins/workspace/Lucene-Solr-cloud2refimpl-MacOSX/solr/core/src/java/org/apache/solr/core/CachingDirectoryFactory.java:202, 
  cause: 'hasParens true prevLineNotIf true pernicketyLevel true' Suspicious logging call, Parameterize and possibly surround with 'if (log.is*Enabled) {..}'. Help at: 'gradlew helpValidateLogCalls' 
      /Users/jenkins/workspace/Lucene-Solr-cloud2refimpl-MacOSX/solr/core/src/java/org/apache/solr/core/CachingDirectoryFactory.java:202, 
  Found an unexpected log level: isdebugenabled, file: /Users/jenkins/workspace/Lucene-Solr-cloud2refimpl-MacOSX/solr/core/src/java/org/apache/solr/core/CachingDirectoryFactory.java:229, 
  cause: 'hasPlus: true' Suspicious logging call, Parameterize and possibly surround with 'if (log.is*Enabled) {..}'. Help at: 'gradlew helpValidateLogCalls' 
      /Users/jenkins/workspace/Lucene-Solr-cloud2refimpl-MacOSX/solr/core/src/java/org/apache/solr/core/CachingDirectoryFactory.java:229, 
  Found an unexpected log level: isdebugenabled, file: /Users/jenkins/workspace/Lucene-Solr-cloud2refimpl-MacOSX/solr/core/src/java/org/apache/solr/core/CachingDirectoryFactory.java:241, 
  cause: 'hasPlus: true' Suspicious logging call, Parameterize and possibly surround with 'if (log.is*Enabled) {..}'. Help at: 'gradlew helpValidateLogCalls' 
      /Users/jenkins/workspace/Lucene-Solr-cloud2refimpl-MacOSX/solr/core/src/java/org/apache/solr/core/CachingDirectoryFactory.java:241, 
  Found an unexpected log level: isdebugenabled, file: /Users/jenkins/workspace/Lucene-Solr-cloud2refimpl-MacOSX/solr/core/src/java/org/apache/solr/core/CachingDirectoryFactory.java:264, 
  cause: 'hasParens true prevLineNotIf true pernicketyLevel true' Suspicious logging call, Parameterize and possibly surround with 'if (log.is*Enabled) {..}'. Help at: 'gradlew helpValidateLogCalls' 
      /Users/jenkins/workspace/Lucene-Solr-cloud2refimpl-MacOSX/solr/core/src/java/org/apache/solr/core/CachingDirectoryFactory.java:264, 
  Found an unexpected log level: isdebugenabled, file: /Users/jenkins/workspace/Lucene-Solr-cloud2refimpl-MacOSX/solr/core/src/java/org/apache/solr/core/CachingDirectoryFactory.java:280, 
  cause: 'hasParens true prevLineNotIf true pernicketyLevel true' Suspicious logging call, Parameterize and possibly surround with 'if (log.is*Enabled) {..}'. Help at: 'gradlew helpValidateLogCalls' 
      /Users/jenkins/workspace/Lucene-Solr-cloud2refimpl-MacOSX/solr/core/src/java/org/apache/solr/core/CachingDirectoryFactory.java:280, 
  cause: 'hasPlus: true' Suspicious logging call, Parameterize and possibly surround with 'if (log.is*Enabled) {..}'. Help at: 'gradlew helpValidateLogCalls' 
      /Users/jenkins/workspace/Lucene-Solr-cloud2refimpl-MacOSX/solr/core/src/java/org/apache/solr/core/CachingDirectoryFactory.java:287, 
  Found an unexpected log level: isdebugenabled, file: /Users/jenkins/workspace/Lucene-Solr-cloud2refimpl-MacOSX/solr/core/src/java/org/apache/solr/core/CachingDirectoryFactory.java:330, 
  cause: 'hasPlus: true' Suspicious logging call, Parameterize and possibly surround with 'if (log.is*Enabled) {..}'. Help at: 'gradlew helpValidateLogCalls' 
      /Users/jenkins/workspace/Lucene-Solr-cloud2refimpl-MacOSX/solr/core/src/java/org/apache/solr/core/CachingDirectoryFactory.java:330, 
  cause: 'hasPlus: true' Suspicious logging call, Parameterize and possibly surround with 'if (log.is*Enabled) {..}'. Help at: 'gradlew helpValidateLogCalls' 
      /Users/jenkins/workspace/Lucene-Solr-cloud2refimpl-MacOSX/solr/core/src/java/org/apache/solr/core/CachingDirectoryFactory.java:335, 
  cause: 'hasPlus: true' Suspicious logging call, Parameterize and possibly surround with 'if (log.is*Enabled) {..}'. Help at: 'gradlew helpValidateLogCalls' 
      /Users/jenkins/workspace/Lucene-Solr-cloud2refimpl-MacOSX/solr/core/src/java/org/apache/solr/core/CachingDirectoryFactory.java:350, 
  Found an unexpected log level: isdebugenabled, file: /Users/jenkins/workspace/Lucene-Solr-cloud2refimpl-MacOSX/solr/core/src/java/org/apache/solr/core/CachingDirectoryFactory.java:368, 
  cause: 'hasParens true prevLineNotIf true pernicketyLevel true' Suspicious logging call, Parameterize and possibly surround with 'if (log.is*Enabled) {..}'. Help at: 'gradlew helpValidateLogCalls' 
      /Users/jenkins/workspace/Lucene-Solr-cloud2refimpl-MacOSX/solr/core/src/java/org/apache/solr/core/CachingDirectoryFactory.java:368, 
  Found an unexpected log level: isdebugenabled, file: /Users/jenkins/workspace/Lucene-Solr-cloud2refimpl-MacOSX/solr/core/src/java/org/apache/solr/core/CachingDirectoryFactory.java:371, 
  cause: 'hasPlus: true' Suspicious logging call, Parameterize and possibly surround with 'if (log.is*Enabled) {..}'. Help at: 'gradlew helpValidateLogCalls' 
      /Users/jenkins/workspace/Lucene-Solr-cloud2refimpl-MacOSX/solr/core/src/java/org/apache/solr/core/CachingDirectoryFactory.java:371, 
  Found an unexpected log level: isdebugenabled, file: /Users/jenkins/workspace/Lucene-Solr-cloud2refimpl-MacOSX/solr/core/src/java/org/apache/solr/core/CachingDirectoryFactory.java:374, 
  cause: 'hasPlus: true' Suspicious logging call, Parameterize and possibly surround with 'if (log.is*Enabled) {..}'. Help at: 'gradlew helpValidateLogCalls' 
      /Users/jenkins/workspace/Lucene-Solr-cloud2refimpl-MacOSX/solr/core/src/java/org/apache/solr/core/CachingDirectoryFactory.java:374, 
  cause: 'hasPlus: true' Suspicious logging call, Parameterize and possibly surround with 'if (log.is*Enabled) {..}'. Help at: 'gradlew helpValidateLogCalls' 
      /Users/jenkins/workspace/Lucene-Solr-cloud2refimpl-MacOSX/solr/core/src/java/org/apache/solr/core/CachingDirectoryFactory.java:379, 
  cause: 'hasParens true prevLineNotIf true pernicketyLevel true' Suspicious logging call, Parameterize and possibly surround with 'if (log.is*Enabled) {..}'. Help at: 'gradlew helpValidateLogCalls' 
      /Users/jenkins/workspace/Lucene-Solr-cloud2refimpl-MacOSX/solr/core/src/java/org/apache/solr/core/CachingDirectoryFactory.java:453, 
  Found an unexpected log level: isdebugenabled, file: /Users/jenkins/workspace/Lucene-Solr-cloud2refimpl-MacOSX/solr/core/src/java/org/apache/solr/core/CachingDirectoryFactory.java:464, 
  cause: 'hasParens true prevLineNotIf true pernicketyLevel true' Suspicious logging call, Parameterize and possibly surround with 'if (log.is*Enabled) {..}'. Help at: 'gradlew helpValidateLogCalls' 
      /Users/jenkins/workspace/Lucene-Solr-cloud2refimpl-MacOSX/solr/core/src/java/org/apache/solr/core/CachingDirectoryFactory.java:464, 
  cause: 'hasParens true prevLineNotIf true pernicketyLevel true' Suspicious logging call, Parameterize and possibly surround with 'if (log.is*Enabled) {..}'. Help at: 'gradlew helpValidateLogCalls' 
      /Users/jenkins/workspace/Lucene-Solr-cloud2refimpl-MacOSX/solr/core/src/java/org/apache/solr/core/CachingDirectoryFactory.java:497, 
  cause: 'hasPlus: true' Suspicious logging call, Parameterize and possibly surround with 'if (log.is*Enabled) {..}'. Help at: 'gradlew helpValidateLogCalls' 
      /Users/jenkins/workspace/Lucene-Solr-cloud2refimpl-MacOSX/solr/core/src/java/org/apache/solr/core/CachingDirectoryFactory.java:521, 
  cause: 'hasPlus: true' Suspicious logging call, Parameterize and possibly surround with 'if (log.is*Enabled) {..}'. Help at: 'gradlew helpValidateLogCalls' 
      /Users/jenkins/workspace/Lucene-Solr-cloud2refimpl-MacOSX/solr/core/src/java/org/apache/solr/core/CoreContainer.java:1062, 
  Found an unexpected log level: isdebugenabled, file: /Users/jenkins/workspace/Lucene-Solr-cloud2refimpl-MacOSX/solr/core/src/java/org/apache/solr/core/CoreContainer.java:1217, 
  cause: 'hasPlus: true' Suspicious logging call, Parameterize and possibly surround with 'if (log.is*Enabled) {..}'. Help at: 'gradlew helpValidateLogCalls' 
      /Users/jenkins/workspace/Lucene-Solr-cloud2refimpl-MacOSX/solr/core/src/java/org/apache/solr/core/CoreContainer.java:1217, 
  Found an unexpected log level: isdebugenabled, file: /Users/jenkins/workspace/Lucene-Solr-cloud2refimpl-MacOSX/solr/core/src/java/org/apache/solr/core/CoreContainer.java:1223, 
  cause: 'hasPlus: true' Suspicious logging call, Parameterize and possibly surround with 'if (log.is*Enabled) {..}'. Help at: 'gradlew helpValidateLogCalls' 
      /Users/jenkins/workspace/Lucene-Solr-cloud2refimpl-MacOSX/solr/core/src/java/org/apache/solr/core/CoreContainer.java:1223, 
  cause: 'hasParens true prevLineNotIf true pernicketyLevel true' Suspicious logging call, Parameterize and possibly surround with 'if (log.is*Enabled) {..}'. Help at: 'gradlew helpValidateLogCalls' 
      /Users/jenkins/workspace/Lucene-Solr-cloud2refimpl-MacOSX/solr/core/src/java/org/apache/solr/core/CoreContainer.java:1640, 
  cause: 'hasPlus: true' Suspicious logging call, Parameterize and possibly surround with 'if (log.is*Enabled) {..}'. Help at: 'gradlew helpValidateLogCalls' 
      /Users/jenkins/workspace/Lucene-Solr-cloud2refimpl-MacOSX/solr/core/src/java/org/apache/solr/core/ZkContainer.java:126, 
  Found an unexpected log level: isdebugenabled, file: /Users/jenkins/workspace/Lucene-Solr-cloud2refimpl-MacOSX/solr/core/src/java/org/apache/solr/core/ZkContainer.java:156, 
  cause: 'hasParens true prevLineNotIf true pernicketyLevel true' Suspicious logging call, Parameterize and possibly surround with 'if (log.is*Enabled) {..}'. Help at: 'gradlew helpValidateLogCalls' 
      /Users/jenkins/workspace/Lucene-Solr-cloud2refimpl-MacOSX/solr/core/src/java/org/apache/solr/core/ZkContainer.java:156, 
  cause: 'hasParens true prevLineNotIf true pernicketyLevel true' Suspicious logging call, Parameterize and possibly surround with 'if (log.is*Enabled) {..}'. Help at: 'gradlew helpValidateLogCalls' 
      /Users/jenkins/workspace/Lucene-Solr-cloud2refimpl-MacOSX/solr/core/src/java/org/apache/solr/core/ZkContainer.java:201, 
  Found an unexpected log level: isdebugenabled, file: /Users/jenkins/workspace/Lucene-Solr-cloud2refimpl-MacOSX/solr/core/src/java/org/apache/solr/update/SolrCmdDistributor.java:192, 
  cause: 'hasParens true prevLineNotIf true pernicketyLevel true' Suspicious logging call, Parameterize and possibly surround with 'if (log.is*Enabled) {..}'. Help at: 'gradlew helpValidateLogCalls' 
      /Users/jenkins/workspace/Lucene-Solr-cloud2refimpl-MacOSX/solr/core/src/java/org/apache/solr/update/SolrCmdDistributor.java:192, 
  cause: 'hasPlus: true' Suspicious logging call, Parameterize and possibly surround with 'if (log.is*Enabled) {..}'. Help at: 'gradlew helpValidateLogCalls' 
      /Users/jenkins/workspace/Lucene-Solr-cloud2refimpl-MacOSX/solr/core/src/java/org/apache/solr/update/SolrCmdDistributor.java:222, 
  Found an unexpected log level: isdebugenabled, file: /Users/jenkins/workspace/Lucene-Solr-cloud2refimpl-MacOSX/solr/core/src/java/org/apache/solr/update/SolrCmdDistributor.java:257, 
  cause: 'hasParens true prevLineNotIf true pernicketyLevel true' Suspicious logging call, Parameterize and possibly surround with 'if (log.is*Enabled) {..}'. Help at: 'gradlew helpValidateLogCalls' 
      /Users/jenkins/workspace/Lucene-Solr-cloud2refimpl-MacOSX/solr/core/src/java/org/apache/solr/update/SolrCmdDistributor.java:257, 
  cause: 'hasParens true prevLineNotIf true pernicketyLevel true' Suspicious logging call, Parameterize and possibly surround with 'if (log.is*Enabled) {..}'. Help at: 'gradlew helpValidateLogCalls' 
      /Users/jenkins/workspace/Lucene-Solr-cloud2refimpl-MacOSX/solr/core/src/java/org/apache/solr/update/SolrCmdDistributor.java:274, 
  Found an unexpected log level: isdebugenabled, file: /Users/jenkins/workspace/Lucene-Solr-cloud2refimpl-MacOSX/solr/core/src/java/org/apache/solr/update/SolrIndexWriter.java:165, 
  cause: 'hasPlus: true' Suspicious logging call, Parameterize and possibly surround with 'if (log.is*Enabled) {..}'. Help at: 'gradlew helpValidateLogCalls' 
      /Users/jenkins/workspace/Lucene-Solr-cloud2refimpl-MacOSX/solr/core/src/java/org/apache/solr/update/SolrIndexWriter.java:165, 
  Found an unexpected log level: isdebugenabled, file: /Users/jenkins/workspace/Lucene-Solr-cloud2refimpl-MacOSX/solr/core/src/java/org/apache/solr/update/SolrIndexWriter.java:181, 
  cause: 'hasPlus: true' Suspicious logging call, Parameterize and possibly surround with 'if (log.is*Enabled) {..}'. Help at: 'gradlew helpValidateLogCalls' 
      /Users/jenkins/workspace/Lucene-Solr-cloud2refimpl-MacOSX/solr/core/src/java/org/apache/solr/update/SolrIndexWriter.java:181, 
  cause: 'hasPlus: true' Suspicious logging call, Parameterize and possibly surround with 'if (log.is*Enabled) {..}'. Help at: 'gradlew helpValidateLogCalls' 
      /Users/jenkins/workspace/Lucene-Solr-cloud2refimpl-MacOSX/solr/core/src/java/org/apache/solr/update/SolrIndexWriter.java:256, 
  Found an unexpected log level: isdebugenabled, file: /Users/jenkins/workspace/Lucene-Solr-cloud2refimpl-MacOSX/solr/core/src/java/org/apache/solr/update/SolrIndexWriter.java:366, 
  cause: 'hasPlus: true' Suspicious logging call, Parameterize and possibly surround with 'if (log.is*Enabled) {..}'. Help at: 'gradlew helpValidateLogCalls' 
      /Users/jenkins/workspace/Lucene-Solr-cloud2refimpl-MacOSX/solr/core/src/java/org/apache/solr/update/SolrIndexWriter.java:366, 
  Found an unexpected log level: isdebugenabled, file: /Users/jenkins/workspace/Lucene-Solr-cloud2refimpl-MacOSX/solr/core/src/java/org/apache/solr/update/SolrIndexWriter.java:382, 
  cause: 'hasPlus: true' Suspicious logging call, Parameterize and possibly surround with 'if (log.is*Enabled) {..}'. Help at: 'gradlew helpValidateLogCalls' 
      /Users/jenkins/workspace/Lucene-Solr-cloud2refimpl-MacOSX/solr/core/src/java/org/apache/solr/update/SolrIndexWriter.java:382, 
  cause: 'hasParens true prevLineNotIf true pernicketyLevel true' Suspicious logging call, Parameterize and possibly surround with 'if (log.is*Enabled) {..}'. Help at: 'gradlew helpValidateLogCalls' 
      /Users/jenkins/workspace/Lucene-Solr-cloud2refimpl-MacOSX/solr/core/src/java/org/apache/solr/update/SolrIndexWriter.java:402, 
  Found an unexpected log level: isdebugenabled, file: /Users/jenkins/workspace/Lucene-Solr-cloud2refimpl-MacOSX/solr/core/src/java/org/apache/solr/update/processor/DistributedUpdateProcessor.java:240, 
  cause: 'hasParens true prevLineNotIf true pernicketyLevel true' Suspicious logging call, Parameterize and possibly surround with 'if (log.is*Enabled) {..}'. Help at: 'gradlew helpValidateLogCalls' 
      /Users/jenkins/workspace/Lucene-Solr-cloud2refimpl-MacOSX/solr/core/src/java/org/apache/solr/update/processor/DistributedUpdateProcessor.java:240, 
  Found an unexpected log level: isdebugenabled, file: /Users/jenkins/workspace/Lucene-Solr-cloud2refimpl-MacOSX/solr/core/src/java/org/apache/solr/update/processor/DistributedUpdateProcessor.java:257, 
  cause: 'hasParens true prevLineNotIf true pernicketyLevel true' Suspicious logging call, Parameterize and possibly surround with 'if (log.is*Enabled) {..}'. Help at: 'gradlew helpValidateLogCalls' 
      /Users/jenkins/workspace/Lucene-Solr-cloud2refimpl-MacOSX/solr/core/src/java/org/apache/solr/update/processor/DistributedUpdateProcessor.java:257, 
  Found an unexpected log level: isdebugenabled, file: /Users/jenkins/workspace/Lucene-Solr-cloud2refimpl-MacOSX/solr/core/src/java/org/apache/solr/update/processor/DistributedUpdateProcessor.java:278, 
  cause: 'hasParens true prevLineNotIf true pernicketyLevel true' Suspicious logging call, Parameterize and possibly surround with 'if (log.is*Enabled) {..}'. Help at: 'gradlew helpValidateLogCalls' 
      /Users/jenkins/workspace/Lucene-Solr-cloud2refimpl-MacOSX/solr/core/src/java/org/apache/solr/update/processor/DistributedUpdateProcessor.java:278, 
  Found an unexpected log level: isdebugenabled, file: /Users/jenkins/workspace/Lucene-Solr-cloud2refimpl-MacOSX/solr/core/src/java/org/apache/solr/update/processor/DistributedUpdateProcessor.java:281, 
  cause: 'hasParens true prevLineNotIf true pernicketyLevel true' Suspicious logging call, Parameterize and possibly surround with 'if (log.is*Enabled) {..}'. Help at: 'gradlew helpValidateLogCalls' 
      /Users/jenkins/workspace/Lucene-Solr-cloud2refimpl-MacOSX/solr/core/src/java/org/apache/solr/update/processor/DistributedUpdateProcessor.java:281, 
  Found an unexpected log level: isdebugenabled, file: /Users/jenkins/workspace/Lucene-Solr-cloud2refimpl-MacOSX/solr/core/src/java/org/apache/solr/update/processor/DistributedUpdateProcessor.java:284, 
  cause: 'hasParens true prevLineNotIf true pernicketyLevel true' Suspicious logging call, Parameterize and possibly surround with 'if (log.is*Enabled) {..}'. Help at: 'gradlew helpValidateLogCalls' 
      /Users/jenkins/workspace/Lucene-Solr-cloud2refimpl-MacOSX/solr/core/src/java/org/apache/solr/update/processor/DistributedUpdateProcessor.java:284, 
  Found an unexpected log level: isdebugenabled, file: /Users/jenkins/workspace/Lucene-Solr-cloud2refimpl-MacOSX/solr/core/src/java/org/apache/solr/update/processor/DistributedUpdateProcessor.java:287, 
  cause: 'hasParens true prevLineNotIf true pernicketyLevel true' Suspicious logging call, Parameterize and possibly surround with 'if (log.is*Enabled) {..}'. Help at: 'gradlew helpValidateLogCalls' 
      /Users/jenkins/workspace/Lucene-Solr-cloud2refimpl-MacOSX/solr/core/src/java/org/apache/solr/update/processor/DistributedUpdateProcessor.java:287, 
  Found an unexpected log level: isdebugenabled, file: /Users/jenkins/workspace/Lucene-Solr-cloud2refimpl-MacOSX/solr/core/src/java/org/apache/solr/update/processor/DistributedUpdateProcessor.java:540, 
  cause: 'hasParens true prevLineNotIf true pernicketyLevel true' Suspicious logging call, Parameterize and possibly surround with 'if (log.is*Enabled) {..}'. Help at: 'gradlew helpValidateLogCalls' 
      /Users/jenkins/workspace/Lucene-Solr-cloud2refimpl-MacOSX/solr/core/src/java/org/apache/solr/update/processor/DistributedUpdateProcessor.java:540, 
  cause: 'hasParens true prevLineNotIf true pernicketyLevel true' Suspicious logging call, Parameterize and possibly surround with 'if (log.is*Enabled) {..}'. Help at: 'gradlew helpValidateLogCalls' 
      /Users/jenkins/workspace/Lucene-Solr-cloud2refimpl-MacOSX/solr/core/src/java/org/apache/solr/update/processor/DistributedZkUpdateProcessor.java:167, 
  cause: 'hasParens true prevLineNotIf true pernicketyLevel true' Suspicious logging call, Parameterize and possibly surround with 'if (log.is*Enabled) {..}'. Help at: 'gradlew helpValidateLogCalls' 
      /Users/jenkins/workspace/Lucene-Solr-cloud2refimpl-MacOSX/solr/core/src/java/org/apache/solr/update/processor/DistributedZkUpdateProcessor.java:218, 
  cause: 'hasPlus: true' Suspicious logging call, Parameterize and possibly surround with 'if (log.is*Enabled) {..}'. Help at: 'gradlew helpValidateLogCalls' 
      /Users/jenkins/workspace/Lucene-Solr-cloud2refimpl-MacOSX/solr/core/src/java/org/apache/solr/update/processor/DistributedZkUpdateProcessor.java:222, 
  Found an unexpected log level: isdebugenabled, file: /Users/jenkins/workspace/Lucene-Solr-cloud2refimpl-MacOSX/solr/core/src/java/org/apache/solr/update/processor/DistributedZkUpdateProcessor.java:737, 
  cause: 'hasParens true prevLineNotIf true pernicketyLevel true' Suspicious logging call, Parameterize and possibly surround with 'if (log.is*Enabled) {..}'. Help at: 'gradlew helpValidateLogCalls' 
      /Users/jenkins/workspace/Lucene-Solr-cloud2refimpl-MacOSX/solr/core/src/java/org/apache/solr/update/processor/DistributedZkUpdateProcessor.java:737, 
  Found an unexpected log level: isdebugenabled, file: /Users/jenkins/workspace/Lucene-Solr-cloud2refimpl-MacOSX/solr/core/src/java/org/apache/solr/update/processor/DistributedZkUpdateProcessor.java:757, 
  cause: 'hasParens true prevLineNotIf true pernicketyLevel true' Suspicious logging call, Parameterize and possibly surround with 'if (log.is*Enabled) {..}'. Help at: 'gradlew helpValidateLogCalls' 
      /Users/jenkins/workspace/Lucene-Solr-cloud2refimpl-MacOSX/solr/core/src/java/org/apache/solr/update/processor/DistributedZkUpdateProcessor.java:757, 
  Found an unexpected log level: isdebugenabled, file: /Users/jenkins/workspace/Lucene-Solr-cloud2refimpl-MacOSX/solr/core/src/java/org/apache/solr/update/processor/DistributedZkUpdateProcessor.java:919, 
  cause: 'hasParens true prevLineNotIf true pernicketyLevel true' Suspicious logging call, Parameterize and possibly surround with 'if (log.is*Enabled) {..}'. Help at: 'gradlew helpValidateLogCalls' 
      /Users/jenkins/workspace/Lucene-Solr-cloud2refimpl-MacOSX/solr/core/src/java/org/apache/solr/update/processor/DistributedZkUpdateProcessor.java:919, 
  cause: 'hasPa

[...truncated too long message...]

ork/src/java/org/apache/solr/cloud/ZkTestServer.java:360, 
  cause: 'hasPlus: true' Suspicious logging call, Parameterize and possibly surround with 'if (log.is*Enabled) {..}'. Help at: 'gradlew helpValidateLogCalls' 
      /Users/jenkins/workspace/Lucene-Solr-cloud2refimpl-MacOSX/solr/test-framework/src/java/org/apache/solr/cloud/ZkTestServer.java:733, 
  cause: 'hasPlus: true' Suspicious logging call, Parameterize and possibly surround with 'if (log.is*Enabled) {..}'. Help at: 'gradlew helpValidateLogCalls' 
      /Users/jenkins/workspace/Lucene-Solr-cloud2refimpl-MacOSX/solr/test-framework/src/java/org/apache/solr/cloud/ZkTestServer.java:758, 
  cause: 'hasPlus: true' Suspicious logging call, Parameterize and possibly surround with 'if (log.is*Enabled) {..}'. Help at: 'gradlew helpValidateLogCalls' 
      /Users/jenkins/workspace/Lucene-Solr-cloud2refimpl-MacOSX/solr/test-framework/src/java/org/apache/solr/cloud/ZkTestServer.java:830, 
  cause: 'hasPlus: true' Suspicious logging call, Parameterize and possibly surround with 'if (log.is*Enabled) {..}'. Help at: 'gradlew helpValidateLogCalls' 
      /Users/jenkins/workspace/Lucene-Solr-cloud2refimpl-MacOSX/solr/test-framework/src/java/org/apache/solr/cloud/ZkTestServer.java:838, 
  cause: 'hasParens true prevLineNotIf true pernicketyLevel true' Suspicious logging call, Parameterize and possibly surround with 'if (log.is*Enabled) {..}'. Help at: 'gradlew helpValidateLogCalls' 
      /Users/jenkins/workspace/Lucene-Solr-cloud2refimpl-MacOSX/solr/test-framework/src/java/org/apache/solr/cloud/MiniSolrCloudCluster.java:306, 
  cause: 'hasParens true prevLineNotIf true pernicketyLevel true' Suspicious logging call, Parameterize and possibly surround with 'if (log.is*Enabled) {..}'. Help at: 'gradlew helpValidateLogCalls' 
      /Users/jenkins/workspace/Lucene-Solr-cloud2refimpl-MacOSX/solr/test-framework/src/java/org/apache/solr/cloud/MiniSolrCloudCluster.java:394, 
  cause: 'hasParens true prevLineNotIf true pernicketyLevel true' Suspicious logging call, Parameterize and possibly surround with 'if (log.is*Enabled) {..}'. Help at: 'gradlew helpValidateLogCalls' 
      /Users/jenkins/workspace/Lucene-Solr-cloud2refimpl-MacOSX/solr/test-framework/src/java/org/apache/solr/cloud/MiniSolrCloudCluster.java:931, 
  cause: 'hasParens true prevLineNotIf true pernicketyLevel true' Suspicious logging call, Parameterize and possibly surround with 'if (log.is*Enabled) {..}'. Help at: 'gradlew helpValidateLogCalls' 
      /Users/jenkins/workspace/Lucene-Solr-cloud2refimpl-MacOSX/solr/test-framework/src/java/org/apache/solr/cloud/MiniSolrCloudCluster.java:938).

* Try:
Run with --stacktrace option to get the stack trace. Run with --info or --debug option to get more log output. Run with --scan to get full insights.
==============================================================================

38: Task failed with an exception.
-----------
* What went wrong:
Execution failed for task ':solr:contrib:analytics:ecjLintMain'.
> Process 'command '/Users/jenkins/tools/java/64bit/jdk-12.0.2/bin/java'' finished with non-zero exit value 255

* Try:
Run with --stacktrace option to get the stack trace. Run with --info or --debug option to get more log output. Run with --scan to get full insights.
==============================================================================

39: Task failed with an exception.
-----------
* What went wrong:
Execution failed for task ':solr:contrib:analytics:ecjLintTest'.
> Process 'command '/Users/jenkins/tools/java/64bit/jdk-12.0.2/bin/java'' finished with non-zero exit value 255

* Try:
Run with --stacktrace option to get the stack trace. Run with --info or --debug option to get more log output. Run with --scan to get full insights.
==============================================================================

40: Task failed with an exception.
-----------
* What went wrong:
Execution failed for task ':solr:contrib:dataimporthandler:ecjLintMain'.
> Process 'command '/Users/jenkins/tools/java/64bit/jdk-12.0.2/bin/java'' finished with non-zero exit value 255

* Try:
Run with --stacktrace option to get the stack trace. Run with --info or --debug option to get more log output. Run with --scan to get full insights.
==============================================================================

41: Task failed with an exception.
-----------
* What went wrong:
Execution failed for task ':solr:contrib:dataimporthandler:ecjLintTest'.
> Process 'command '/Users/jenkins/tools/java/64bit/jdk-12.0.2/bin/java'' finished with non-zero exit value 255

* Try:
Run with --stacktrace option to get the stack trace. Run with --info or --debug option to get more log output. Run with --scan to get full insights.
==============================================================================

42: Task failed with an exception.
-----------
* What went wrong:
Execution failed for task ':solr:contrib:dataimporthandler-extras:ecjLintMain'.
> Process 'command '/Users/jenkins/tools/java/64bit/jdk-12.0.2/bin/java'' finished with non-zero exit value 255

* Try:
Run with --stacktrace option to get the stack trace. Run with --info or --debug option to get more log output. Run with --scan to get full insights.
==============================================================================

43: Task failed with an exception.
-----------
* What went wrong:
Execution failed for task ':solr:contrib:extraction:ecjLintMain'.
> Process 'command '/Users/jenkins/tools/java/64bit/jdk-12.0.2/bin/java'' finished with non-zero exit value 255

* Try:
Run with --stacktrace option to get the stack trace. Run with --info or --debug option to get more log output. Run with --scan to get full insights.
==============================================================================

44: Task failed with an exception.
-----------
* What went wrong:
Execution failed for task ':solr:contrib:extraction:ecjLintTest'.
> Process 'command '/Users/jenkins/tools/java/64bit/jdk-12.0.2/bin/java'' finished with non-zero exit value 255

* Try:
Run with --stacktrace option to get the stack trace. Run with --info or --debug option to get more log output. Run with --scan to get full insights.
==============================================================================

45: Task failed with an exception.
-----------
* What went wrong:
Execution failed for task ':solr:contrib:ltr:ecjLintMain'.
> Process 'command '/Users/jenkins/tools/java/64bit/jdk-12.0.2/bin/java'' finished with non-zero exit value 255

* Try:
Run with --stacktrace option to get the stack trace. Run with --info or --debug option to get more log output. Run with --scan to get full insights.
==============================================================================

46: Task failed with an exception.
-----------
* What went wrong:
Execution failed for task ':solr:contrib:prometheus-exporter:ecjLintMain'.
> Process 'command '/Users/jenkins/tools/java/64bit/jdk-12.0.2/bin/java'' finished with non-zero exit value 255

* Try:
Run with --stacktrace option to get the stack trace. Run with --info or --debug option to get more log output. Run with --scan to get full insights.
==============================================================================

47: Task failed with an exception.
-----------
* What went wrong:
Execution failed for task ':solr:contrib:prometheus-exporter:ecjLintTest'.
> Process 'command '/Users/jenkins/tools/java/64bit/jdk-12.0.2/bin/java'' finished with non-zero exit value 255

* Try:
Run with --stacktrace option to get the stack trace. Run with --info or --debug option to get more log output. Run with --scan to get full insights.
==============================================================================

48: Task failed with an exception.
-----------
* What went wrong:
Execution failed for task ':lucene:codecs:test'.
> There were failing tests. See the results at: file:///Users/jenkins/workspace/Lucene-Solr-cloud2refimpl-MacOSX/lucene/codecs/build/test-results/test/

* Try:
Run with --stacktrace option to get the stack trace. Run with --info or --debug option to get more log output. Run with --scan to get full insights.
==============================================================================

49: Task failed with an exception.
-----------
* What went wrong:
Execution failed for task ':lucene:test-framework:test'.
> There were failing tests. See the results at: file:///Users/jenkins/workspace/Lucene-Solr-cloud2refimpl-MacOSX/lucene/test-framework/build/test-results/test/

* Try:
Run with --stacktrace option to get the stack trace. Run with --info or --debug option to get more log output. Run with --scan to get full insights.
==============================================================================

50: Task failed with an exception.
-----------
* What went wrong:
Execution failed for task ':lucene:analysis:common:test'.
> There were failing tests. See the results at: file:///Users/jenkins/workspace/Lucene-Solr-cloud2refimpl-MacOSX/lucene/analysis/common/build/test-results/test/

* Try:
Run with --stacktrace option to get the stack trace. Run with --info or --debug option to get more log output. Run with --scan to get full insights.
==============================================================================

* Get more help at https://help.gradle.org

Deprecated Gradle features were used in this build, making it incompatible with Gradle 7.0.
Use '--warning-mode all' to show the individual deprecation warnings.
See https://docs.gradle.org/6.4.1/userguide/command_line_interface.html#sec:command_line_warnings

BUILD FAILED in 19m 51s
767 actionable tasks: 767 executed
Build step 'Invoke Gradle script' changed build result to FAILURE
Build step 'Invoke Gradle script' marked build as failure
Archiving artifacts
[Java] Skipping execution of recorder since overall result is 'FAILURE'
Recording test results
[Checks API] No suitable checks publisher found.
Email was triggered for: Failure - Any
Sending email for trigger: Failure - Any

Mime
View raw message