lucene-builds mailing list archives

Site index · List index
Message view « Date » · « Thread »
Top « Date » · « Thread »
From Policeman Jenkins Server <jenk...@thetaphi.de>
Subject [JENKINS] Lucene-Solr-master-Linux (64bit/jdk-14.0.1) - Build # 28241 - Still Unstable!
Date Tue, 06 Oct 2020 22:13:58 GMT
Build: https://jenkins.thetaphi.de/job/Lucene-Solr-master-Linux/28241/
Java: 64bit/jdk-14.0.1 -XX:-UseCompressedOops -XX:+UseG1GC

1 tests failed.
FAILED:  org.apache.lucene.search.TestBoolean2.testRandomQueries

Error Message:
java.lang.AssertionError: Unequal lengths: hits1=1080,hits2=1162

Stack Trace:
java.lang.AssertionError: Unequal lengths: hits1=1080,hits2=1162
	at __randomizedtesting.SeedInfo.seed([4EA2C0675F432C05:1089708B6799019B]:0)
	at org.junit.Assert.fail(Assert.java:88)
	at org.apache.lucene.search.CheckHits.checkEqual(CheckHits.java:202)
	at org.apache.lucene.search.TestBoolean2.testRandomQueries(TestBoolean2.java:409)
	at java.base/jdk.internal.reflect.NativeMethodAccessorImpl.invoke0(Native Method)
	at java.base/jdk.internal.reflect.NativeMethodAccessorImpl.invoke(NativeMethodAccessorImpl.java:62)
	at java.base/jdk.internal.reflect.DelegatingMethodAccessorImpl.invoke(DelegatingMethodAccessorImpl.java:43)
	at java.base/java.lang.reflect.Method.invoke(Method.java:564)
	at com.carrotsearch.randomizedtesting.RandomizedRunner.invoke(RandomizedRunner.java:1754)
	at com.carrotsearch.randomizedtesting.RandomizedRunner$8.evaluate(RandomizedRunner.java:942)
	at com.carrotsearch.randomizedtesting.RandomizedRunner$9.evaluate(RandomizedRunner.java:978)
	at com.carrotsearch.randomizedtesting.RandomizedRunner$10.evaluate(RandomizedRunner.java:992)
	at org.apache.lucene.util.TestRuleSetupTeardownChained$1.evaluate(TestRuleSetupTeardownChained.java:49)
	at org.apache.lucene.util.AbstractBeforeAfterRule$1.evaluate(AbstractBeforeAfterRule.java:45)
	at org.apache.lucene.util.TestRuleThreadAndTestName$1.evaluate(TestRuleThreadAndTestName.java:48)
	at org.apache.lucene.util.TestRuleIgnoreAfterMaxFailures$1.evaluate(TestRuleIgnoreAfterMaxFailures.java:64)
	at org.apache.lucene.util.TestRuleMarkFailure$1.evaluate(TestRuleMarkFailure.java:47)
	at com.carrotsearch.randomizedtesting.rules.StatementAdapter.evaluate(StatementAdapter.java:36)
	at com.carrotsearch.randomizedtesting.ThreadLeakControl$StatementRunner.run(ThreadLeakControl.java:370)
	at com.carrotsearch.randomizedtesting.ThreadLeakControl.forkTimeoutingTask(ThreadLeakControl.java:819)
	at com.carrotsearch.randomizedtesting.ThreadLeakControl$3.evaluate(ThreadLeakControl.java:470)
	at com.carrotsearch.randomizedtesting.RandomizedRunner.runSingleTest(RandomizedRunner.java:951)
	at com.carrotsearch.randomizedtesting.RandomizedRunner$5.evaluate(RandomizedRunner.java:836)
	at com.carrotsearch.randomizedtesting.RandomizedRunner$6.evaluate(RandomizedRunner.java:887)
	at com.carrotsearch.randomizedtesting.RandomizedRunner$7.evaluate(RandomizedRunner.java:898)
	at org.apache.lucene.util.AbstractBeforeAfterRule$1.evaluate(AbstractBeforeAfterRule.java:45)
	at com.carrotsearch.randomizedtesting.rules.StatementAdapter.evaluate(StatementAdapter.java:36)
	at org.apache.lucene.util.TestRuleStoreClassName$1.evaluate(TestRuleStoreClassName.java:41)
	at com.carrotsearch.randomizedtesting.rules.NoShadowingOrOverridesOnMethodsRule$1.evaluate(NoShadowingOrOverridesOnMethodsRule.java:40)
	at com.carrotsearch.randomizedtesting.rules.NoShadowingOrOverridesOnMethodsRule$1.evaluate(NoShadowingOrOverridesOnMethodsRule.java:40)
	at com.carrotsearch.randomizedtesting.rules.StatementAdapter.evaluate(StatementAdapter.java:36)
	at com.carrotsearch.randomizedtesting.rules.StatementAdapter.evaluate(StatementAdapter.java:36)
	at org.apache.lucene.util.TestRuleAssertionsRequired$1.evaluate(TestRuleAssertionsRequired.java:53)
	at org.apache.lucene.util.TestRuleMarkFailure$1.evaluate(TestRuleMarkFailure.java:47)
	at org.apache.lucene.util.TestRuleIgnoreAfterMaxFailures$1.evaluate(TestRuleIgnoreAfterMaxFailures.java:64)
	at org.apache.lucene.util.TestRuleIgnoreTestSuites$1.evaluate(TestRuleIgnoreTestSuites.java:54)
	at com.carrotsearch.randomizedtesting.rules.StatementAdapter.evaluate(StatementAdapter.java:36)
	at com.carrotsearch.randomizedtesting.ThreadLeakControl$StatementRunner.run(ThreadLeakControl.java:370)
	at com.carrotsearch.randomizedtesting.ThreadLeakControl.lambda$forkTimeoutingTask$0(ThreadLeakControl.java:826)
	at java.base/java.lang.Thread.run(Thread.java:832)




Build Log:
[...truncated 1622 lines...]
ERROR: The following test(s) have failed:
  - org.apache.lucene.search.TestBoolean2.testRandomQueries (:lucene:core)
    Test output: /home/jenkins/workspace/Lucene-Solr-master-Linux/lucene/core/build/test-results/test/outputs/OUTPUT-org.apache.lucene.search.TestBoolean2.txt
    Reproduce with: gradlew :lucene:core:test --tests "org.apache.lucene.search.TestBoolean2"
-Ptests.jvms=6 -Ptests.haltonfailure=false "-Ptests.jvmargs=-XX:-UseCompressedOops -XX:+UseG1GC"
-Ptests.seed=4EA2C0675F432C05 -Ptests.multiplier=3 -Ptests.badapples=false -Ptests.file.encoding=UTF-8


Deprecated Gradle features were used in this build, making it incompatible with Gradle 7.0.
Use '--warning-mode all' to show the individual deprecation warnings.
See https://docs.gradle.org/6.6.1/userguide/command_line_interface.html#sec:command_line_warnings

BUILD SUCCESSFUL in 42m 44s
836 actionable tasks: 836 executed
Build step 'Invoke Gradle script' changed build result to SUCCESS
Archiving artifacts
java.lang.InterruptedException: no matches found within 10000
	at hudson.FilePath$ValidateAntFileMask.hasMatch(FilePath.java:2875)
	at hudson.FilePath$ValidateAntFileMask.invoke(FilePath.java:2754)
	at hudson.FilePath$ValidateAntFileMask.invoke(FilePath.java:2735)
	at hudson.FilePath.act(FilePath.java:1076)
	at hudson.FilePath.act(FilePath.java:1059)
	at hudson.FilePath.validateAntFileMask(FilePath.java:2733)
	at hudson.tasks.ArtifactArchiver.perform(ArtifactArchiver.java:270)
	at hudson.tasks.BuildStepCompatibilityLayer.perform(BuildStepCompatibilityLayer.java:80)
	at hudson.tasks.BuildStepMonitor$1.perform(BuildStepMonitor.java:20)
	at hudson.model.AbstractBuild$AbstractBuildExecution.perform(AbstractBuild.java:804)
	at hudson.model.AbstractBuild$AbstractBuildExecution.performAllBuildSteps(AbstractBuild.java:753)
	at hudson.model.Build$BuildExecution.post2(Build.java:177)
	at hudson.model.AbstractBuild$AbstractBuildExecution.post(AbstractBuild.java:698)
	at hudson.model.Run.execute(Run.java:1919)
	at hudson.model.FreeStyleBuild.run(FreeStyleBuild.java:43)
	at hudson.model.ResourceController.execute(ResourceController.java:97)
	at hudson.model.Executor.run(Executor.java:428)
No artifacts found that match the file pattern "**/*.events,heapdumps/**,**/*_pid*.log". Configuration
error?
[Java] Sleeping for 5 seconds due to JENKINS-32191...
[Java] Parsing console log (workspace: '/home/jenkins/workspace/Lucene-Solr-master-Linux')
[Java] Successfully parsed console log
[Java] -> found 0 issues (skipped 0 duplicates)
[Java] Skipping post processing
[Java] No filter has been set, publishing all 0 issues
[Java] Using reference build 'Lucene-Solr-master-Linux #28240' to compute new, fixed, and
outstanding issues
[Java] Issues delta (vs. reference build): outstanding: 0, new: 0, fixed: 0
[Java] No quality gates have been set - skipping
[Java] Health report is disabled - skipping
[Java] Created analysis result for 0 issues (found 0 new issues, fixed 0 issues)
[Java] Attaching ResultAction with ID 'java' to run 'Lucene-Solr-master-Linux #28241'.
[Checks API] No suitable checks publisher found.
Recording test results
Build step 'Publish JUnit test result report' changed build result to UNSTABLE
[Checks API] No suitable checks publisher found.
Email was triggered for: Unstable (Test Failures)
Sending email for trigger: Unstable (Test Failures)

Mime
View raw message