lucene-builds mailing list archives

Site index · List index
Message view « Date » · « Thread »
Top « Date » · « Thread »
From Policeman Jenkins Server <jenk...@thetaphi.de>
Subject [JENKINS] Lucene-Solr-8.x-Linux (64bit/jdk-12.0.2) - Build # 3953 - Still Unstable!
Date Tue, 04 Aug 2020 23:47:23 GMT
Build: https://jenkins.thetaphi.de/job/Lucene-Solr-8.x-Linux/3953/
Java: 64bit/jdk-12.0.2 -XX:+UseCompressedOops -XX:+UseG1GC

6 tests failed.
FAILED:  org.apache.solr.handler.export.TestExportWriter.testExpr

Error Message:
expected:<18000.0> but was:<20812.0>

Stack Trace:
java.lang.AssertionError: expected:<18000.0> but was:<20812.0>
	at __randomizedtesting.SeedInfo.seed([D2C52DFA8429DBC1:645ADCBAA4A06694]:0)
	at org.junit.Assert.fail(Assert.java:88)
	at org.junit.Assert.failNotEquals(Assert.java:834)
	at org.junit.Assert.assertEquals(Assert.java:553)
	at org.junit.Assert.assertEquals(Assert.java:683)
	at org.apache.solr.handler.export.TestExportWriter.testExpr(TestExportWriter.java:770)
	at java.base/jdk.internal.reflect.NativeMethodAccessorImpl.invoke0(Native Method)
	at java.base/jdk.internal.reflect.NativeMethodAccessorImpl.invoke(NativeMethodAccessorImpl.java:62)
	at java.base/jdk.internal.reflect.DelegatingMethodAccessorImpl.invoke(DelegatingMethodAccessorImpl.java:43)
	at java.base/java.lang.reflect.Method.invoke(Method.java:567)
	at com.carrotsearch.randomizedtesting.RandomizedRunner.invoke(RandomizedRunner.java:1750)
	at com.carrotsearch.randomizedtesting.RandomizedRunner$8.evaluate(RandomizedRunner.java:938)
	at com.carrotsearch.randomizedtesting.RandomizedRunner$9.evaluate(RandomizedRunner.java:974)
	at com.carrotsearch.randomizedtesting.RandomizedRunner$10.evaluate(RandomizedRunner.java:988)
	at com.carrotsearch.randomizedtesting.rules.SystemPropertiesRestoreRule$1.evaluate(SystemPropertiesRestoreRule.java:57)
	at org.apache.lucene.util.TestRuleSetupTeardownChained$1.evaluate(TestRuleSetupTeardownChained.java:49)
	at org.apache.lucene.util.AbstractBeforeAfterRule$1.evaluate(AbstractBeforeAfterRule.java:45)
	at org.apache.lucene.util.TestRuleThreadAndTestName$1.evaluate(TestRuleThreadAndTestName.java:48)
	at org.apache.lucene.util.TestRuleIgnoreAfterMaxFailures$1.evaluate(TestRuleIgnoreAfterMaxFailures.java:64)
	at org.apache.lucene.util.TestRuleMarkFailure$1.evaluate(TestRuleMarkFailure.java:47)
	at com.carrotsearch.randomizedtesting.rules.StatementAdapter.evaluate(StatementAdapter.java:36)
	at com.carrotsearch.randomizedtesting.ThreadLeakControl$StatementRunner.run(ThreadLeakControl.java:368)
	at com.carrotsearch.randomizedtesting.ThreadLeakControl.forkTimeoutingTask(ThreadLeakControl.java:817)
	at com.carrotsearch.randomizedtesting.ThreadLeakControl$3.evaluate(ThreadLeakControl.java:468)
	at com.carrotsearch.randomizedtesting.RandomizedRunner.runSingleTest(RandomizedRunner.java:947)
	at com.carrotsearch.randomizedtesting.RandomizedRunner$5.evaluate(RandomizedRunner.java:832)
	at com.carrotsearch.randomizedtesting.RandomizedRunner$6.evaluate(RandomizedRunner.java:883)
	at com.carrotsearch.randomizedtesting.RandomizedRunner$7.evaluate(RandomizedRunner.java:894)
	at com.carrotsearch.randomizedtesting.rules.StatementAdapter.evaluate(StatementAdapter.java:36)
	at com.carrotsearch.randomizedtesting.rules.SystemPropertiesRestoreRule$1.evaluate(SystemPropertiesRestoreRule.java:57)
	at org.apache.lucene.util.AbstractBeforeAfterRule$1.evaluate(AbstractBeforeAfterRule.java:45)
	at com.carrotsearch.randomizedtesting.rules.StatementAdapter.evaluate(StatementAdapter.java:36)
	at org.apache.lucene.util.TestRuleStoreClassName$1.evaluate(TestRuleStoreClassName.java:41)
	at com.carrotsearch.randomizedtesting.rules.NoShadowingOrOverridesOnMethodsRule$1.evaluate(NoShadowingOrOverridesOnMethodsRule.java:40)
	at com.carrotsearch.randomizedtesting.rules.NoShadowingOrOverridesOnMethodsRule$1.evaluate(NoShadowingOrOverridesOnMethodsRule.java:40)
	at com.carrotsearch.randomizedtesting.rules.StatementAdapter.evaluate(StatementAdapter.java:36)
	at com.carrotsearch.randomizedtesting.rules.StatementAdapter.evaluate(StatementAdapter.java:36)
	at org.apache.lucene.util.TestRuleAssertionsRequired$1.evaluate(TestRuleAssertionsRequired.java:53)
	at org.apache.lucene.util.TestRuleMarkFailure$1.evaluate(TestRuleMarkFailure.java:47)
	at org.apache.lucene.util.TestRuleIgnoreAfterMaxFailures$1.evaluate(TestRuleIgnoreAfterMaxFailures.java:64)
	at org.apache.lucene.util.TestRuleIgnoreTestSuites$1.evaluate(TestRuleIgnoreTestSuites.java:54)
	at com.carrotsearch.randomizedtesting.rules.StatementAdapter.evaluate(StatementAdapter.java:36)
	at com.carrotsearch.randomizedtesting.ThreadLeakControl$StatementRunner.run(ThreadLeakControl.java:368)
	at java.base/java.lang.Thread.run(Thread.java:835)


FAILED:  org.apache.solr.handler.export.TestExportWriter.testExpr

Error Message:
expected:<18000.0> but was:<20812.0>

Stack Trace:
java.lang.AssertionError: expected:<18000.0> but was:<20812.0>
	at __randomizedtesting.SeedInfo.seed([D2C52DFA8429DBC1:645ADCBAA4A06694]:0)
	at org.junit.Assert.fail(Assert.java:88)
	at org.junit.Assert.failNotEquals(Assert.java:834)
	at org.junit.Assert.assertEquals(Assert.java:553)
	at org.junit.Assert.assertEquals(Assert.java:683)
	at org.apache.solr.handler.export.TestExportWriter.testExpr(TestExportWriter.java:770)
	at java.base/jdk.internal.reflect.NativeMethodAccessorImpl.invoke0(Native Method)
	at java.base/jdk.internal.reflect.NativeMethodAccessorImpl.invoke(NativeMethodAccessorImpl.java:62)
	at java.base/jdk.internal.reflect.DelegatingMethodAccessorImpl.invoke(DelegatingMethodAccessorImpl.java:43)
	at java.base/java.lang.reflect.Method.invoke(Method.java:567)
	at com.carrotsearch.randomizedtesting.RandomizedRunner.invoke(RandomizedRunner.java:1750)
	at com.carrotsearch.randomizedtesting.RandomizedRunner$8.evaluate(RandomizedRunner.java:938)
	at com.carrotsearch.randomizedtesting.RandomizedRunner$9.evaluate(RandomizedRunner.java:974)
	at com.carrotsearch.randomizedtesting.RandomizedRunner$10.evaluate(RandomizedRunner.java:988)
	at com.carrotsearch.randomizedtesting.rules.SystemPropertiesRestoreRule$1.evaluate(SystemPropertiesRestoreRule.java:57)
	at org.apache.lucene.util.TestRuleSetupTeardownChained$1.evaluate(TestRuleSetupTeardownChained.java:49)
	at org.apache.lucene.util.AbstractBeforeAfterRule$1.evaluate(AbstractBeforeAfterRule.java:45)
	at org.apache.lucene.util.TestRuleThreadAndTestName$1.evaluate(TestRuleThreadAndTestName.java:48)
	at org.apache.lucene.util.TestRuleIgnoreAfterMaxFailures$1.evaluate(TestRuleIgnoreAfterMaxFailures.java:64)
	at org.apache.lucene.util.TestRuleMarkFailure$1.evaluate(TestRuleMarkFailure.java:47)
	at com.carrotsearch.randomizedtesting.rules.StatementAdapter.evaluate(StatementAdapter.java:36)
	at com.carrotsearch.randomizedtesting.ThreadLeakControl$StatementRunner.run(ThreadLeakControl.java:368)
	at com.carrotsearch.randomizedtesting.ThreadLeakControl.forkTimeoutingTask(ThreadLeakControl.java:817)
	at com.carrotsearch.randomizedtesting.ThreadLeakControl$3.evaluate(ThreadLeakControl.java:468)
	at com.carrotsearch.randomizedtesting.RandomizedRunner.runSingleTest(RandomizedRunner.java:947)
	at com.carrotsearch.randomizedtesting.RandomizedRunner$5.evaluate(RandomizedRunner.java:832)
	at com.carrotsearch.randomizedtesting.RandomizedRunner$6.evaluate(RandomizedRunner.java:883)
	at com.carrotsearch.randomizedtesting.RandomizedRunner$7.evaluate(RandomizedRunner.java:894)
	at com.carrotsearch.randomizedtesting.rules.StatementAdapter.evaluate(StatementAdapter.java:36)
	at com.carrotsearch.randomizedtesting.rules.SystemPropertiesRestoreRule$1.evaluate(SystemPropertiesRestoreRule.java:57)
	at org.apache.lucene.util.AbstractBeforeAfterRule$1.evaluate(AbstractBeforeAfterRule.java:45)
	at com.carrotsearch.randomizedtesting.rules.StatementAdapter.evaluate(StatementAdapter.java:36)
	at org.apache.lucene.util.TestRuleStoreClassName$1.evaluate(TestRuleStoreClassName.java:41)
	at com.carrotsearch.randomizedtesting.rules.NoShadowingOrOverridesOnMethodsRule$1.evaluate(NoShadowingOrOverridesOnMethodsRule.java:40)
	at com.carrotsearch.randomizedtesting.rules.NoShadowingOrOverridesOnMethodsRule$1.evaluate(NoShadowingOrOverridesOnMethodsRule.java:40)
	at com.carrotsearch.randomizedtesting.rules.StatementAdapter.evaluate(StatementAdapter.java:36)
	at com.carrotsearch.randomizedtesting.rules.StatementAdapter.evaluate(StatementAdapter.java:36)
	at org.apache.lucene.util.TestRuleAssertionsRequired$1.evaluate(TestRuleAssertionsRequired.java:53)
	at org.apache.lucene.util.TestRuleMarkFailure$1.evaluate(TestRuleMarkFailure.java:47)
	at org.apache.lucene.util.TestRuleIgnoreAfterMaxFailures$1.evaluate(TestRuleIgnoreAfterMaxFailures.java:64)
	at org.apache.lucene.util.TestRuleIgnoreTestSuites$1.evaluate(TestRuleIgnoreTestSuites.java:54)
	at com.carrotsearch.randomizedtesting.rules.StatementAdapter.evaluate(StatementAdapter.java:36)
	at com.carrotsearch.randomizedtesting.ThreadLeakControl$StatementRunner.run(ThreadLeakControl.java:368)
	at java.base/java.lang.Thread.run(Thread.java:835)


FAILED:  org.apache.solr.handler.export.TestExportWriter.testExpr

Error Message:
expected:<18000.0> but was:<20812.0>

Stack Trace:
java.lang.AssertionError: expected:<18000.0> but was:<20812.0>
	at __randomizedtesting.SeedInfo.seed([D2C52DFA8429DBC1:645ADCBAA4A06694]:0)
	at org.junit.Assert.fail(Assert.java:88)
	at org.junit.Assert.failNotEquals(Assert.java:834)
	at org.junit.Assert.assertEquals(Assert.java:553)
	at org.junit.Assert.assertEquals(Assert.java:683)
	at org.apache.solr.handler.export.TestExportWriter.testExpr(TestExportWriter.java:770)
	at java.base/jdk.internal.reflect.NativeMethodAccessorImpl.invoke0(Native Method)
	at java.base/jdk.internal.reflect.NativeMethodAccessorImpl.invoke(NativeMethodAccessorImpl.java:62)
	at java.base/jdk.internal.reflect.DelegatingMethodAccessorImpl.invoke(DelegatingMethodAccessorImpl.java:43)
	at java.base/java.lang.reflect.Method.invoke(Method.java:567)
	at com.carrotsearch.randomizedtesting.RandomizedRunner.invoke(RandomizedRunner.java:1750)
	at com.carrotsearch.randomizedtesting.RandomizedRunner$8.evaluate(RandomizedRunner.java:938)
	at com.carrotsearch.randomizedtesting.RandomizedRunner$9.evaluate(RandomizedRunner.java:974)
	at com.carrotsearch.randomizedtesting.RandomizedRunner$10.evaluate(RandomizedRunner.java:988)
	at com.carrotsearch.randomizedtesting.rules.SystemPropertiesRestoreRule$1.evaluate(SystemPropertiesRestoreRule.java:57)
	at org.apache.lucene.util.TestRuleSetupTeardownChained$1.evaluate(TestRuleSetupTeardownChained.java:49)
	at org.apache.lucene.util.AbstractBeforeAfterRule$1.evaluate(AbstractBeforeAfterRule.java:45)
	at org.apache.lucene.util.TestRuleThreadAndTestName$1.evaluate(TestRuleThreadAndTestName.java:48)
	at org.apache.lucene.util.TestRuleIgnoreAfterMaxFailures$1.evaluate(TestRuleIgnoreAfterMaxFailures.java:64)
	at org.apache.lucene.util.TestRuleMarkFailure$1.evaluate(TestRuleMarkFailure.java:47)
	at com.carrotsearch.randomizedtesting.rules.StatementAdapter.evaluate(StatementAdapter.java:36)
	at com.carrotsearch.randomizedtesting.ThreadLeakControl$StatementRunner.run(ThreadLeakControl.java:368)
	at com.carrotsearch.randomizedtesting.ThreadLeakControl.forkTimeoutingTask(ThreadLeakControl.java:817)
	at com.carrotsearch.randomizedtesting.ThreadLeakControl$3.evaluate(ThreadLeakControl.java:468)
	at com.carrotsearch.randomizedtesting.RandomizedRunner.runSingleTest(RandomizedRunner.java:947)
	at com.carrotsearch.randomizedtesting.RandomizedRunner$5.evaluate(RandomizedRunner.java:832)
	at com.carrotsearch.randomizedtesting.RandomizedRunner$6.evaluate(RandomizedRunner.java:883)
	at com.carrotsearch.randomizedtesting.RandomizedRunner$7.evaluate(RandomizedRunner.java:894)
	at com.carrotsearch.randomizedtesting.rules.StatementAdapter.evaluate(StatementAdapter.java:36)
	at com.carrotsearch.randomizedtesting.rules.SystemPropertiesRestoreRule$1.evaluate(SystemPropertiesRestoreRule.java:57)
	at org.apache.lucene.util.AbstractBeforeAfterRule$1.evaluate(AbstractBeforeAfterRule.java:45)
	at com.carrotsearch.randomizedtesting.rules.StatementAdapter.evaluate(StatementAdapter.java:36)
	at org.apache.lucene.util.TestRuleStoreClassName$1.evaluate(TestRuleStoreClassName.java:41)
	at com.carrotsearch.randomizedtesting.rules.NoShadowingOrOverridesOnMethodsRule$1.evaluate(NoShadowingOrOverridesOnMethodsRule.java:40)
	at com.carrotsearch.randomizedtesting.rules.NoShadowingOrOverridesOnMethodsRule$1.evaluate(NoShadowingOrOverridesOnMethodsRule.java:40)
	at com.carrotsearch.randomizedtesting.rules.StatementAdapter.evaluate(StatementAdapter.java:36)
	at com.carrotsearch.randomizedtesting.rules.StatementAdapter.evaluate(StatementAdapter.java:36)
	at org.apache.lucene.util.TestRuleAssertionsRequired$1.evaluate(TestRuleAssertionsRequired.java:53)
	at org.apache.lucene.util.TestRuleMarkFailure$1.evaluate(TestRuleMarkFailure.java:47)
	at org.apache.lucene.util.TestRuleIgnoreAfterMaxFailures$1.evaluate(TestRuleIgnoreAfterMaxFailures.java:64)
	at org.apache.lucene.util.TestRuleIgnoreTestSuites$1.evaluate(TestRuleIgnoreTestSuites.java:54)
	at com.carrotsearch.randomizedtesting.rules.StatementAdapter.evaluate(StatementAdapter.java:36)
	at com.carrotsearch.randomizedtesting.ThreadLeakControl$StatementRunner.run(ThreadLeakControl.java:368)
	at java.base/java.lang.Thread.run(Thread.java:835)


FAILED:  org.apache.solr.handler.export.TestExportWriter.testExpr

Error Message:
expected:<18000.0> but was:<20812.0>

Stack Trace:
java.lang.AssertionError: expected:<18000.0> but was:<20812.0>
	at __randomizedtesting.SeedInfo.seed([D2C52DFA8429DBC1:645ADCBAA4A06694]:0)
	at org.junit.Assert.fail(Assert.java:88)
	at org.junit.Assert.failNotEquals(Assert.java:834)
	at org.junit.Assert.assertEquals(Assert.java:553)
	at org.junit.Assert.assertEquals(Assert.java:683)
	at org.apache.solr.handler.export.TestExportWriter.testExpr(TestExportWriter.java:770)
	at java.base/jdk.internal.reflect.NativeMethodAccessorImpl.invoke0(Native Method)
	at java.base/jdk.internal.reflect.NativeMethodAccessorImpl.invoke(NativeMethodAccessorImpl.java:62)
	at java.base/jdk.internal.reflect.DelegatingMethodAccessorImpl.invoke(DelegatingMethodAccessorImpl.java:43)
	at java.base/java.lang.reflect.Method.invoke(Method.java:567)
	at com.carrotsearch.randomizedtesting.RandomizedRunner.invoke(RandomizedRunner.java:1750)
	at com.carrotsearch.randomizedtesting.RandomizedRunner$8.evaluate(RandomizedRunner.java:938)
	at com.carrotsearch.randomizedtesting.RandomizedRunner$9.evaluate(RandomizedRunner.java:974)
	at com.carrotsearch.randomizedtesting.RandomizedRunner$10.evaluate(RandomizedRunner.java:988)
	at com.carrotsearch.randomizedtesting.rules.SystemPropertiesRestoreRule$1.evaluate(SystemPropertiesRestoreRule.java:57)
	at org.apache.lucene.util.TestRuleSetupTeardownChained$1.evaluate(TestRuleSetupTeardownChained.java:49)
	at org.apache.lucene.util.AbstractBeforeAfterRule$1.evaluate(AbstractBeforeAfterRule.java:45)
	at org.apache.lucene.util.TestRuleThreadAndTestName$1.evaluate(TestRuleThreadAndTestName.java:48)
	at org.apache.lucene.util.TestRuleIgnoreAfterMaxFailures$1.evaluate(TestRuleIgnoreAfterMaxFailures.java:64)
	at org.apache.lucene.util.TestRuleMarkFailure$1.evaluate(TestRuleMarkFailure.java:47)
	at com.carrotsearch.randomizedtesting.rules.StatementAdapter.evaluate(StatementAdapter.java:36)
	at com.carrotsearch.randomizedtesting.ThreadLeakControl$StatementRunner.run(ThreadLeakControl.java:368)
	at com.carrotsearch.randomizedtesting.ThreadLeakControl.forkTimeoutingTask(ThreadLeakControl.java:817)
	at com.carrotsearch.randomizedtesting.ThreadLeakControl$3.evaluate(ThreadLeakControl.java:468)
	at com.carrotsearch.randomizedtesting.RandomizedRunner.runSingleTest(RandomizedRunner.java:947)
	at com.carrotsearch.randomizedtesting.RandomizedRunner$5.evaluate(RandomizedRunner.java:832)
	at com.carrotsearch.randomizedtesting.RandomizedRunner$6.evaluate(RandomizedRunner.java:883)
	at com.carrotsearch.randomizedtesting.RandomizedRunner$7.evaluate(RandomizedRunner.java:894)
	at com.carrotsearch.randomizedtesting.rules.StatementAdapter.evaluate(StatementAdapter.java:36)
	at com.carrotsearch.randomizedtesting.rules.SystemPropertiesRestoreRule$1.evaluate(SystemPropertiesRestoreRule.java:57)
	at org.apache.lucene.util.AbstractBeforeAfterRule$1.evaluate(AbstractBeforeAfterRule.java:45)
	at com.carrotsearch.randomizedtesting.rules.StatementAdapter.evaluate(StatementAdapter.java:36)
	at org.apache.lucene.util.TestRuleStoreClassName$1.evaluate(TestRuleStoreClassName.java:41)
	at com.carrotsearch.randomizedtesting.rules.NoShadowingOrOverridesOnMethodsRule$1.evaluate(NoShadowingOrOverridesOnMethodsRule.java:40)
	at com.carrotsearch.randomizedtesting.rules.NoShadowingOrOverridesOnMethodsRule$1.evaluate(NoShadowingOrOverridesOnMethodsRule.java:40)
	at com.carrotsearch.randomizedtesting.rules.StatementAdapter.evaluate(StatementAdapter.java:36)
	at com.carrotsearch.randomizedtesting.rules.StatementAdapter.evaluate(StatementAdapter.java:36)
	at org.apache.lucene.util.TestRuleAssertionsRequired$1.evaluate(TestRuleAssertionsRequired.java:53)
	at org.apache.lucene.util.TestRuleMarkFailure$1.evaluate(TestRuleMarkFailure.java:47)
	at org.apache.lucene.util.TestRuleIgnoreAfterMaxFailures$1.evaluate(TestRuleIgnoreAfterMaxFailures.java:64)
	at org.apache.lucene.util.TestRuleIgnoreTestSuites$1.evaluate(TestRuleIgnoreTestSuites.java:54)
	at com.carrotsearch.randomizedtesting.rules.StatementAdapter.evaluate(StatementAdapter.java:36)
	at com.carrotsearch.randomizedtesting.ThreadLeakControl$StatementRunner.run(ThreadLeakControl.java:368)
	at java.base/java.lang.Thread.run(Thread.java:835)


FAILED:  org.apache.solr.handler.export.TestExportWriter.testExpr

Error Message:
expected:<18000.0> but was:<20812.0>

Stack Trace:
java.lang.AssertionError: expected:<18000.0> but was:<20812.0>
	at __randomizedtesting.SeedInfo.seed([D2C52DFA8429DBC1:645ADCBAA4A06694]:0)
	at org.junit.Assert.fail(Assert.java:88)
	at org.junit.Assert.failNotEquals(Assert.java:834)
	at org.junit.Assert.assertEquals(Assert.java:553)
	at org.junit.Assert.assertEquals(Assert.java:683)
	at org.apache.solr.handler.export.TestExportWriter.testExpr(TestExportWriter.java:770)
	at java.base/jdk.internal.reflect.NativeMethodAccessorImpl.invoke0(Native Method)
	at java.base/jdk.internal.reflect.NativeMethodAccessorImpl.invoke(NativeMethodAccessorImpl.java:62)
	at java.base/jdk.internal.reflect.DelegatingMethodAccessorImpl.invoke(DelegatingMethodAccessorImpl.java:43)
	at java.base/java.lang.reflect.Method.invoke(Method.java:567)
	at com.carrotsearch.randomizedtesting.RandomizedRunner.invoke(RandomizedRunner.java:1750)
	at com.carrotsearch.randomizedtesting.RandomizedRunner$8.evaluate(RandomizedRunner.java:938)
	at com.carrotsearch.randomizedtesting.RandomizedRunner$9.evaluate(RandomizedRunner.java:974)
	at com.carrotsearch.randomizedtesting.RandomizedRunner$10.evaluate(RandomizedRunner.java:988)
	at com.carrotsearch.randomizedtesting.rules.SystemPropertiesRestoreRule$1.evaluate(SystemPropertiesRestoreRule.java:57)
	at org.apache.lucene.util.TestRuleSetupTeardownChained$1.evaluate(TestRuleSetupTeardownChained.java:49)
	at org.apache.lucene.util.AbstractBeforeAfterRule$1.evaluate(AbstractBeforeAfterRule.java:45)
	at org.apache.lucene.util.TestRuleThreadAndTestName$1.evaluate(TestRuleThreadAndTestName.java:48)
	at org.apache.lucene.util.TestRuleIgnoreAfterMaxFailures$1.evaluate(TestRuleIgnoreAfterMaxFailures.java:64)
	at org.apache.lucene.util.TestRuleMarkFailure$1.evaluate(TestRuleMarkFailure.java:47)
	at com.carrotsearch.randomizedtesting.rules.StatementAdapter.evaluate(StatementAdapter.java:36)
	at com.carrotsearch.randomizedtesting.ThreadLeakControl$StatementRunner.run(ThreadLeakControl.java:368)
	at com.carrotsearch.randomizedtesting.ThreadLeakControl.forkTimeoutingTask(ThreadLeakControl.java:817)
	at com.carrotsearch.randomizedtesting.ThreadLeakControl$3.evaluate(ThreadLeakControl.java:468)
	at com.carrotsearch.randomizedtesting.RandomizedRunner.runSingleTest(RandomizedRunner.java:947)
	at com.carrotsearch.randomizedtesting.RandomizedRunner$5.evaluate(RandomizedRunner.java:832)
	at com.carrotsearch.randomizedtesting.RandomizedRunner$6.evaluate(RandomizedRunner.java:883)
	at com.carrotsearch.randomizedtesting.RandomizedRunner$7.evaluate(RandomizedRunner.java:894)
	at com.carrotsearch.randomizedtesting.rules.StatementAdapter.evaluate(StatementAdapter.java:36)
	at com.carrotsearch.randomizedtesting.rules.SystemPropertiesRestoreRule$1.evaluate(SystemPropertiesRestoreRule.java:57)
	at org.apache.lucene.util.AbstractBeforeAfterRule$1.evaluate(AbstractBeforeAfterRule.java:45)
	at com.carrotsearch.randomizedtesting.rules.StatementAdapter.evaluate(StatementAdapter.java:36)
	at org.apache.lucene.util.TestRuleStoreClassName$1.evaluate(TestRuleStoreClassName.java:41)
	at com.carrotsearch.randomizedtesting.rules.NoShadowingOrOverridesOnMethodsRule$1.evaluate(NoShadowingOrOverridesOnMethodsRule.java:40)
	at com.carrotsearch.randomizedtesting.rules.NoShadowingOrOverridesOnMethodsRule$1.evaluate(NoShadowingOrOverridesOnMethodsRule.java:40)
	at com.carrotsearch.randomizedtesting.rules.StatementAdapter.evaluate(StatementAdapter.java:36)
	at com.carrotsearch.randomizedtesting.rules.StatementAdapter.evaluate(StatementAdapter.java:36)
	at org.apache.lucene.util.TestRuleAssertionsRequired$1.evaluate(TestRuleAssertionsRequired.java:53)
	at org.apache.lucene.util.TestRuleMarkFailure$1.evaluate(TestRuleMarkFailure.java:47)
	at org.apache.lucene.util.TestRuleIgnoreAfterMaxFailures$1.evaluate(TestRuleIgnoreAfterMaxFailures.java:64)
	at org.apache.lucene.util.TestRuleIgnoreTestSuites$1.evaluate(TestRuleIgnoreTestSuites.java:54)
	at com.carrotsearch.randomizedtesting.rules.StatementAdapter.evaluate(StatementAdapter.java:36)
	at com.carrotsearch.randomizedtesting.ThreadLeakControl$StatementRunner.run(ThreadLeakControl.java:368)
	at java.base/java.lang.Thread.run(Thread.java:835)


FAILED:  org.apache.solr.handler.export.TestExportWriter.testExpr

Error Message:
expected:<18000.0> but was:<20812.0>

Stack Trace:
java.lang.AssertionError: expected:<18000.0> but was:<20812.0>
	at __randomizedtesting.SeedInfo.seed([D2C52DFA8429DBC1:645ADCBAA4A06694]:0)
	at org.junit.Assert.fail(Assert.java:88)
	at org.junit.Assert.failNotEquals(Assert.java:834)
	at org.junit.Assert.assertEquals(Assert.java:553)
	at org.junit.Assert.assertEquals(Assert.java:683)
	at org.apache.solr.handler.export.TestExportWriter.testExpr(TestExportWriter.java:770)
	at java.base/jdk.internal.reflect.NativeMethodAccessorImpl.invoke0(Native Method)
	at java.base/jdk.internal.reflect.NativeMethodAccessorImpl.invoke(NativeMethodAccessorImpl.java:62)
	at java.base/jdk.internal.reflect.DelegatingMethodAccessorImpl.invoke(DelegatingMethodAccessorImpl.java:43)
	at java.base/java.lang.reflect.Method.invoke(Method.java:567)
	at com.carrotsearch.randomizedtesting.RandomizedRunner.invoke(RandomizedRunner.java:1750)
	at com.carrotsearch.randomizedtesting.RandomizedRunner$8.evaluate(RandomizedRunner.java:938)
	at com.carrotsearch.randomizedtesting.RandomizedRunner$9.evaluate(RandomizedRunner.java:974)
	at com.carrotsearch.randomizedtesting.RandomizedRunner$10.evaluate(RandomizedRunner.java:988)
	at com.carrotsearch.randomizedtesting.rules.SystemPropertiesRestoreRule$1.evaluate(SystemPropertiesRestoreRule.java:57)
	at org.apache.lucene.util.TestRuleSetupTeardownChained$1.evaluate(TestRuleSetupTeardownChained.java:49)
	at org.apache.lucene.util.AbstractBeforeAfterRule$1.evaluate(AbstractBeforeAfterRule.java:45)
	at org.apache.lucene.util.TestRuleThreadAndTestName$1.evaluate(TestRuleThreadAndTestName.java:48)
	at org.apache.lucene.util.TestRuleIgnoreAfterMaxFailures$1.evaluate(TestRuleIgnoreAfterMaxFailures.java:64)
	at org.apache.lucene.util.TestRuleMarkFailure$1.evaluate(TestRuleMarkFailure.java:47)
	at com.carrotsearch.randomizedtesting.rules.StatementAdapter.evaluate(StatementAdapter.java:36)
	at com.carrotsearch.randomizedtesting.ThreadLeakControl$StatementRunner.run(ThreadLeakControl.java:368)
	at com.carrotsearch.randomizedtesting.ThreadLeakControl.forkTimeoutingTask(ThreadLeakControl.java:817)
	at com.carrotsearch.randomizedtesting.ThreadLeakControl$3.evaluate(ThreadLeakControl.java:468)
	at com.carrotsearch.randomizedtesting.RandomizedRunner.runSingleTest(RandomizedRunner.java:947)
	at com.carrotsearch.randomizedtesting.RandomizedRunner$5.evaluate(RandomizedRunner.java:832)
	at com.carrotsearch.randomizedtesting.RandomizedRunner$6.evaluate(RandomizedRunner.java:883)
	at com.carrotsearch.randomizedtesting.RandomizedRunner$7.evaluate(RandomizedRunner.java:894)
	at com.carrotsearch.randomizedtesting.rules.StatementAdapter.evaluate(StatementAdapter.java:36)
	at com.carrotsearch.randomizedtesting.rules.SystemPropertiesRestoreRule$1.evaluate(SystemPropertiesRestoreRule.java:57)
	at org.apache.lucene.util.AbstractBeforeAfterRule$1.evaluate(AbstractBeforeAfterRule.java:45)
	at com.carrotsearch.randomizedtesting.rules.StatementAdapter.evaluate(StatementAdapter.java:36)
	at org.apache.lucene.util.TestRuleStoreClassName$1.evaluate(TestRuleStoreClassName.java:41)
	at com.carrotsearch.randomizedtesting.rules.NoShadowingOrOverridesOnMethodsRule$1.evaluate(NoShadowingOrOverridesOnMethodsRule.java:40)
	at com.carrotsearch.randomizedtesting.rules.NoShadowingOrOverridesOnMethodsRule$1.evaluate(NoShadowingOrOverridesOnMethodsRule.java:40)
	at com.carrotsearch.randomizedtesting.rules.StatementAdapter.evaluate(StatementAdapter.java:36)
	at com.carrotsearch.randomizedtesting.rules.StatementAdapter.evaluate(StatementAdapter.java:36)
	at org.apache.lucene.util.TestRuleAssertionsRequired$1.evaluate(TestRuleAssertionsRequired.java:53)
	at org.apache.lucene.util.TestRuleMarkFailure$1.evaluate(TestRuleMarkFailure.java:47)
	at org.apache.lucene.util.TestRuleIgnoreAfterMaxFailures$1.evaluate(TestRuleIgnoreAfterMaxFailures.java:64)
	at org.apache.lucene.util.TestRuleIgnoreTestSuites$1.evaluate(TestRuleIgnoreTestSuites.java:54)
	at com.carrotsearch.randomizedtesting.rules.StatementAdapter.evaluate(StatementAdapter.java:36)
	at com.carrotsearch.randomizedtesting.ThreadLeakControl$StatementRunner.run(ThreadLeakControl.java:368)
	at java.base/java.lang.Thread.run(Thread.java:835)




Build Log:
[...truncated 15791 lines...]
   [junit4] Suite: org.apache.solr.handler.export.TestExportWriter
   [junit4]   2> 1015489 INFO  (SUITE-TestExportWriter-seed#[D2C52DFA8429DBC1]-worker) [     ] o.a.s.SolrTestCase Setting 'solr.default.confdir' system property to test-framework derived value of '/home/jenkins/workspace/Lucene-Solr-8.x-Linux/solr/server/solr/configsets/_default/conf'
   [junit4]   2> 1015489 INFO  (SUITE-TestExportWriter-seed#[D2C52DFA8429DBC1]-worker) [     ] o.a.s.SolrTestCaseJ4 Created dataDir: /home/jenkins/workspace/Lucene-Solr-8.x-Linux/solr/build/solr-core/test/J3/temp/solr.handler.export.TestExportWriter_D2C52DFA8429DBC1-001/data-dir-123-001
   [junit4]   2> 1015489 WARN  (SUITE-TestExportWriter-seed#[D2C52DFA8429DBC1]-worker) [     ] o.a.s.SolrTestCaseJ4 startTrackingSearchers: numOpens=16 numCloses=16
   [junit4]   2> 1015489 INFO  (SUITE-TestExportWriter-seed#[D2C52DFA8429DBC1]-worker) [     ] o.a.s.SolrTestCaseJ4 Using PointFields (NUMERIC_POINTS_SYSPROP=true) w/NUMERIC_DOCVALUES_SYSPROP=false
   [junit4]   2> 1015490 INFO  (SUITE-TestExportWriter-seed#[D2C52DFA8429DBC1]-worker) [     ] o.a.s.SolrTestCaseJ4 Randomized ssl (false) and clientAuth (false) via: @org.apache.solr.util.RandomizeSSL(reason="", value=0.0/0.0, ssl=0.0/0.0, clientAuth=0.0/0.0)
   [junit4]   2> 1015490 INFO  (SUITE-TestExportWriter-seed#[D2C52DFA8429DBC1]-worker) [     ] o.a.s.SolrTestCaseJ4 SecureRandom sanity checks: test.solr.allowed.securerandom=null & java.security.egd=file:/dev/./urandom
   [junit4]   2> 1015490 INFO  (SUITE-TestExportWriter-seed#[D2C52DFA8429DBC1]-worker) [     ] o.a.s.SolrTestCaseJ4 ####initCore
   [junit4]   2> 1015493 INFO  (SUITE-TestExportWriter-seed#[D2C52DFA8429DBC1]-worker) [     ] o.a.s.c.SolrConfig Using Lucene MatchVersion: 8.7.0
   [junit4]   2> 1015499 INFO  (SUITE-TestExportWriter-seed#[D2C52DFA8429DBC1]-worker) [     ] o.a.s.s.IndexSchema Schema name=schema-docValuesMulti
   [junit4]   2> 1015504 INFO  (SUITE-TestExportWriter-seed#[D2C52DFA8429DBC1]-worker) [     ] o.a.s.s.IndexSchema Loaded schema schema-docValuesMulti/1.6 with uniqueid field id
   [junit4]   2> 1015556 WARN  (SUITE-TestExportWriter-seed#[D2C52DFA8429DBC1]-worker) [     ] o.a.s.c.CoreContainer Unable to create [/home/jenkins/workspace/Lucene-Solr-8.x-Linux/solr/core/src/test-files/solr/userfiles].  Features requiring this directory may fail.
   [junit4]   2>           => java.security.AccessControlException: access denied ("java.io.FilePermission" "/home/jenkins/workspace/Lucene-Solr-8.x-Linux/solr/core/src/test-files/solr/userfiles" "write")
   [junit4]   2> 	at java.base/java.security.AccessControlContext.checkPermission(AccessControlContext.java:472)
   [junit4]   2> java.security.AccessControlException: access denied ("java.io.FilePermission" "/home/jenkins/workspace/Lucene-Solr-8.x-Linux/solr/core/src/test-files/solr/userfiles" "write")
   [junit4]   2> 	at java.security.AccessControlContext.checkPermission(AccessControlContext.java:472) ~[?:?]
   [junit4]   2> 	at java.security.AccessController.checkPermission(AccessController.java:1044) ~[?:?]
   [junit4]   2> 	at java.lang.SecurityManager.checkPermission(SecurityManager.java:408) ~[?:?]
   [junit4]   2> 	at java.lang.SecurityManager.checkWrite(SecurityManager.java:838) ~[?:?]
   [junit4]   2> 	at sun.nio.fs.UnixPath.checkWrite(UnixPath.java:824) ~[?:?]
   [junit4]   2> 	at sun.nio.fs.UnixFileSystemProvider.createDirectory(UnixFileSystemProvider.java:381) ~[?:?]
   [junit4]   2> 	at java.nio.file.Files.createDirectory(Files.java:692) ~[?:?]
   [junit4]   2> 	at java.nio.file.Files.createAndCheckIsDirectory(Files.java:799) ~[?:?]
   [junit4]   2> 	at java.nio.file.Files.createDirectories(Files.java:745) ~[?:?]
   [junit4]   2> 	at org.apache.solr.core.CoreContainer.<init>(CoreContainer.java:367) [java/:?]
   [junit4]   2> 	at org.apache.solr.core.CoreContainer.<init>(CoreContainer.java:332) [java/:?]
   [junit4]   2> 	at org.apache.solr.util.TestHarness.<init>(TestHarness.java:170) [java/:?]
   [junit4]   2> 	at org.apache.solr.util.TestHarness.<init>(TestHarness.java:143) [java/:?]
   [junit4]   2> 	at org.apache.solr.util.TestHarness.<init>(TestHarness.java:149) [java/:?]
   [junit4]   2> 	at org.apache.solr.util.TestHarness.<init>(TestHarness.java:112) [java/:?]
   [junit4]   2> 	at org.apache.solr.SolrTestCaseJ4.createCore(SolrTestCaseJ4.java:809) [java/:?]
   [junit4]   2> 	at org.apache.solr.SolrTestCaseJ4.initCore(SolrTestCaseJ4.java:799) [java/:?]
   [junit4]   2> 	at org.apache.solr.SolrTestCaseJ4.initCore(SolrTestCaseJ4.java:660) [java/:?]
   [junit4]   2> 	at org.apache.solr.SolrTestCaseJ4.initCore(SolrTestCaseJ4.java:649) [java/:?]
   [junit4]   2> 	at org.apache.solr.handler.export.TestExportWriter.beforeClass(TestExportWriter.java:54) [test/:?]
   [junit4]   2> 	at jdk.internal.reflect.NativeMethodAccessorImpl.invoke0(Native Method) ~[?:?]
   [junit4]   2> 	at jdk.internal.reflect.NativeMethodAccessorImpl.invoke(NativeMethodAccessorImpl.java:62) ~[?:?]
   [junit4]   2> 	at jdk.internal.reflect.DelegatingMethodAccessorImpl.invoke(DelegatingMethodAccessorImpl.java:43) ~[?:?]
   [junit4]   2> 	at java.lang.reflect.Method.invoke(Method.java:567) ~[?:?]
   [junit4]   2> 	at com.carrotsearch.randomizedtesting.RandomizedRunner.invoke(RandomizedRunner.java:1750) [randomizedtesting-runner-2.7.2.jar:?]
   [junit4]   2> 	at com.carrotsearch.randomizedtesting.RandomizedRunner$6.evaluate(RandomizedRunner.java:878) [randomizedtesting-runner-2.7.2.jar:?]
   [junit4]   2> 	at com.carrotsearch.randomizedtesting.RandomizedRunner$7.evaluate(RandomizedRunner.java:894) [randomizedtesting-runner-2.7.2.jar:?]
   [junit4]   2> 	at com.carrotsearch.randomizedtesting.rules.StatementAdapter.evaluate(StatementAdapter.java:36) [randomizedtesting-runner-2.7.2.jar:?]
   [junit4]   2> 	at com.carrotsearch.randomizedtesting.rules.SystemPropertiesRestoreRule$1.evaluate(SystemPropertiesRestoreRule.java:57) [randomizedtesting-runner-2.7.2.jar:?]
   [junit4]   2> 	at org.apache.lucene.util.AbstractBeforeAfterRule$1.evaluate(AbstractBeforeAfterRule.java:45) [java/:?]
   [junit4]   2> 	at com.carrotsearch.randomizedtesting.rules.StatementAdapter.evaluate(StatementAdapter.java:36) [randomizedtesting-runner-2.7.2.jar:?]
   [junit4]   2> 	at org.apache.lucene.util.TestRuleStoreClassName$1.evaluate(TestRuleStoreClassName.java:41) [java/:?]
   [junit4]   2> 	at com.carrotsearch.randomizedtesting.rules.NoShadowingOrOverridesOnMethodsRule$1.evaluate(NoShadowingOrOverridesOnMethodsRule.java:40) [randomizedtesting-runner-2.7.2.jar:?]
   [junit4]   2> 	at com.carrotsearch.randomizedtesting.rules.NoShadowingOrOverridesOnMethodsRule$1.evaluate(NoShadowingOrOverridesOnMethodsRule.java:40) [randomizedtesting-runner-2.7.2.jar:?]
   [junit4]   2> 	at com.carrotsearch.randomizedtesting.rules.StatementAdapter.evaluate(StatementAdapter.java:36) [randomizedtesting-runner-2.7.2.jar:?]
   [junit4]   2> 	at com.carrotsearch.randomizedtesting.rules.StatementAdapter.evaluate(StatementAdapter.java:36) [randomizedtesting-runner-2.7.2.jar:?]
   [junit4]   2> 	at org.apache.lucene.util.TestRuleAssertionsRequired$1.evaluate(TestRuleAssertionsRequired.java:53) [java/:?]
   [junit4]   2> 	at org.apache.lucene.util.TestRuleMarkFailure$1.evaluate(TestRuleMarkFailure.java:47) [java/:?]
   [junit4]   2> 	at org.apache.lucene.util.TestRuleIgnoreAfterMaxFailures$1.evaluate(TestRuleIgnoreAfterMaxFailures.java:64) [java/:?]
   [junit4]   2> 	at org.apache.lucene.util.TestRuleIgnoreTestSuites$1.evaluate(TestRuleIgnoreTestSuites.java:54) [java/:?]
   [junit4]   2> 	at com.carrotsearch.randomizedtesting.rules.StatementAdapter.evaluate(StatementAdapter.java:36) [randomizedtesting-runner-2.7.2.jar:?]
   [junit4]   2> 	at com.carrotsearch.randomizedtesting.ThreadLeakControl$StatementRunner.run(ThreadLeakControl.java:368) [randomizedtesting-runner-2.7.2.jar:?]
   [junit4]   2> 	at java.lang.Thread.run(Thread.java:835) [?:?]
   [junit4]   2> 1015557 WARN  (SUITE-TestExportWriter-seed#[D2C52DFA8429DBC1]-worker) [     ] o.a.s.f.DistribPackageStore Unable to create [/home/jenkins/workspace/Lucene-Solr-8.x-Linux/solr/core/src/test-files/solr/filestore] directory in SOLR_HOME [/home/jenkins/workspace/Lucene-Solr-8.x-Linux/solr/core/src/test-files/solr].  Features requiring this directory may fail.
   [junit4]   2>           => java.security.AccessControlException: access denied ("java.io.FilePermission" "/home/jenkins/workspace/Lucene-Solr-8.x-Linux/solr/core/src/test-files/solr/filestore" "write")
   [junit4]   2> 	at java.base/java.security.AccessControlContext.checkPermission(AccessControlContext.java:472)
   [junit4]   2> java.security.AccessControlException: access denied ("java.io.FilePermission" "/home/jenkins/workspace/Lucene-Solr-8.x-Linux/solr/core/src/test-files/solr/filestore" "write")
   [junit4]   2> 	at java.security.AccessControlContext.checkPermission(AccessControlContext.java:472) ~[?:?]
   [junit4]   2> 	at java.security.AccessController.checkPermission(AccessController.java:1044) ~[?:?]
   [junit4]   2> 	at java.lang.SecurityManager.checkPermission(SecurityManager.java:408) ~[?:?]
   [junit4]   2> 	at java.lang.SecurityManager.checkWrite(SecurityManager.java:838) ~[?:?]
   [junit4]   2> 	at java.io.File.mkdir(File.java:1323) ~[?:?]
   [junit4]   2> 	at java.io.File.mkdirs(File.java:1355) ~[?:?]
   [junit4]   2> 	at org.apache.solr.filestore.DistribPackageStore.ensurePackageStoreDir(DistribPackageStore.java:560) [java/:?]
   [junit4]   2> 	at org.apache.solr.filestore.DistribPackageStore.<init>(DistribPackageStore.java:80) [java/:?]
   [junit4]   2> 	at org.apache.solr.filestore.PackageStoreAPI.<init>(PackageStoreAPI.java:78) [java/:?]
   [junit4]   2> 	at org.apache.solr.core.CoreContainer.load(CoreContainer.java:668) [java/:?]
   [junit4]   2> 	at org.apache.solr.util.TestHarness.<init>(TestHarness.java:171) [java/:?]
   [junit4]   2> 	at org.apache.solr.util.TestHarness.<init>(TestHarness.java:143) [java/:?]
   [junit4]   2> 	at org.apache.solr.util.TestHarness.<init>(TestHarness.java:149) [java/:?]
   [junit4]   2> 	at org.apache.solr.util.TestHarness.<init>(TestHarness.java:112) [java/:?]
   [junit4]   2> 	at org.apache.solr.SolrTestCaseJ4.createCore(SolrTestCaseJ4.java:809) [java/:?]
   [junit4]   2> 	at org.apache.solr.SolrTestCaseJ4.initCore(SolrTestCaseJ4.java:799) [java/:?]
   [junit4]   2> 	at org.apache.solr.SolrTestCaseJ4.initCore(SolrTestCaseJ4.java:660) [java/:?]
   [junit4]   2> 	at org.apache.solr.SolrTestCaseJ4.initCore(SolrTestCaseJ4.java:649) [java/:?]
   [junit4]   2> 	at org.apache.solr.handler.export.TestExportWriter.beforeClass(TestExportWriter.java:54) [test/:?]
   [junit4]   2> 	at jdk.internal.reflect.NativeMethodAccessorImpl.invoke0(Native Method) ~[?:?]
   [junit4]   2> 	at jdk.internal.reflect.NativeMethodAccessorImpl.invoke(NativeMethodAccessorImpl.java:62) ~[?:?]
   [junit4]   2> 	at jdk.internal.reflect.DelegatingMethodAccessorImpl.invoke(DelegatingMethodAccessorImpl.java:43) ~[?:?]
   [junit4]   2> 	at java.lang.reflect.Method.invoke(Method.java:567) ~[?:?]
   [junit4]   2> 	at com.carrotsearch.randomizedtesting.RandomizedRunner.invoke(RandomizedRunner.java:1750) [randomizedtesting-runner-2.7.2.jar:?]
   [junit4]   2> 	at com.carrotsearch.randomizedtesting.RandomizedRunner$6.evaluate(RandomizedRunner.java:878) [randomizedtesting-runner-2.7.2.jar:?]
   [junit4]   2> 	at com.carrotsearch.randomizedtesting.RandomizedRunner$7.evaluate(RandomizedRunner.java:894) [randomizedtesting-runner-2.7.2.jar:?]
   [junit4]   2> 	at com.carrotsearch.randomizedtesting.rules.StatementAdapter.evaluate(StatementAdapter.java:36) [randomizedtesting-runner-2.7.2.jar:?]
   [junit4]   2> 	at com.carrotsearch.randomizedtesting.rules.SystemPropertiesRestoreRule$1.evaluate(SystemPropertiesRestoreRule.java:57) [randomizedtesting-runner-2.7.2.jar:?]
   [junit4]   2> 	at org.apache.lucene.util.AbstractBeforeAfterRule$1.evaluate(AbstractBeforeAfterRule.java:45) [java/:?]
   [junit4]   2> 	at com.carrotsearch.randomizedtesting.rules.StatementAdapter.evaluate(StatementAdapter.java:36) [randomizedtesting-runner-2.7.2.jar:?]
   [junit4]   2> 	at org.apache.lucene.util.TestRuleStoreClassName$1.evaluate(TestRuleStoreClassName.java:41) [java/:?]
   [junit4]   2> 	at com.carrotsearch.randomizedtesting.rules.NoShadowingOrOverridesOnMethodsRule$1.evaluate(NoShadowingOrOverridesOnMethodsRule.java:40) [randomizedtesting-runner-2.7.2.jar:?]
   [junit4]   2> 	at com.carrotsearch.randomizedtesting.rules.NoShadowingOrOverridesOnMethodsRule$1.evaluate(NoShadowingOrOverridesOnMethodsRule.java:40) [randomizedtesting-runner-2.7.2.jar:?]
   [junit4]   2> 	at com.carrotsearch.randomizedtesting.rules.StatementAdapter.evaluate(StatementAdapter.java:36) [randomizedtesting-runner-2.7.2.jar:?]
   [junit4]   2> 	at com.carrotsearch.randomizedtesting.rules.StatementAdapter.evaluate(StatementAdapter.java:36) [randomizedtesting-runner-2.7.2.jar:?]
   [junit4]   2> 	at org.apache.lucene.util.TestRuleAssertionsRequired$1.evaluate(TestRuleAssertionsRequired.java:53) [java/:?]
   [junit4]   2> 	at org.apache.lucene.util.TestRuleMarkFailure$1.evaluate(TestRuleMarkFailure.java:47) [java/:?]
   [junit4]   2> 	at org.apache.lucene.util.TestRuleIgnoreAfterMaxFailures$1.evaluate(TestRuleIgnoreAfterMaxFailures.java:64) [java/:?]
   [junit4]   2> 	at org.apache.lucene.util.TestRuleIgnoreTestSuites$1.evaluate(TestRuleIgnoreTestSuites.java:54) [java/:?]
   [junit4]   2> 	at com.carrotsearch.randomizedtesting.rules.StatementAdapter.evaluate(StatementAdapter.java:36) [randomizedtesting-runner-2.7.2.jar:?]
   [junit4]   2> 	at com.carrotsearch.randomizedtesting.ThreadLeakControl$StatementRunner.run(ThreadLeakControl.java:368) [randomizedtesting-runner-2.7.2.jar:?]
   [junit4]   2> 	at java.lang.Thread.run(Thread.java:835) [?:?]
   [junit4]   2> 1015558 INFO  (SUITE-TestExportWriter-seed#[D2C52DFA8429DBC1]-worker) [     ] o.a.s.h.c.HttpShardHandlerFactory Host whitelist initialized: WhitelistHostChecker [whitelistHosts=null, whitelistHostCheckingEnabled=true]
   [junit4]   2> 1015559 WARN  (SUITE-TestExportWriter-seed#[D2C52DFA8429DBC1]-worker) [     ] o.e.j.u.s.S.config Trusting all certificates configured for Client@48f02037[provider=null,keyStore=null,trustStore=null]
   [junit4]   2> 1015559 WARN  (SUITE-TestExportWriter-seed#[D2C52DFA8429DBC1]-worker) [     ] o.e.j.u.s.S.config No Client EndPointIdentificationAlgorithm configured for Client@48f02037[provider=null,keyStore=null,trustStore=null]
   [junit4]   2> 1015561 WARN  (SUITE-TestExportWriter-seed#[D2C52DFA8429DBC1]-worker) [     ] o.e.j.u.s.S.config Trusting all certificates configured for Client@c201873[provider=null,keyStore=null,trustStore=null]
   [junit4]   2> 1015561 WARN  (SUITE-TestExportWriter-seed#[D2C52DFA8429DBC1]-worker) [     ] o.e.j.u.s.S.config No Client EndPointIdentificationAlgorithm configured for Client@c201873[provider=null,keyStore=null,trustStore=null]
   [junit4]   2> 1015562 WARN  (SUITE-TestExportWriter-seed#[D2C52DFA8429DBC1]-worker) [     ] o.a.s.c.CoreContainer Not all security plugins configured!  authentication=disabled authorization=disabled.  Solr is only as secure as you make it. Consider configuring authentication/authorization before exposing Solr to users internal or external.  See https://s.apache.org/solrsecurity for more info
   [junit4]   2> 1015580 INFO  (SUITE-TestExportWriter-seed#[D2C52DFA8429DBC1]-worker) [     ] o.a.s.m.r.SolrJmxReporter JMX monitoring for 'solr.node' (registry 'solr.node') enabled at server: com.sun.jmx.mbeanserver.JmxMBeanServer@17d4a897
   [junit4]   2> 1015585 INFO  (SUITE-TestExportWriter-seed#[D2C52DFA8429DBC1]-worker) [     ] o.a.s.m.r.SolrJmxReporter JMX monitoring for 'solr.jvm' (registry 'solr.jvm') enabled at server: com.sun.jmx.mbeanserver.JmxMBeanServer@17d4a897
   [junit4]   2> 1015585 INFO  (SUITE-TestExportWriter-seed#[D2C52DFA8429DBC1]-worker) [     ] o.a.s.m.r.SolrJmxReporter JMX monitoring for 'solr.jetty' (registry 'solr.jetty') enabled at server: com.sun.jmx.mbeanserver.JmxMBeanServer@17d4a897
   [junit4]   2> 1015586 INFO  (coreLoadExecutor-10955-thread-1) [     ] o.a.s.c.TransientSolrCoreCacheDefault Allocating transient cache for 2147483647 transient cores
   [junit4]   2> 1015589 INFO  (coreLoadExecutor-10955-thread-1) [    x:collection1 ] o.a.s.c.SolrConfig Using Lucene MatchVersion: 8.7.0
   [junit4]   2> 1015592 INFO  (coreLoadExecutor-10955-thread-1) [    x:collection1 ] o.a.s.c.CoreContainer Creating SolrCore 'collection1' using configuration from instancedir /home/jenkins/workspace/Lucene-Solr-8.x-Linux/solr/core/src/test-files/solr/collection1, trusted=true
   [junit4]   2> 1015594 INFO  (coreLoadExecutor-10955-thread-1) [    x:collection1 ] o.a.s.s.IndexSchema Schema name=schema-docValuesMulti
   [junit4]   2> 1015598 INFO  (coreLoadExecutor-10955-thread-1) [    x:collection1 ] o.a.s.s.IndexSchema Loaded schema schema-docValuesMulti/1.6 with uniqueid field id
   [junit4]   2> 1015598 INFO  (coreLoadExecutor-10955-thread-1) [    x:collection1 ] o.a.s.m.r.SolrJmxReporter JMX monitoring for 'solr.core.collection1' (registry 'solr.core.collection1') enabled at server: com.sun.jmx.mbeanserver.JmxMBeanServer@17d4a897
   [junit4]   2> 1015598 INFO  (coreLoadExecutor-10955-thread-1) [    x:collection1 ] o.a.s.c.SolrCore [[collection1] ] Opening new SolrCore at [/home/jenkins/workspace/Lucene-Solr-8.x-Linux/solr/core/src/test-files/solr/collection1], dataDir=[/home/jenkins/workspace/Lucene-Solr-8.x-Linux/solr/build/solr-core/test/J3/temp/solr.handler.export.TestExportWriter_D2C52DFA8429DBC1-001/data-dir-123-001/]
   [junit4]   2> 1015625 INFO  (coreLoadExecutor-10955-thread-1) [    x:collection1 ] o.a.s.u.CommitTracker Hard AutoCommit: disabled
   [junit4]   2> 1015625 INFO  (coreLoadExecutor-10955-thread-1) [    x:collection1 ] o.a.s.u.CommitTracker Soft AutoCommit: disabled
   [junit4]   2> 1015626 WARN  (coreLoadExecutor-10955-thread-1) [    x:collection1 ] o.a.s.r.ManagedResourceStorage Cannot write to config directory /home/jenkins/workspace/Lucene-Solr-8.x-Linux/solr/core/src/test-files/solr/collection1/conf ; switching to use InMemory storage instead.
   [junit4]   2> 1015626 INFO  (coreLoadExecutor-10955-thread-1) [    x:collection1 ] o.a.s.h.ReplicationHandler Commits will be reserved for 10000 ms
   [junit4]   2> 1015627 INFO  (searcherExecutor-10957-thread-1-processing-x:collection1) [    x:collection1 ] o.a.s.c.SolrCore [collection1]  Registered new searcher autowarm time: 0 ms
   [junit4]   2> 1015627 INFO  (SUITE-TestExportWriter-seed#[D2C52DFA8429DBC1]-worker) [     ] o.a.s.SolrTestCaseJ4 ####initCore end
   [junit4]   2> 1015629 INFO  (TEST-TestExportWriter.test-seed#[D2C52DFA8429DBC1]) [     ] o.a.s.SolrTestCaseJ4 ###Starting test
   [junit4]   2> 1015630 INFO  (TEST-TestExportWriter.test-seed#[D2C52DFA8429DBC1]) [    x:collection1 ] o.a.s.u.DirectUpdateHandler2 [collection1]  REMOVING ALL DOCUMENTS FROM INDEX
   [junit4]   2> 1015630 INFO  (TEST-TestExportWriter.test-seed#[D2C52DFA8429DBC1]) [    x:collection1 ] o.a.s.u.p.LogUpdateProcessorFactory [collection1]  webapp=null path=null params={}{deleteByQuery=*:*} 0 0
   [junit4]   2> 1015633 INFO  (searcherExecutor-10957-thread-1-processing-x:collection1) [    x:collection1 ] o.a.s.c.SolrCore [collection1]  Registered new searcher autowarm time: 0 ms
   [junit4]   2> 1015633 INFO  (TEST-TestExportWriter.test-seed#[D2C52DFA8429DBC1]) [    x:collection1 ] o.a.s.u.p.LogUpdateProcessorFactory [collection1]  webapp=null path=null params={}{commit=} 0 2
   [junit4]   2> 1015634 INFO  (TEST-TestExportWriter.test-seed#[D2C52DFA8429DBC1]) [     ] o.a.s.u.DirectUpdateHandler2 [collection1]  REMOVING ALL DOCUMENTS FROM INDEX
   [junit4]   2> 1015634 INFO  (TEST-TestExportWriter.test-seed#[D2C52DFA8429DBC1]) [     ] o.a.s.u.p.LogUpdateProcessorFactory [collection1]  webapp=null path=null params={_version_=-9223372036854775807&update.distrib=FROMLEADER&versions=true&wt=json&indent=true}{deleteByQuery=*:*} 0 0
   [junit4]   2> 1015635 INFO  (TEST-TestExportWriter.test-seed#[D2C52DFA8429DBC1]) [    x:collection1 ] o.a.s.u.p.LogUpdateProcessorFactory [collection1]  webapp=null path=null params={}{add=[1]} 0 0
   [junit4]   2> 1015641 INFO  (TEST-TestExportWriter.test-seed#[D2C52DFA8429DBC1]) [    x:collection1 ] o.a.s.u.p.LogUpdateProcessorFactory [collection1]  webapp=null path=null params={}{add=[7]} 0 0
   [junit4]   2> 1015646 INFO  (searcherExecutor-10957-thread-1-processing-x:collection1) [    x:collection1 ] o.a.s.c.SolrCore [collection1]  Registered new searcher autowarm time: 0 ms
   [junit4]   2> 1015646 INFO  (TEST-TestExportWriter.test-seed#[D2C52DFA8429DBC1]) [    x:collection1 ] o.a.s.u.p.LogUpdateProcessorFactory [collection1]  webapp=null path=null params={}{commit=} 0 4
   [junit4]   2> 1015647 INFO  (TEST-TestExportWriter.test-seed#[D2C52DFA8429DBC1]) [    x:collection1 ] o.a.s.u.p.LogUpdateProcessorFactory [collection1]  webapp=null path=null params={}{add=[2]} 0 0
   [junit4]   2> 1015650 INFO  (searcherExecutor-10957-thread-1-processing-x:collection1) [    x:collection1 ] o.a.s.c.SolrCore [collection1]  Registered new searcher autowarm time: 0 ms
   [junit4]   2> 1015650 INFO  (TEST-TestExportWriter.test-seed#[D2C52DFA8429DBC1]) [    x:collection1 ] o.a.s.u.p.LogUpdateProcessorFactory [collection1]  webapp=null path=null params={}{commit=} 0 2
   [junit4]   2> 1015650 INFO  (TEST-TestExportWriter.test-seed#[D2C52DFA8429DBC1]) [    x:collection1 ] o.a.s.u.p.LogUpdateProcessorFactory [collection1]  webapp=null path=null params={}{add=[3]} 0 0
   [junit4]   2> 1015655 INFO  (searcherExecutor-10957-thread-1-processing-x:collection1) [    x:collection1 ] o.a.s.c.SolrCore [collection1]  Registered new searcher autowarm time: 0 ms
   [junit4]   2> 1015655 INFO  (TEST-TestExportWriter.test-seed#[D2C52DFA8429DBC1]) [    x:collection1 ] o.a.s.u.p.LogUpdateProcessorFactory [collection1]  webapp=null path=null params={}{commit=} 0 4
   [junit4]   2> 1015656 INFO  (TEST-TestExportWriter.test-seed#[D2C52DFA8429DBC1]) [    x:collection1 ] o.a.s.u.p.LogUpdateProcessorFactory [collection1]  webapp=null path=null params={}{add=[8]} 0 0
   [junit4]   2> 1015660 INFO  (searcherExecutor-10957-thread-1-processing-x:collection1) [    x:collection1 ] o.a.s.c.SolrCore [collection1]  Registered new searcher autowarm time: 0 ms
   [junit4]   2> 1015661 INFO  (TEST-TestExportWriter.test-seed#[D2C52DFA8429DBC1]) [    x:collection1 ] o.a.s.u.p.LogUpdateProcessorFactory [collection1]  webapp=null path=null params={}{commit=} 0 4
   [junit4]   2> 1015673 INFO  (TEST-TestExportWriter.test-seed#[D2C52DFA8429DBC1]) [     ] o.a.s.c.S.Request [collection1]  webapp=null path=null params={q=id:1&qt=/export&fl=floatdv,intdv,stringdv,longdv,doubledv&sort=intdv+asc&wt=xml} hits=1 status=0 QTime=12
   [junit4]   2> 1015682 INFO  (TEST-TestExportWriter.test-seed#[D2C52DFA8429DBC1]) [     ] o.a.s.c.S.Request [collection1]  webapp=null path=null params={q=id:7&qt=/export&fl=floatdv,intdv,stringdv,longdv,doubledv&sort=intdv+asc&wt=xml} hits=1 status=0 QTime=0
   [junit4]   2> 1015683 INFO  (TEST-TestExportWriter.test-seed#[D2C52DFA8429DBC1]) [     ] o.a.s.c.S.Request [collection1]  webapp=null path=null params={q=id:1&qt=/export&fl=intdv_m,floatdv_m,doubledv_m,longdv_m,stringdv_m&sort=intdv+asc&wt=xml} hits=1 status=0 QTime=0
   [junit4]   2> 1015686 INFO  (TEST-TestExportWriter.test-seed#[D2C52DFA8429DBC1]) [     ] o.a.s.c.S.Request [collection1]  webapp=null path=null params={q=id:7&qt=/export&fl=intdv_m,floatdv_m,doubledv_m,longdv_m,stringdv_m&sort=intdv+asc&wt=xml} hits=1 status=0 QTime=0
   [junit4]   2> 1015687 INFO  (TEST-TestExportWriter.test-seed#[D2C52DFA8429DBC1]) [     ] o.a.s.c.S.Request [collection1]  webapp=null path=null params={q=id:(1+2)&qt=/export&fl=intdv&sort=intdv+desc&wt=xml} hits=2 status=0 QTime=0
   [junit4]   2> 1015687 INFO  (TEST-TestExportWriter.test-seed#[D2C52DFA8429DBC1]) [     ] o.a.s.c.S.Request [collection1]  webapp=null path=null params={q=id:(1+2)&qt=/export&fl=intdv&sort=intdv+asc&wt=xml} hits=2 status=0 QTime=0
   [junit4]   2> 1015688 INFO  (TEST-TestExportWriter.test-seed#[D2C52DFA8429DBC1]) [     ] o.a.s.c.S.Request [collection1]  webapp=null path=null params={q=id:(1+7)&qt=/export&fl=intdv&sort=stringdv+desc&wt=xml} hits=2 status=0 QTime=0
   [junit4]   2> 1015690 INFO  (TEST-TestExportWriter.test-seed#[D2C52DFA8429DBC1]) [     ] o.a.s.c.S.Request [collection1]  webapp=null path=null params={q=id:(1+7)&qt=/export&fl=intdv&sort=stringdv+asc&wt=xml} hits=2 status=0 QTime=0
   [junit4]   2> 1015690 INFO  (TEST-TestExportWriter.test-seed#[D2C52DFA8429DBC1]) [     ] o.a.s.c.S.Request [collection1]  webapp=null path=null params={q=id:(1+2)&qt=/export&fl=intdv&sort=floatdv+asc,intdv+desc&wt=xml} hits=2 status=0 QTime=0
   [junit4]   2> 1015691 INFO  (TEST-TestExportWriter.test-seed#[D2C52DFA8429DBC1]) [     ] o.a.s.c.S.Request [collection1]  webapp=null path=null params={q=id:(1+2)&qt=/export&fl=intdv&sort=floatdv+desc,intdv+asc&wt=xml} hits=2 status=0 QTime=0
   [junit4]   2> 1015692 INFO  (TEST-TestExportWriter.test-seed#[D2C52DFA8429DBC1]) [     ] o.a.s.c.S.Request [collection1]  webapp=null path=null params={q=id:(1+2+3)&qt=/export&fl=intdv&sort=floatdv+asc,stringdv+asc,intdv+desc&wt=xml} hits=3 status=0 QTime=0
   [junit4]   2> 1015693 INFO  (TEST-TestExportWriter.test-seed#[D2C52DFA8429DBC1]) [     ] o.a.s.c.S.Request [collection1]  webapp=null path=null params={q=id:(1+2+3)&qt=/export&fl=intdv&sort=floatdv+asc,stringdv+desc,intdv+asc&wt=xml} hits=3 status=0 QTime=0
   [junit4]   2> 1015694 INFO  (TEST-TestExportWriter.test-seed#[D2C52DFA8429DBC1]) [     ] o.a.s.c.S.Request [collection1]  webapp=null path=null params={q=id:(1+2+3)&qt=/export&fl=intdv&sort=floatdv+asc,floatdv+desc,floatdv+asc,intdv+desc&wt=xml} hits=3 status=0 QTime=0
   [junit4]   2> 1015694 INFO  (TEST-TestExportWriter.test-seed#[D2C52DFA8429DBC1]) [     ] o.a.s.c.S.Request [collection1]  webapp=null path=null params={q=id:(1+2+3)&qt=/export&fl=intdv&sort=intdv+desc,floatdv+asc,floatdv+desc,floatdv+asc,intdv+desc&wt=xml} hits=3 status=0 QTime=0
   [junit4]   2> 1015695 INFO  (TEST-TestExportWriter.test-seed#[D2C52DFA8429DBC1]) [     ] o.a.s.c.S.Request [collection1]  webapp=null path=null params={q=id:(1+2+3)&qt=/export&fl=intdv&sort=floatdv+desc,intdv+asc,floatdv+desc,floatdv+desc,intdv+desc&wt=xml} hits=3 status=0 QTime=0
   [junit4]   2> 1015696 INFO  (TEST-TestExportWriter.test-seed#[D2C52DFA8429DBC1]) [     ] o.a.s.c.S.Request [collection1]  webapp=null path=null params={q=id:(1+2+3)&qt=/export&fl=intdv&sort=floatdv+asc,intdv+desc,floatdv+asc,floatdv+desc,floatdv+asc,intdv+asc&wt=xml} hits=3 status=0 QTime=0
   [junit4]   2> 1015696 INFO  (TEST-TestExportWriter.test-seed#[D2C52DFA8429DBC1]) [     ] o.a.s.c.S.Request [collection1]  webapp=null path=null params={q=id:(1+2+3)&qt=/export&fl=intdv&sort=floatdv+desc,intdv+asc,floatdv+desc,floatdv+asc,floatdv+desc,floatdv+asc,intdv+desc&wt=xml} hits=3 status=0 QTime=0
   [junit4]   2> 1015697 INFO  (TEST-TestExportWriter.test-seed#[D2C52DFA8429DBC1]) [     ] o.a.s.c.S.Request [collection1]  webapp=null path=null params={q=id:(1+2+3)&qt=/export&fl=intdv&sort=floatdv+asc,intdv+desc,floatdv+asc,floatdv+desc,floatdv+asc,floatdv+desc,floatdv+asc,intdv+asc&wt=xml} hits=3 status=0 QTime=0
   [junit4]   2> 1015698 INFO  (TEST-TestExportWriter.test-seed#[D2C52DFA8429DBC1]) [     ] o.a.s.c.S.Request [collection1]  webapp=null path=null params={q=id:(1+2+3)&qt=/export&fl=intdv&sort=intdv+asc,floatdv+desc,floatdv+asc,floatdv+desc,floatdv+asc,floatdv+desc,floatdv+asc,intdv+desc&wt=xml} hits=3 status=0 QTime=0
   [junit4]   2> 1015698 INFO  (TEST-TestExportWriter.test-seed#[D2C52DFA8429DBC1]) [     ] o.a.s.c.S.Request [collection1]  webapp=null path=null params={q=id:(1+2+3)&qt=/export&fl=intdv&sort=intdv+asc,floatdv+desc,floatdv+asc,floatdv+desc,floatdv+asc,floatdv+desc,intdv+asc,intdv+desc,floatdv+asc&wt=xml} hits=3 status=0 QTime=0
   [junit4]   2> 1015699 INFO  (TEST-TestExportWriter.test-seed#[D2C52DFA8429DBC1]) [     ] o.a.s.c.S.Request [collection1]  webapp=null path=null params={q=id:(1+2+3)&qt=/export&fl=intdv&sort=floatdv+asc,intdv+desc,floatdv+asc,floatdv+desc,floatdv+asc,floatdv+desc,intdv+desc,intdv+asc,floatdv+asc&wt=xml} hits=3 status=0 QTime=0
   [junit4]   2> 1015700 INFO  (TEST-TestExportWriter.test-seed#[D2C52DFA8429DBC1]) [     ] o.a.s.c.S.Request [collection1]  webapp=null path=null params={q=id:(1+2+3)&qt=/export&fl=intdv&sort=intdv+asc,floatdv+desc,floatdv+asc,floatdv+desc,floatdv+asc,floatdv+desc,intdv+asc,intdv+desc,floatdv+desc,floatdv+asc&wt=xml} hits=3 status=0 QTime=0
   [junit4]   2> 1015700 INFO  (TEST-TestExportWriter.test-seed#[D2C52DFA8429DBC1]) [     ] o.a.s.c.S.Request [collection1]  webapp=null path=null params={q=id:(1+2+3)&qt=/export&fl=intdv&sort=floatdv+asc,intdv+desc,floatdv+asc,floatdv+desc,floatdv+asc,floatdv+desc,intdv+desc,intdv+asc,floatdv+desc,floatdv+asc&wt=xml} hits=3 status=0 QTime=0
   [junit4]   2> 1015701 INFO  (TEST-TestExportWriter.test-seed#[D2C52DFA8429DBC1]) [     ] o.a.s.c.S.Request [collection1]  webapp=null path=null params={q=id:(1+2+3)&qt=/export&fl=intdv&sort=doubledv+desc&wt=xml} hits=3 status=0 QTime=0
   [junit4]   2> 1015703 INFO  (TEST-TestExportWriter.test-seed#[D2C52DFA8429DBC1]) [     ] o.a.s.c.S.Request [collection1]  webapp=null path=null params={q=intdv:[2+TO+1000]&qt=/export&fl=intdv&sort=doubledv+desc&wt=xml} hits=3 status=0 QTime=0
   [junit4]   2> 1015705 INFO  (TEST-TestExportWriter.test-seed#[D2C52DFA8429DBC1]) [     ] o.a.s.c.S.Request [collection1]  webapp=null path=null params={q=stringdv:blah&qt=/export&fl=intdv&sort=doubledv+desc&wt=xml} hits=0 status=0 QTime=1
   [junit4]   2> 1015706 INFO  (TEST-TestExportWriter.test-seed#[D2C52DFA8429DBC1]) [     ] o.a.s.c.S.Request [collection1]  webapp=null path=null params={q=id:8&qt=/export&fl=stringdv&sort=intdv+asc&wt=xml} hits=1 status=0 QTime=0
   [junit4]   2> 1015707 INFO  (TEST-TestExportWriter.test-seed#[D2C52DFA8429DBC1]) [     ] o.a.s.c.S.Request [collection1]  webapp=null path=null params={q=id:(1+OR+3+OR+8)&qt=/export&fl=sortabledv_m_udvas,sortabledv_udvas&sort=sortabledv_udvas+asc&wt=xml} hits=3 status=0 QTime=0
   [junit4]   2> 1015709 INFO  (TEST-TestExportWriter.test-seed#[D2C52DFA8429DBC1]) [     ] o.a.s.c.S.Request [collection1]  webapp=null path=null params={q=id:(1+OR+3+OR+8)&qt=/export&fl=sortabledv_m&sort=sortabledv_udvas+asc&wt=xml} hits=3 status=0 QTime=0
   [junit4]   2> 1015710 ERROR (TEST-TestExportWriter.test-seed#[D2C52DFA8429DBC1]) [     ] o.a.s.h.e.ExportWriter java.io.IOException: sortabledv_m{type=text_gen_sort,properties=indexed,tokenized,stored,multiValued,docValues,uninvertible} Must have useDocValuesAsStored='true' to be used with export writer
   [junit4]   2> 	at org.apache.solr.handler.export.ExportWriter.getFieldWriters(ExportWriter.java:477)
   [junit4]   2> 	at org.apache.solr.handler.export.ExportWriter.write(ExportWriter.java:249)
   [junit4]   2> 	at org.apache.solr.core.SolrCore$4.write(SolrCore.java:2774)
   [junit4]   2> 	at org.apache.solr.util.TestHarness.query(TestHarness.java:340)
   [junit4]   2> 	at org.apache.solr.util.TestHarness.query(TestHarness.java:314)
   [junit4]   2> 	at org.apache.solr.handler.export.TestExportWriter.testSortingOutput(TestExportWriter.java:535)
   [junit4]   2> 	at org.apache.solr.handler.export.TestExportWriter.test(TestExportWriter.java:227)
   [junit4]   2> 	at java.base/jdk.internal.reflect.NativeMethodAccessorImpl.invoke0(Native Method)
   [junit4]   2> 	at java.base/jdk.internal.reflect.NativeMethodAccessorImpl.invoke(NativeMethodAccessorImpl.java:62)
   [junit4]   2> 	at java.base/jdk.internal.reflect.DelegatingMethodAccessorImpl.invoke(DelegatingMethodAccessorImpl.java:43)
   [junit4]   2> 	at java.base/java.lang.reflect.Method.invoke(Method.java:567)
   [junit4]   2> 	at com.carrotsearch.randomizedtesting.RandomizedRunner.invoke(RandomizedRunner.java:1750)
   [junit4]   2> 	at com.carrotsearch.randomizedtesting.RandomizedRunner$8.evaluate(RandomizedRunner.java:938)
   [junit4]   2> 	at com.carrotsearch.randomizedtesting.RandomizedRunner$9.evaluate(RandomizedRunner.java:974)
   [junit4]   2> 	at com.carrotsearch.randomizedtesting.RandomizedRunner$10.evaluate(RandomizedRunner.java:988)
   [junit4]   2> 	at com.carrotsearch.randomizedtesting.rules.SystemPropertiesRestoreRule$1.evaluate(SystemPropertiesRestoreRule.java:57)
   [junit4]   2> 	at org.apache.lucene.util.TestRuleSetupTeardownChained$1.evaluate(TestRuleSetupTeardownChained.java:49)
   [junit4]   2> 	at org.apache.lucene.util.AbstractBeforeAfterRule$1.evaluate(AbstractBeforeAfterRule.java:45)
   [junit4]   2> 	at org.apache.lucene.util.TestRuleThreadAndTestName$1.evaluate(TestRuleThreadAndTestName.java:48)
   [junit4]   2> 	at org.apache.lucene.util.TestRuleIgnoreAfterMaxFailures$1.evaluate(TestRuleIgnoreAfterMaxFailures.java:64)
   [junit4]   2> 	at org.apache.lucene.util.TestRuleMarkFailure$1.evaluate(TestRuleMarkFailure.java:47)
   [junit4]   2> 	at com.carrotsearch.randomizedtesting.rules.StatementAdapter.evaluate(StatementAdapter.java:36)
   [junit4]   2> 	at com.carrotsearch.randomizedtesting.ThreadLeakControl$StatementRunner.run(ThreadLeakControl.java:368)
   [junit4]   2> 	at com.carrotsearch.randomizedtesting.ThreadLeakControl.forkTimeoutingTask(ThreadLeakControl.java:817)
   [junit4]   2> 	at com.carrotsearch.randomizedtesting.ThreadLeakControl$3.evaluate(ThreadLeakControl.java:468)
   [junit4]   2> 	at com.carrotsearch.randomizedtesting.RandomizedRunner.runSingleTest(RandomizedRunner.java:947)
   [junit4]   2> 	at com.carrotsearch.randomizedtesting.RandomizedRunner$5.evaluate(RandomizedRunner.java:832)
   [junit4]   2> 	at com.carrotsearch.randomizedtesting.RandomizedRunner$6.evaluate(RandomizedRunner.java:883)
   [junit4]   2> 	at com.carrotsearch.randomizedtesting.RandomizedRunner$7.evaluate(RandomizedRunner.java:894)
   [junit4]   2> 	at com.carrotsearch.randomizedtesting.rules.StatementAdapter.evaluate(StatementAdapter.java:36)
   [junit4]   2> 	at com.carrotsearch.randomizedtesting.rules.SystemPropertiesRestoreRule$1.evaluate(SystemPropertiesRestoreRule.java:57)
   [junit4]   2> 	at org.apache.lucene.util.AbstractBeforeAfterRule$1.evaluate(AbstractBeforeAfterRule.java:45)
   [junit4]   2> 	at com.carrotsearch.randomizedtesting.rules.StatementAdapter.evaluate(StatementAdapter.java:36)
   [junit4]   2> 	at org.apache.lucene.util.TestRuleStoreClassName$1.evaluate(TestRuleStoreClassName.java:41)
   [junit4]   2> 	at com.carrotsearch.randomizedtesting.rules.NoShadowingOrOverridesOnMethodsRule$1.evaluate(NoShadowingOrOverridesOnMethodsRule.java:40)
   [junit4]   2> 	at com.carrotsearch.randomizedtesting.rules.NoShadowingOrOverridesOnMethodsRule$1.evaluate(NoShadowingOrOverridesOnMethodsRule.java:40)
   [junit4]   2> 	at com.carrotsearch.randomizedtesting.rules.StatementAdapter.evaluate(StatementAdapter.java:36)
   [junit4]   2> 	at com.carrotsearch.randomizedtesting.rules.StatementAdapter.evaluate(StatementAdapter.java:36)
   [junit4]   2> 	at org.apache.lucene.util.TestRuleAssertionsRequired$1.evaluate(TestRuleAssertionsRequired.java:53)
   [junit4]   2> 	at org.apache.lucene.util.TestRuleMarkFailure$1.evaluate(TestRuleMarkFailure.java:47)
   [junit4]   2> 	at org.apache.lucene.util.TestRuleIgnoreAfterMaxFailures$1.evaluate(TestRuleIgnoreAfterMaxFailures.java:64)
   [junit4]   2> 	at org.apache.lucene.util.TestRuleIgnoreTestSuites$1.evaluate(TestRuleIgnoreTestSuites.java:54)
   [junit4]   2> 	at com.carrotsearch.randomizedtesting.rules.StatementAdapter.evaluate(StatementAdapter.java:36)
   [junit4]   2> 	at com.carrotsearch.randomizedtesting.ThreadLeakControl$StatementRunner.run(ThreadLeakControl.java:368)
   [junit4]   2> 	at java.base/java.lang.Thread.run(Thread.java:835)
   [junit4]   2> 
   [junit4]   2> 1015711 INFO  (TEST-TestExportWriter.test-seed#[D2C52DFA8429DBC1]) [     ] o.a.s.c.S.Request [collection1]  webapp=null path=null params={q=id:(1+OR+3+OR+8)&qt=/export&fl=sortabledv&sort=sortabledv_udvas+asc&wt=xml} hits=3 status=0 QTime=0
   [junit4]   2> 1015711 ERROR (TEST-TestExportWriter.test-seed#[D2C52DFA8429DBC1]) [     ] o.a.s.h.e.ExportWriter java.io.IOException: sortabledv{type=text_gen_sort,properties=indexed,tokenized,stored,docValues,uninvertible} Must have useDocValuesAsStored='true' to be used with export writer
   [junit4]   2> 	at org.apache.solr.handler.export.ExportWriter.getFieldWriters(ExportWriter.java:477)
   [junit4]   2> 	at org.apache.solr.handler.export.ExportWriter.write(ExportWriter.java:249)
   [junit4]   2> 	at org.apache.solr.core.SolrCore$4.write(SolrCore.java:2774)
   [junit4]   2> 	at org.apache.solr.util.TestHarness.query(TestHarness.java:340)
   [junit4]   2> 	at org.apache.solr.util.TestHarness.query(TestHarness.java:314)
   [junit4]   2> 	at org.apache.solr.handler.export.TestExportWriter.testSortingOutput(TestExportWriter.java:539)
   [junit4]   2> 	at org.apache.solr.handler.export.TestExportWriter.test(TestExportWriter.java:227)
   [junit4]   2> 	at java.base/jdk.internal.reflect.NativeMethodAccessorImpl.invoke0(Native Method)
   [junit4]   2> 	at java.base/jdk.internal.reflect.NativeMethodAccessorImpl.invoke(NativeMethodAccessorImpl.java:62)
   [junit4]   2> 	at java.base/jdk.internal.reflect.DelegatingMethodAccessorImpl.invoke(DelegatingMethodAccessorImpl.java:43)
   [junit4]   2> 	at java.base/java.lang.reflect.Method.invoke(Method.java:567)
   [junit4]   2> 	at com.carrotsearch.randomizedtesting.RandomizedRunner.invoke(RandomizedRunner.java:1750)
   [junit4]   2> 	at com.carrotsearch.randomizedtesting.RandomizedRunner$8.evaluate(RandomizedRunner.java:938)
   [junit4]   2> 	at com.carrotsearch.randomizedtesting.RandomizedRunner$9.evaluate(RandomizedRunner.java:974)
   [junit4]   2> 	at com.carrotsearch.randomizedtesting.RandomizedRunner$10.evaluate(RandomizedRunner.java:988)
   [junit4]   2> 	at com.carrotsearch.randomizedtesting.rules.SystemPropertiesRestoreRule$1.evaluate(SystemPropertiesRestoreRule.java:57)
   [junit4]   2> 	at org.apache.lucene.util.TestRuleSetupTeardownChained$1.evaluate(TestRuleSetupTeardownChained.java:49)
   [junit4]   2> 	at org.apache.lucene.util.AbstractBeforeAfterRule$1.evaluate(AbstractBeforeAfterRule.java:45)
   [junit4]   2> 	at org.apache.lucene.util.TestRuleThreadAndTestName$1.evaluate(TestRuleThreadAndTestName.java:48)
   [junit4]   2> 	at org.apache.lucene.util.TestRuleIgnoreAfterMaxFailures$1.evaluate(TestRuleIgnoreAfterMaxFailures.java:64)
   [junit4]   2> 	at org.apache.lucene.util.TestRuleMarkFailure$1.evaluate(TestRuleMarkFailure.java:47)
   [junit4]   2> 	at com.carrotsearch.randomizedtesting.rules.StatementAdapter.evaluate(StatementAdapter.java:36)
   [junit4]   2> 	at com.carrotsearch.randomizedtesting.ThreadLeakControl$StatementRunner.run(ThreadLeakControl.java:368)
   [junit4]   2> 	at com.carrotsearch.randomizedtesting.ThreadLeakControl.forkTimeoutingTask(ThreadLeakControl.java:817)
   [junit4]   2> 	at com.carrotsearch.randomizedtesting.ThreadLeakControl$3.evaluate(ThreadLeakControl.java:468)
   [junit4]   2> 	at com.carrotsearch.randomizedtesting.RandomizedRunner.runSingleTest(RandomizedRunner.java:947)
   [junit4]   2> 	at com.carrotsearch.randomizedtesting.RandomizedRunner$5.evaluate(RandomizedRunner.java:832)
   [junit4]   2> 	at com.carrotsearch.randomizedtesting.RandomizedRunner$6.evaluate(RandomizedRunner.java:883)
   [junit4]   2> 	at com.carrotsearch.randomizedtesting.RandomizedRunner$7.evaluate(RandomizedRunner.java:894)
   [junit4]   2> 	at com.carrotsearch.randomizedtesting.rules.StatementAdapter.evaluate(StatementAdapter.java:36)
   [junit4]   2> 	at com.carrotsearch.randomizedtesting.rules.SystemPropertiesRestoreRule$1.evaluate(SystemPropertiesRestoreRule.java:57)
   [junit4]   2> 	at org.apache.lucene.util.AbstractBeforeAfterRule$1.evaluate(AbstractBeforeAfterRule.java:45)
   [junit4]   2> 	at com.carrotsearch.randomizedtesting.rules.StatementAdapter.evaluate(StatementAdapter.java:36)
   [junit4]   2> 	at org.apache.lucene.util.TestRuleStoreClassName$1.evaluate(TestRuleStoreClassName.java:41)
   [junit4]   2> 	at com.carrotsearch.randomizedtesting.rules.NoShadowingOrOverridesOnMethodsRule$1.evaluate(NoShadowingOrOverridesOnMethodsRule.java:40)
   [junit4]   2> 	at com.carrotsearch.randomizedtesting.rules.NoShadowingOrOverridesOnMethodsRule$1.evaluate(NoShadowingOrOverridesOnMethodsRule.java:40)
   [junit4]   2> 	at com.carrotsearch.randomizedtesting.rules.StatementAdapter.evaluate(StatementAdapter.java:36)
   [junit4]   2> 	at com.carrotsearch.randomizedtesting.rules.StatementAdapter.evaluate(StatementAdapter.java:36)
   [junit4]   2> 	at org.apache.lucene.util.TestRuleAssertionsRequired$1.evaluate(TestRuleAssertionsRequired.java:53)
   [junit4]   2> 	at org.apache.lucene.util.TestRuleMarkFailure$1.evaluate(TestRuleMarkFailure.java:47)
   [junit4]   2> 	at org.apache.lucene.util.TestRuleIgnoreAfterMaxFailures$1.evaluate(TestRuleIgnoreAfterMaxFailures.java:64)
   [junit4]   2> 	at org.apache.lucene.util.TestRuleIgnoreTestSuites$1.evaluate(TestRuleIgnoreTestSuites.java:54)
   [junit4]   2> 	at com.carrotsearch.randomizedtesting.rules.StatementAdapter.evaluate(StatementAdapter.java:36)
   [junit4]   2> 	at com.carrotsearch.randomizedtesting.ThreadLeakControl$StatementRunner.run(ThreadLeakControl.java:368)
   [junit4]   2> 	at java.base/java.lang.Thread.run(Thread.java:835)
   [junit4]   2> 
   [junit4]   2> 1015711 INFO  (TEST-TestExportWriter.test-seed#[D2C52DFA8429DBC1]) [     ] o.a.s.c.S.Request [collection1]  webapp=null path=null params={qt=/export&wt=xml} hits=0 status=0 QTime=0
   [junit4]   2> 1015711 ERROR (TEST-TestExportWriter.test-seed#[D2C52DFA8429DBC1]) [     ] o.a.s.h.e.ExportWriter java.io.IOException: org.apache.solr.search.SyntaxError: No sort criteria was provided.
   [junit4]   2> 	at org.apache.solr.handler.export.ExportWriter.write(ExportWriter.java:200)
   [junit4]   2> 	at org.apache.solr.core.SolrCore$4.write(SolrCore.java:2774)
   [junit4]   2> 	at org.apache.solr.util.TestHarness.query(TestHarness.java:340)
   [junit4]   2> 	at org.apache.solr.util.TestHarness.query(TestHarness.java:314)
   [junit4]   2> 	at org.apache.solr.handler.export.TestExportWriter.testExportRequiredParams(TestExportWriter.java:555)
   [junit4]   2> 	at org.apache.solr.handler.export.TestExportWriter.test(TestExportWriter.java:228)
   [junit4]   2> 	at java.base/jdk.internal.reflect.NativeMethodAccessorImpl.invoke0(Native Method)
   [junit4]   2> 	at java.base/jdk.internal.reflect.NativeMethodAccessorImpl.invoke(NativeMethodAccessorImpl.java:62)
   [junit4]   2> 	at java.base/jdk.internal.reflect.DelegatingMethodAccessorImpl.invoke(DelegatingMethodAccessorImpl.java:43)
   [junit4]   2> 	at java.base/java.lang.reflect.Method.invoke(Method.java:567)
   [junit4]   2> 	at com.carrotsearch.randomizedtesting.RandomizedRunner.invoke(RandomizedRunner.java:1750)
   [junit4]   2> 	at com.carrotsearch.randomizedtesting.RandomizedRunner$8.evaluate(RandomizedRunner.java:938)
   [junit4]   2> 	at com.carrotsearch.randomizedtesting.RandomizedRunner$9.evaluate(RandomizedRunner.java:974)
   [junit4]   2> 	at com.carrotsearch.randomizedtesting.RandomizedRunner$10.evaluate(RandomizedRunner.java:988)
   [junit4]   2> 	at com.carrotsearch.randomizedtesting.rules.SystemPropertiesRestoreRule$1.evaluate(SystemPropertiesRestoreRule.java:57)
   [junit4]   2> 	at org.apache.lucene.util.TestRuleSetupTeardownChained$1.evaluate(TestRuleSetupTeardownChained.java:49)
   [junit4]   2> 	at org.apache.lucene.util.AbstractBeforeAfterRule$1.evaluate(AbstractBeforeAfterRule.java:45)
   [junit4]   2> 	at org.apache.lucene.util.TestRuleThreadAndTestName$1.evaluate(TestRuleThreadAndTestName.java:48)
   [junit4]   2> 	at org.apache.lucene.util.TestRuleIgnoreAfterMaxFailures$1.evaluate(TestRuleIgnoreAfterMaxFailures.java:64)
   [junit4]   2> 	at org.apache.lucene.util.TestRuleMarkFailure$1.evaluate(TestRuleMarkFailure.java:47)
   [junit4]   2> 	at com.carrotsearch.randomizedtesting.rules.StatementAdapter.evaluate(StatementAdapter.java:36)
   [junit4]   2> 	at com.carrotsearch.randomizedtesting.ThreadLeakControl$StatementRunner.run(ThreadLeakControl.java:368)
   [junit4]   2> 	at com.carrotsearch.randomizedtesting.ThreadLeakControl.forkTimeoutingTask(ThreadLeakControl.java:817)
   [junit4]   2> 	at com.carrotsearch.randomizedtesting.ThreadLeakControl$3.evaluate(ThreadLeakControl.java:468)
   [junit4]   2> 	at com.carrotsearch.randomizedtesting.RandomizedRunner.runSingleTest(RandomizedRunner.java:947)
   [junit4]   2> 	at com.carrotsearch.randomizedtesting.RandomizedRunner$5.evaluate(RandomizedRunner.java:832)
   [junit4]   2> 	at com.carrotsearch.randomizedtesting.RandomizedRunner$6.evaluate(RandomizedRunner.java:883)
   [junit4]   2> 	at com.carrotsearch.randomizedtesting.RandomizedRunner$7.evaluate(RandomizedRunner.java:894)
   [junit4]   2> 	at com.carrotsearch.randomizedtesting.rules.StatementAdapter.evaluate(StatementAdapter.java:36)
   [junit4]   2> 	at com.carrotsearch.randomizedtesting.rules.SystemPropertiesRestoreRule$1.evaluate(SystemPropertiesRestoreRule.java:57)
   [junit4]   2> 	at org.apache.lucene.util.AbstractBeforeAfterRule$1.evaluate(AbstractBeforeAfterRule.java:45)
   [junit4]   2> 	at com.carrotsearch.randomizedtesting.rules.StatementAdapter.evaluate(StatementAdapter.java:36)
   [junit4]   2> 	at org.apache.lucene.util.TestRuleStoreClassName$1.evaluate(TestRuleStoreClassName.java:41)
   [junit4]   2> 	at com.carrotsearch.randomizedtesting.rules.NoShadowingOrOverridesOnMethodsRule$1.evaluate(NoShadowingOrOverridesOnMethodsRule.java:40)
   [junit4]   2> 	at com.carrotsearch.randomizedtesting.rules.NoShadowingOrOverridesOnMethodsRule$1.evaluate(NoShadowingOrOverridesOnMethodsRule.java:40)
   [junit4]   2> 	at com.carrotsearch.randomizedtesting.rules.StatementAdapter.evaluate(StatementAdapter.java:36)
   [junit4]   2> 	at com.carrotsearch.randomizedtesting.rules.StatementAdapter.evaluate(StatementAdapter.java:36)
   [junit4]   2> 	at org.apache.lucene.util.TestRuleAssertionsRequired$1.evaluate(TestRuleAssertionsRequired.java:53)
   [junit4]   2> 	at org.apache.lucene.util.TestRuleMarkFailure$1.evaluate(TestRuleMarkFailure.java:47)
   [junit4]   2> 	at org.apache.lucene.util.TestRuleIgnoreAfterMaxFailures$1.evaluate(TestRuleIgnoreAfterMaxFailures.java:64)
   [junit4]   2> 	at org.apache.lucene.util.TestRuleIgnoreTestSuites$1.evaluate(TestRuleIgnoreTestSuites.java:54)
   [junit4]   2> 	at com.carrotsearch.randomizedtesting.rules.StatementAdapter.evaluate(StatementAdapter.java:36)
   [junit4]   2> 	at com.carrotsearch.randomizedtesting.ThreadLeakControl$StatementRunner.run(ThreadLeakControl.java:368)
   [junit4]   2> 	at java.base/java.lang.Thread.run(Thread.java:835)
   [junit4]   2> Caused by: org.apache.solr.search.SyntaxError: No sort criteria was provided.
   [junit4]   2> 	... 44 more
   [junit4]   2> 
   [junit4]   2> 1015711 INFO  (TEST-TestExportWriter.test-seed#[D2C52DFA8429DBC1]) [     ] o.a.s.c.S.Request [collection1]  webapp=null path=null params={qt=/export&sort=intdv+asc&wt=xml} hits=0 status=0 QTime=0
   [junit4]   2> 1015712 ERROR (TEST-TestExportWriter.test-seed#[D2C52DFA8429DBC1]) [     ] o.a.s.h.e.ExportWriter java.io.IOException: org.apache.solr.search.SyntaxError: export field list (fl) must be specified.
   [junit4]   2> 	at org.apache.solr.handler.export.ExportWriter.write(ExportWriter.java:232)
   [junit4]   2> 	at org.apache.solr.core.SolrCore$4.write(SolrCore.java:2774)
   [junit4]   2> 	at org.apache.solr.util.TestHarness.query(TestHarness.java:340)
   [junit4]   2> 	at org.apache.solr.util.TestHarness.query(TestHarness.java:314)
   [junit4]   2> 	at org.apache.solr.handler.export.TestExportWriter.testExportRequiredParams(TestExportWriter.java:557)
   [junit4]   2> 	at org.apache.solr.handler.export.TestExportWriter.test(TestExportWriter.java:228)
   [junit4]   2> 	at java.base/jdk.internal.reflect.NativeMethodAccessorImpl.invoke0(Native Method)
   [junit4]   2> 	at java.base/jdk.internal.reflect.NativeMethodAccessorImpl.invoke(NativeMethodAccessorImpl.java:62)
   [junit4]   2> 	at java.base/jdk.internal.reflect.DelegatingMethodAccessorImpl.invoke(DelegatingMethodAccessorImpl.java:43)
   [junit4]   2> 	at java.base/java.lang.reflect.Method.invoke(Method.java:567)
   [junit4]   2> 	at com.carrotsearch.randomizedtesting.RandomizedRunner.invoke(RandomizedRunner.java:1750)
   [junit4]   2> 	at com.carrotsearch.randomizedtesting.RandomizedRunner$8.evaluate(RandomizedRunner.java:938)
   [junit4]   2> 	at com.carrotsearch.randomizedtesting.RandomizedRunner$9.evaluate(RandomizedRunner.java:974)
   [junit4]   2> 	at com.carrotsearch.randomizedtesting.RandomizedRunner$10.evaluate(RandomizedRunner.java:988)
   [junit4]   2> 	at com.carrotsearch.randomizedtesting.rules.SystemPropertiesRestoreRule$1.evaluate(SystemPropertiesRestoreRule.java:57)
   [junit4]   2> 	at org.apache.lucene.util.TestRuleSetupTeardownChained$1.evaluate(TestRuleSetupTeardownChained.java:49)
   [junit4]   2> 	at org.apache.lucene.util.AbstractBeforeAfterRule$1.evaluate(AbstractBeforeAfterRule.java:45)
   [junit4]   2> 	at org.apache.lucene.util.TestRuleThreadAndTestName$1.evaluate(TestRuleThreadAndTestName.java:48)
   [junit4]   2> 	at org.apache.lucene.util.TestRuleIgnoreAfterMaxFailures$1.evaluate(TestRuleIgnoreAfterMaxFailures.java:64)
   [junit4]   2> 	at org.apache.lucene.util.TestRuleMarkFailure$1.evaluate(TestRuleMarkFailure.java:47)
   [junit4]   2> 	at com.carrotsearch.randomizedtesting.rules.StatementAdapter.evaluate(StatementAdapter.java:36)
   [junit4]   2> 	at com.carrotsearch.randomizedtesting.ThreadLeakControl$StatementRunner.run(ThreadLeakControl.java:368)
   [junit4]   2> 	at com.carrotsearch.randomizedtesting.ThreadLeakControl.forkTimeoutingTask(ThreadLeakControl.java:817)
   [junit4]   2> 	at com.carrotsearch.randomizedtesting.ThreadLeakControl$3.evaluate(ThreadLeakControl.java:468)
   [junit4]   2> 	at com.carrotsearch.randomizedtesting.RandomizedRunner.runSingleTest(RandomizedRunner.java:947)
   [junit4]   2> 	at com.carrotsearch.randomizedtesting.RandomizedRunner$5.evaluate(RandomizedRunner.java:832)
   [junit4]   2> 	at com.carrotsearch.randomizedtesting.RandomizedRunner$6.evaluate(RandomizedRunner.java:883)
   [junit4]   2> 	at com.carrotsearch.randomizedtesting.RandomizedRunner$7.evaluate(RandomizedRunner.java:894)
   [junit4]   2> 	at com.carrotsearch.randomizedtesting.rules.StatementAdapter.evaluate(StatementAdapter.java:36)
   [junit4]   2> 	at com.carrotsearch.randomizedtesting.rules.SystemPropertiesRestoreRule$1.evaluate(SystemPropertiesRestoreRule.java:57)
   [junit4]   2> 	at org.apache.lucene.util.AbstractBeforeAfterRule$1.evaluate(AbstractBeforeAfterRule.java:45)
   [junit4]   2> 	at com.carrotsearch.randomizedtesting.rules.StatementAdapter.evaluate(StatementAdapter.java:36)
   [junit4]   2> 	at org.apache.lucene.util.TestRuleStoreClassName$1.evaluate(TestRuleStoreClassName.java:41)
   [junit4]   2> 	at com.carrotsearch.randomizedtesting.rules.NoShadowingOrOverridesOnMethodsRule$1.evaluate(NoShadowingOrOverridesOnMethodsRule.java:40)
   [junit4]   2> 	at com.carrotsearch.randomizedtesting.rules.NoShadowingOrOverridesOnMethodsRule$1.evaluate(NoShadowingOrOverridesOnMethodsRule.java:40)
   [junit4]   2> 	at com.carrotsearch.randomizedtesting.rules.StatementAdapter.evaluate(StatementAdapter.java:36)
   [junit4]   2> 	at com.carrotsearch.randomizedtesting.rules.StatementAdapter.evaluate(StatementAdapter.java:36)
   [junit4]   2> 	at org.apache.lucene.util.TestRuleAssertionsRequired$1.evaluate(TestRuleAssertionsRequired.java:53)
   [junit4]   2> 	at org.apache.lucene.util.TestRuleMarkFailure$1.evaluate(TestRuleMarkFailure.java:47)
   [junit4]   2> 	at org.apache.lucene.util.TestRuleIgnoreAfterMaxFailures$1.evaluate(TestRuleIgnoreAfterMaxFailures.java:64)
   [junit4]   2> 	at org.apache.lucene.util.TestRuleIgnoreTestSuites$1.evaluate(TestRuleIgnoreTestSuites.java:54)
   [junit4]   2> 	at com.carrotsearch.randomizedtesting.rules.StatementAdapter.evaluate(StatementAdapter.java:36)
   [junit4]   2> 	at com.carrotsearch.randomizedtesting.ThreadLeakControl$StatementRunner.run(ThreadLeakControl.java:368)
   [junit4]   2> 	at java.base/java.lang.Thread.run(Thread.java:835)
   [junit4]   2> Caused by: org.apache.solr.search.SyntaxError: export field list (fl) must be specified.
   [junit4]   2> 	... 44 more
   [junit4]   2> 
   [junit4]   2> 1015712 INFO  (TEST-TestExportWriter.test-seed#[D2C52DFA8429DBC1]) [     ] o.a.s.c.S.Request [collection1]  webapp=null path=null params={qt=/export&fl=stringdv&sort=intdv+asc&wt=xml} hits=0 status=0 QTime=0
   [junit4]   2> 1015712 INFO  (TEST-TestExportWriter.test-seed#[D2C52DFA8429DBC1]) [     ] o.a.s.c.S.Request [collection1]  webapp=null path=null params={q=id:1&qt=/export&fl=datedv&sort=datedv+asc&wt=xml} hits=1 status=0 QTime=0
   [junit4]   2> 1015714 INFO  (TEST-TestExportWriter.test-seed#[D2C52DFA8429DBC1]) [     ] o.a.s.c.S.Request [collection1]  webapp=null path=null params={q=id:1&qt=/export&fl=datedv_m&sort=datedv+asc&wt=xml} hits=1 status=0 QTime=0
   [junit4]   2> 1015715 INFO  (TEST-TestExportWriter.test-seed#[D2C52DFA8429DBC1]) [     ] o.a.s.c.S.Request [collection1]  webapp=null path=null params={q=id:3&qt=/export&fl=int_is_t&sort=intdv+asc&wt=xml} hits=1 status=0 QTime=0
   [junit4]   2> 1015716 INFO  (TEST-TestExportWriter.test-seed#[D2C52DFA8429DBC1]) [     ] o.a.s.c.S.Request [collection1]  webapp=null path=null params={q=id:8&qt=/export&fl=int_is_p&sort=intdv+asc&wt=xml} hits=1 status=0 QTime=0
   [junit4]   2> 1015716 INFO  (TEST-TestExportWriter.test-seed#[D2C52DFA8429DBC1]) [     ] o.a.s.u.DirectUpdateHandler2 [collection1]  REMOVING ALL DOCUMENTS FROM INDEX
   [junit4]   2> 1015716 INFO  (TEST-TestExportWriter.test-seed#[D2C52DFA8429DBC1]) [     ] o.a.s.u.p.LogUpdateProcessorFactory [collection1]  webapp=null path=null params={_version_=-9223372036854775807&update.distrib=FROMLEADER&versions=true&wt=json&indent=true}{deleteByQuery=*:*} 0 0
   [junit4]   2> 1015717 INFO  (TEST-TestExportWriter.test-seed#[D2C52DFA8429DBC1]) [     ] o.a.s.SolrTestCaseJ4 ###Ending test
   [junit4]   2> 1015720 INFO  (TEST-TestExportWriter.testExpr-seed#[D2C52DFA8429DBC1]) [     ] o.a.s.SolrTestCaseJ4 ###Starting testExpr
   [junit4]   2> 1015720 INFO  (TEST-TestExportWriter.testExpr-seed#[D2C52DFA8429DBC1]) [    x:collection1 ] o.a.s.u.DirectUpdateHandler2 [collection1]  REMOVING ALL DOCUMENTS FROM INDEX
   [junit4]   2> 1015720 INFO  (TEST-TestExportWriter.testExpr-seed#[D2C52DFA8429DBC1]) [    x:collection1 ] o.a.s.u.p.LogUpdateProcessorFactory [collection1]  webapp=null path=null params={}{deleteByQuery=*:*} 0 0
   [junit4]   2> 1015722 INFO  (searcherExecutor-10957-thread-1-processing-x:collection1) [    x:collection1 ] o.a.s.c.SolrCore [collection1]  Registered new searcher autowarm time: 0 ms
   [junit4]   2> 1015722 INFO  (TEST-TestExportWriter.testExpr-seed#[D2C52DFA8429DBC1]) [    x:collection1 ] o.a.s.u.p.LogUpdateProcessorFactory [collection1]  webapp=null path=null params={}{commit=} 0 1
   [junit4]   2> 1015723 INFO  (TEST-TestExportWriter.testExpr-seed#[D2C52DFA8429DBC1]) [    x:collection1 ] o.a.s.u.DirectUpdateHandler2 [collection1]  REMOVING ALL DOCUMENTS FROM INDEX
   [junit4]   2> 1015723 INFO  (TEST-TestExportWriter.testExpr-seed#[D2C52DFA8429DBC1]) [    x:collection1 ] o.a.s.u.p.LogUpdateProcessorFactory [collection1]  webapp=null path=null params={}{deleteByQuery=*:*} 0 0
   [junit4]   2> 1015724 INFO  (searcherExecutor-10957-thread-1-processing-x:collection1) [    x:collection1 ] o.a.s.c.SolrCore [collection1]  Registered new searcher autowarm time: 0 ms
   [junit4]   2> 1015724 INFO  (TEST-TestExportWriter.testExpr-seed#[D2C52DFA8429DBC1]) [    x:collection1 ] o.a.s.u.p.LogUpdateProcessorFactory [collection1]  webapp=null path=null params={}{commit=} 0 1
   [junit4]   2> 1015871 INFO  (TEST-TestExportWriter.testExpr-seed#[D2C52DFA8429DBC1]) [     ] o.a.s.u.p.LogUpdateProcessorFactory [collection1]  webapp=null path=null params={wt=json&indent=true}{add=[0, 1, 2, 3, 4, 5, 6, 7, 8, 9, ... (5000 adds)]} 0 130
   [junit4]   2> 1016021 INFO  (TEST-TestExportWriter.testExpr-seed#[D2C52DFA8429DBC1]) [     ] o.a.s.u.p.LogUpdateProcessorFactory [collection1]  webapp=null path=null params={wt=json&indent=true}{add=[5000, 5001, 5002, 5003, 5004, 5005, 5006, 5007, 5008, 5009, ... (5000 adds)]} 0 141
   [junit4]   2> 1016173 INFO  (TEST-TestExportWriter.testExpr-seed#[D2C52DFA8429DBC1]) [     ] o.a.s.u.p.LogUpdateProcessorFactory [collection1]  webapp=null path=null params={wt=json&indent=true}{add=[10000, 10001, 10002, 10003, 10004, 10005, 10006, 10007, 10008, 10009, ... (5000 adds)]} 0 144
   [junit4]   2> 1016426 INFO  (TEST-TestExportWriter.testExpr-seed#[D2C52DFA8429DBC1]) [     ] o.a.s.u.p.LogUpdateProcessorFactory [collection1]  webapp=null path=null params={wt=json&indent=true}{add=[15000, 15001, 15002, 15003, 15004, 15005, 15006, 15007, 15008, 15009, ... (5000 adds)]} 0 231
   [junit4]   2> 1016582 INFO  (TEST-TestExportWriter.testExpr-seed#[D2C52DFA8429DBC1]) [     ] o.a.s.u.p.LogUpdateProcessorFactory [collection1]  webapp=null path=null params={wt=json&indent=true}{add=[20000, 20001, 20002, 20003, 20004, 20005, 20006, 20007, 20008, 20009, ... (5000 adds)]} 0 144
   [junit4]   2> 1016759 INFO  (TEST-TestExportWriter.testExpr-seed#[D2C52DFA8429DBC1]) [     ] o.a.s.u.p.LogUpdateProcessorFactory [collection1]  webapp=null path=null params={wt=json&indent=true}{add=[25000, 25001, 25002, 25003, 25004, 25005, 25006, 25007, 25008, 25009, ... (5000 adds)]} 0 168
   [junit4]   2> 1016993 INFO  (TEST-TestExportWriter.testExpr-seed#[D2C52DFA8429DBC1]) [     ] o.a.s.u.p.LogUpdateProcessorFactory [collection1]  webapp=null path=null params={wt=json&indent=true}{add=[30000, 30001, 30002, 30003, 30004, 30005, 30006, 30007, 30008, 30009, ... (5000 adds)]} 0 211
   [junit4]   2> 1017179 INFO  (TEST-TestExportWriter.testExpr-seed#[D2C52DFA8429DBC1]) [     ] o.a.s.u.p.LogUpdateProcessorFactory [collection1]  webapp=null path=null params={wt=json&indent=true}{add=[35000, 35001, 35002, 35003, 35004, 35005, 35006, 35007, 35008, 35009, ... (5000 adds)]} 0 175
   [junit4]   2> 1017349 INFO  (TEST-TestExportWriter.testExpr-seed#[D2C52DFA8429DBC1]) [     ] o.a.s.u.p.LogUpdateProcessorFactory [collection1]  webapp=null path=null params={wt=json&indent=true}{add=[40000, 40001, 40002, 40003, 40004, 40005, 40006, 40007, 40008, 40009, ... (5000 adds)]} 0 160
   [junit4]   2> 1017608 INFO  (TEST-TestExportWriter.testExpr-seed#[D2C52DFA8429DBC1]) [     ] o.a.s.u.p.LogUpdateProcessorFactory [collection1]  webapp=null path=null params={wt=json&indent=true}{add=[45000, 45001, 45002, 45003, 45004, 45005, 45006, 45007, 45008, 45009, ... (5000 adds)]} 0 237
   [junit4]   2> 1017872 INFO  (TEST-TestExportWriter.testExpr-seed#[D2C52DFA8429DBC1]) [     ] o.a.s.u.p.LogUpdateProcessorFactory [collection1]  webapp=null path=null params={wt=json&indent=true}{add=[50000, 50001, 50002, 50003, 50004, 50005, 50006, 50007, 50008, 50009, ... (5000 adds)]} 0 248
   [junit4]   2> 1018056 INFO  (TEST-TestExportWriter.testExpr-seed#[D2C52DFA8429DBC1]) [     ] o.a.s.u.p.LogUpdateProcessorFactory [collection1]  webapp=null path=null params={wt=json&indent=true}{add=[55000, 55001, 55002, 55003, 55004, 55005, 55006, 55007, 55008, 55009, ... (5000 adds)]} 0 158
   [junit4]   2> 1018202 INFO  (TEST-TestExportWriter.testExpr-seed#[D2C52DFA8429DBC1]) [     ] o.a.s.u.p.LogUpdateProcessorFactory [collection1]  webapp=null path=null params={wt=json&indent=true}{add=[60000, 60001, 60002, 60003, 60004, 60005, 60006, 60007, 60008, 60009, ... (5000 adds)]} 0 138
   [junit4]   2> 1018337 INFO  (TEST-TestExportWriter.testExpr-seed#[D2C52DFA8429DBC1]) [     ] o.a.s.u.p.LogUpdateProcessorFactory [collection1]  webapp=null path=null params={wt=json&indent=true}{add=[65000, 65001, 65002, 65003, 65004, 65005, 65006, 65007, 65008, 65009, ... (5000 adds)]} 0 121
   [junit4]   2> 1018460 INFO  (TEST-TestExportWriter.testExpr-seed#[D2C52DFA8429DBC1]) [     ] o.a.s.u.p.LogUpdateProcessorFactory [collection1]  webapp=null path=null params={wt=json&indent=true}{add=[70000, 70001, 70002, 70003, 70004, 70005, 70006, 70007, 70008, 70009, ... (5000 adds)]} 0 107
   [junit4]   2> 1018616 INFO  (TEST-TestExportWriter.testExpr-seed#[D2C52DFA8429DBC1]) [     ] o.a.s.u.p.LogUpdateProcessorFactory [collection1]  webapp=null path=null params={wt=json&indent=true}{add=[75000, 75001, 75002, 75003, 75004, 75005, 75006, 75007, 75008, 75009, ... (5000 adds)]} 0 148
   [junit4]   2> 1018769 INFO  (TEST-TestExportWriter.testExpr-seed#[D2C52DFA8429DBC1]) [     ] o.a.s.u.p.LogUpdateProcessorFactory [collection1]  webapp=null path=null params={wt=json&indent=true}{add=[80000, 80001, 80002, 80003, 80004, 80005, 80006, 80007, 80008, 80009, ... (5000 adds)]} 0 145
   [junit4]   2> 1018935 INFO  (TEST-TestExportWriter.testExpr-seed#[D2C52DFA8429DBC1]) [     ] o.a.s.u.p.LogUpdateProcessorFactory [collection1]  webapp=null path=null params={wt=json&indent=true}{add=[85000, 85001, 85002, 85003, 85004, 85005, 85006, 85007, 85008, 85009, ... (5000 adds)]} 0 156
   [junit4]   2> 1019096 INFO  (TEST-TestExportWriter.testExpr-seed#[D2C52DFA8429DBC1]) [     ] o.a.s.u.p.LogUpdateProcessorFactory [collection1]  webapp=null path=null params={wt=json&indent=true}{add=[90000, 90001, 90002, 90003, 90004, 90005, 90006, 90007, 90008, 90009, ... (5000 adds)]} 0 155
   [junit4]   2> 1019268 INFO  (TEST-TestExportWriter.testExpr-seed#[D2C52DFA8429DBC1]) [     ] o.a.s.u.p.LogUpdateProcessorFactory [collection1]  webapp=null path=null params={wt=json&indent=true}{add=[95000, 95001, 95002, 95003, 95004, 95005, 95006, 95007, 95008, 95009, ... (5000 adds)]} 0 154
   [junit4]   2> 1019273 INFO  (searcherExecutor-10957-thread-1-processing-x:collection1) [    x:collection1 ] o.a.s.c.SolrCore [collection1]  Registered new searcher autowarm time: 0 ms
   [junit4]   2> 1019273 INFO  (TEST-TestExportWriter.testExpr-seed#[D2C52DFA8429DBC1]) [    x:collection1 ] o.a.s.u.p.LogUpdateProcessorFactory [collection1]  webapp=null path=null params={}{commit=} 0 4
   [junit4]   2> 1019275 INFO  (TEST-TestExportWriter.testExpr-seed#[D2C52DFA8429DBC1]) [     ] o.a.s.c.S.Request [collection1]  webapp=null path=null params={q=*:*&qt=/export&fl=id&expr=top(n%3D2,input(),sort%3D"id+desc")&sort=id+asc&wt=xml} hits=100000 status=0 QTime=1
   [junit4]   2> 1019434 INFO  (TEST-TestExportWriter.testExpr-seed#[D2C52DFA8429DBC1]) [     ] o.a.s.c.S.Request [collection1]  webapp=null path=null params={q=*:*&qt=/export&fl=id,sortabledv_udvas&expr=unique(input(),over%3D"sortabledv_udvas")&sort=sortabledv_udvas+asc&wt=xml} hits=100000 status=0 QTime=0
   [junit4]   2> 1019660 INFO  (TEST-TestExportWriter.testExpr-seed#[D2C52DFA8429DBC1]) [     ] o.a.s.c.S.Request [collection1]  webapp=null path=null params={q=*:*&qt=/export&fl=id,sortabledv_udvas,small_i_p&expr=rollup(input(),over%3D"sortabledv_udvas",+sum(small_i_p),avg(small_i_p),min(small_i_p),count(*))&sort=sortabledv_udvas+asc&wt=xml} hits=100000 status=0 QTime=1
   [junit4]   2> 1019886 INFO  (TEST-TestExportWriter.testExpr-seed#[D2C52DFA8429DBC1]) [     ] o.a.s.SolrTestCaseJ4 ###Ending testExpr
   [junit4]   2> NOTE: reproduce with: ant test  -Dtestcase=TestExportWriter -Dtests.method=testExpr -Dtests.seed=D2C52DFA8429DBC1 -Dtests.multiplier=3 -Dtests.slow=true -Dtests.locale=nn -Dtests.timezone=America/Moncton -Dtests.asserts=true -Dtests.file.encoding=US-ASCII
   [junit4] FAILURE 4.17s J3 | TestExportWriter.testExpr <<<
   [junit4]    > Throwable #1: java.lang.AssertionError: expected:<18000.0> but was:<20812.0>
   [junit4]    > 	at __randomizedtesting.SeedInfo.seed([D2C52DFA8429DBC1:645ADCBAA4A06694]:0)
   [junit4]    > 	at org.apache.solr.handler.export.TestExpor

[...truncated too long message...]

stance=1103948460
   [junit4]   2> 25914 INFO  (coreCloseExecutor-83-thread-1) [     ] o.a.s.c.SolrCore [collection1]  CLOSING SolrCore org.apache.solr.core.SolrCore@70a34265
   [junit4]   2> 25914 INFO  (coreCloseExecutor-83-thread-1) [     ] o.a.s.m.SolrMetricManager Closing metric reporters for registry=solr.core.collection1 tag=SolrCore@70a34265
   [junit4]   2> 25914 INFO  (coreCloseExecutor-83-thread-1) [     ] o.a.s.m.r.SolrJmxReporter Closing reporter [org.apache.solr.metrics.reporters.SolrJmxReporter@175b2249: rootName = null, domain = solr.core.collection1, service url = null, agent id = null] for registry solr.core.collection1/com.codahale.metrics.MetricRegistry@6ceb2182
   [junit4]   2> 25926 INFO  (coreCloseExecutor-83-thread-1) [     ] o.a.s.u.DirectUpdateHandler2 Committing on IndexWriter.close()  ... SKIPPED (unnecessary).
   [junit4]   2> 25930 INFO  (SUITE-TestExportWriter-seed#[D2C52DFA8429DBC1]-worker) [     ] o.a.s.m.SolrMetricManager Closing metric reporters for registry=solr.node tag=null
   [junit4]   2> 25930 INFO  (SUITE-TestExportWriter-seed#[D2C52DFA8429DBC1]-worker) [     ] o.a.s.m.r.SolrJmxReporter Closing reporter [org.apache.solr.metrics.reporters.SolrJmxReporter@2bc99382: rootName = null, domain = solr.node, service url = null, agent id = null] for registry solr.node/com.codahale.metrics.MetricRegistry@73372df4
   [junit4]   2> 25935 INFO  (SUITE-TestExportWriter-seed#[D2C52DFA8429DBC1]-worker) [     ] o.a.s.m.SolrMetricManager Closing metric reporters for registry=solr.jvm tag=null
   [junit4]   2> 25935 INFO  (SUITE-TestExportWriter-seed#[D2C52DFA8429DBC1]-worker) [     ] o.a.s.m.r.SolrJmxReporter Closing reporter [org.apache.solr.metrics.reporters.SolrJmxReporter@7d8c8129: rootName = null, domain = solr.jvm, service url = null, agent id = null] for registry solr.jvm/com.codahale.metrics.MetricRegistry@6a55a322
   [junit4]   2> 25935 INFO  (SUITE-TestExportWriter-seed#[D2C52DFA8429DBC1]-worker) [     ] o.a.s.m.SolrMetricManager Closing metric reporters for registry=solr.jetty tag=null
   [junit4]   2> 25935 INFO  (SUITE-TestExportWriter-seed#[D2C52DFA8429DBC1]-worker) [     ] o.a.s.m.r.SolrJmxReporter Closing reporter [org.apache.solr.metrics.reporters.SolrJmxReporter@3408fb0b: rootName = null, domain = solr.jetty, service url = null, agent id = null] for registry solr.jetty/com.codahale.metrics.MetricRegistry@45f48b0e
   [junit4]   2> NOTE: leaving temporary files on disk at: /home/jenkins/workspace/Lucene-Solr-8.x-Linux/solr/build/solr-core/test/J3/temp/solr.handler.export.TestExportWriter_D2C52DFA8429DBC1-001
   [junit4]   2> NOTE: test params are: codec=Asserting(Lucene86): {sortabledv_udvas=PostingsFormat(name=Direct), sortabledv_m=PostingsFormat(name=Direct), sortabledv=PostingsFormat(name=Direct), id=PostingsFormat(name=LuceneFixedGap), field1_s_dv=PostingsFormat(name=Direct), sortabledv_m_udvas=PostingsFormat(name=Direct)}, docValues:{number_i_p=DocValuesFormat(name=Lucene80), field1_i_p=DocValuesFormat(name=Lucene80), number_ls_ni_p=DocValuesFormat(name=Lucene80), number_ls_t=DocValuesFormat(name=Lucene80), number_ds_p=DocValuesFormat(name=Lucene80), number_ds_t=DocValuesFormat(name=Lucene80), booleandv=DocValuesFormat(name=Lucene80), number_i_t=DocValuesFormat(name=Lucene80), field2_i_p=DocValuesFormat(name=Lucene80), number_is_ni_p=DocValuesFormat(name=Lucene80), number_is_ni_t=DocValuesFormat(name=Lucene80), longdv=DocValuesFormat(name=Direct), number_ls_p=DocValuesFormat(name=Lucene80), id=DocValuesFormat(name=Lucene80), field1_s_dv=DocValuesFormat(name=Direct), number_dts_p=DocValuesFormat(name=Lucene80), stringdv=DocValuesFormat(name=Lucene80), longdv_m=DocValuesFormat(name=Lucene80), number_ls_ni_t=DocValuesFormat(name=Lucene80), number_is_t=DocValuesFormat(name=Asserting), number_dts_t=DocValuesFormat(name=Lucene80), doubledv_m=DocValuesFormat(name=Asserting), doubledv=DocValuesFormat(name=Lucene80), number_is_p=DocValuesFormat(name=Asserting), small_i_p=DocValuesFormat(name=Direct), field4_i_p=DocValuesFormat(name=Asserting), sortabledv_udvas=DocValuesFormat(name=Direct), number_dts_ni_t=DocValuesFormat(name=Lucene80), batch_i_p=DocValuesFormat(name=Asserting), field3_i_p=DocValuesFormat(name=Direct), intdv=DocValuesFormat(name=Asserting), floatdv=DocValuesFormat(name=Direct), number_fs_p=DocValuesFormat(name=Direct), field6_i_p=DocValuesFormat(name=Lucene80), number_f_t=DocValuesFormat(name=Asserting), number_l_p=DocValuesFormat(name=Lucene80), number_dt_p=DocValuesFormat(name=Lucene80), number_f_p=DocValuesFormat(name=Asserting), number_d_t=DocValuesFormat(name=Lucene80), int_is_t=DocValuesFormat(name=Lucene80), number_dt_t=DocValuesFormat(name=Lucene80), number_dts_ni_p=DocValuesFormat(name=Lucene80), datedv_m=DocValuesFormat(name=Lucene80), int_is_p=DocValuesFormat(name=Lucene80), number_fs_t=DocValuesFormat(name=Direct), sortabledv_m_udvas=DocValuesFormat(name=Direct), number_l_t=DocValuesFormat(name=Lucene80), number_ds_ni_t=DocValuesFormat(name=Direct), sortabledv_m=DocValuesFormat(name=Direct), stringdv_m=DocValuesFormat(name=Asserting), intdv_m=DocValuesFormat(name=Lucene80), number_ds_ni_p=DocValuesFormat(name=Direct), field5_i_p=DocValuesFormat(name=Lucene80), number_d_ni_p=DocValuesFormat(name=Asserting), number_fs_ni_p=DocValuesFormat(name=Direct), number_d_ni_t=DocValuesFormat(name=Asserting), number_fs_ni_t=DocValuesFormat(name=Direct), sortabledv=DocValuesFormat(name=Direct), field8_i_p=DocValuesFormat(name=Asserting), datedv=DocValuesFormat(name=Lucene80), floatdv_m=DocValuesFormat(name=Lucene80), number_f_ni_t=DocValuesFormat(name=Lucene80), number_l_ni_t=DocValuesFormat(name=Asserting), number_i_ni_p=DocValuesFormat(name=Direct), number_dt_ni_p=DocValuesFormat(name=Asserting), number_f_ni_p=DocValuesFormat(name=Lucene80), random_i_p=DocValuesFormat(name=Lucene80), number_i_ni_t=DocValuesFormat(name=Direct), number_dt_ni_t=DocValuesFormat(name=Asserting), field3_l_p=DocValuesFormat(name=Lucene80), number_d_p=DocValuesFormat(name=Lucene80), field7_i_p=DocValuesFormat(name=Direct), number_l_ni_p=DocValuesFormat(name=Asserting)}, maxPointsInLeafNode=1067, maxMBSortInHeap=6.828524549684629, sim=Asserting(RandomSimilarity(queryNorm=false): {}), locale=nn, timezone=America/Moncton
   [junit4]   2> NOTE: Linux 5.4.0-40-generic amd64/AdoptOpenJDK 12.0.2 (64-bit)/cpus=16,threads=1,free=107931680,total=203423744
   [junit4]   2> NOTE: All tests run in this JVM: [TestExportWriter]
   [junit4] Completed [5/5 (5!)] on J3 in 25.47s, 10 tests, 1 failure <<< FAILURES!

[...truncated 17 lines...]
BUILD FAILED
/home/jenkins/workspace/Lucene-Solr-8.x-Linux/lucene/common-build.xml:1599: The following error occurred while executing this line:
/home/jenkins/workspace/Lucene-Solr-8.x-Linux/lucene/common-build.xml:1126: There were test failures: 5 suites, 50 tests, 5 failures [seed: D2C52DFA8429DBC1]

Total time: 27 seconds

[repro] Setting last failure code to 256

[repro] Failures w/original seeds:
[repro]   5/5 failed: org.apache.solr.handler.export.TestExportWriter
[repro] Exiting with code 256
+ mv lucene/build lucene/build.repro
+ mv solr/build solr/build.repro
+ mv lucene/build.orig lucene/build
+ mv solr/build.orig solr/build
Setting ANT_1_8_2_HOME=/home/jenkins/tools/hudson.tasks.Ant_AntInstallation/ANT_1.8.2
Archiving artifacts
[Java] Sleeping for 5 seconds due to JENKINS-32191...
[Java] Parsing console log (workspace: '/home/jenkins/workspace/Lucene-Solr-8.x-Linux')
[Java] Successfully parsed console log
[Java] -> found 113 issues (skipped 104 duplicates)
[Java] Post processing issues on 'Master' with source code encoding 'UTF-8'
[Java] Creating SCM blamer to obtain author and commit information for affected files
[Java] Creating SCM miner to obtain statistics for affected repository files
[Java] Resolving file names for all issues in source directory '/home/jenkins/workspace/Lucene-Solr-8.x-Linux'
[Java] -> resolved paths in source directory (54 found, 0 not found)
[Java] Resolving module names from module definitions (build.xml, pom.xml, or Manifest.mf files)
[Java] -> resolved module names for 113 issues
[Java] Resolving package names (or namespaces) by parsing the affected files
[Java] -> resolved package names of 54 affected files
[Java] No filter has been set, publishing all 113 issues
[Java] Creating fingerprints for all affected code blocks to track issues over different builds
[Java] -> created fingerprints for 113 issues (skipped 0 issues)
[Java] Copying affected files to Jenkins' build folder '/home/jenkins/jobs/Lucene-Solr-8.x-Linux/builds/3953/files-with-issues'
[Java] -> 54 copied, 0 not in workspace, 0 not-found, 0 with I/O error
[Java] Using reference build 'Lucene-Solr-8.x-Linux #3952' to compute new, fixed, and outstanding issues
[Java] Issues delta (vs. reference build): outstanding: 113, new: 0, fixed: 0
[Java] No quality gates have been set - skipping
[Java] Health report is disabled - skipping
[Java] Created analysis result for 113 issues (found 0 new issues, fixed 0 issues)
[Java] Attaching ResultAction with ID 'java' to run 'Lucene-Solr-8.x-Linux #3953'.
Setting ANT_1_8_2_HOME=/home/jenkins/tools/hudson.tasks.Ant_AntInstallation/ANT_1.8.2
Recording test results
Setting ANT_1_8_2_HOME=/home/jenkins/tools/hudson.tasks.Ant_AntInstallation/ANT_1.8.2
Build step 'Publish JUnit test result report' changed build result to UNSTABLE
Email was triggered for: Unstable (Test Failures)
Sending email for trigger: Unstable (Test Failures)
Setting ANT_1_8_2_HOME=/home/jenkins/tools/hudson.tasks.Ant_AntInstallation/ANT_1.8.2
Setting ANT_1_8_2_HOME=/home/jenkins/tools/hudson.tasks.Ant_AntInstallation/ANT_1.8.2
Setting ANT_1_8_2_HOME=/home/jenkins/tools/hudson.tasks.Ant_AntInstallation/ANT_1.8.2
Setting ANT_1_8_2_HOME=/home/jenkins/tools/hudson.tasks.Ant_AntInstallation/ANT_1.8.2
Setting ANT_1_8_2_HOME=/home/jenkins/tools/hudson.tasks.Ant_AntInstallation/ANT_1.8.2
Setting ANT_1_8_2_HOME=/home/jenkins/tools/hudson.tasks.Ant_AntInstallation/ANT_1.8.2

Mime
View raw message