lucene-builds mailing list archives

Site index · List index
Message view « Date » · « Thread »
Top « Date » · « Thread »
From Apache Jenkins Server <jenk...@builds.apache.org>
Subject [JENKINS] Lucene-Solr-NightlyTests-8.3 - Build # 75 - Failure
Date Mon, 09 Dec 2019 14:29:31 GMT
Build: https://builds.apache.org/job/Lucene-Solr-NightlyTests-8.3/75/

1 tests failed.
FAILED:  org.apache.lucene.document.TestXYMultiPolygonShapeQueries.testRandomBig

Error Message:
Java heap space

Stack Trace:
java.lang.OutOfMemoryError: Java heap space
	at __randomizedtesting.SeedInfo.seed([7C2AB3E96A1F2BC4:FB7DCE66FB465744]:0)
	at org.apache.lucene.store.RAMFile.newBuffer(RAMFile.java:84)
	at org.apache.lucene.store.RAMFile.addBuffer(RAMFile.java:57)
	at org.apache.lucene.store.RAMOutputStream.switchCurrentBuffer(RAMOutputStream.java:168)
	at org.apache.lucene.store.RAMOutputStream.writeBytes(RAMOutputStream.java:154)
	at org.apache.lucene.store.MockIndexOutputWrapper.writeBytes(MockIndexOutputWrapper.java:141)
	at org.apache.lucene.util.bkd.OfflinePointWriter.append(OfflinePointWriter.java:67)
	at org.apache.lucene.util.bkd.BKDRadixSelector.offlinePartition(BKDRadixSelector.java:295)
	at org.apache.lucene.util.bkd.BKDRadixSelector.buildHistogramAndPartition(BKDRadixSelector.java:258)
	at org.apache.lucene.util.bkd.BKDRadixSelector.select(BKDRadixSelector.java:126)
	at org.apache.lucene.util.bkd.BKDWriter.build(BKDWriter.java:1594)
	at org.apache.lucene.util.bkd.BKDWriter.build(BKDWriter.java:1611)
	at org.apache.lucene.util.bkd.BKDWriter.finish(BKDWriter.java:785)
	at org.apache.lucene.index.RandomCodec$1$1.writeField(RandomCodec.java:140)
	at org.apache.lucene.codecs.PointsWriter.mergeOneField(PointsWriter.java:62)
	at org.apache.lucene.codecs.PointsWriter.merge(PointsWriter.java:191)
	at org.apache.lucene.codecs.lucene60.Lucene60PointsWriter.merge(Lucene60PointsWriter.java:143)
	at org.apache.lucene.codecs.asserting.AssertingPointsFormat$AssertingPointsWriter.merge(AssertingPointsFormat.java:149)
	at org.apache.lucene.index.SegmentMerger.mergePoints(SegmentMerger.java:202)
	at org.apache.lucene.index.SegmentMerger.merge(SegmentMerger.java:162)
	at org.apache.lucene.index.IndexWriter.mergeMiddle(IndexWriter.java:4463)
	at org.apache.lucene.index.IndexWriter.merge(IndexWriter.java:4057)
	at org.apache.lucene.index.SerialMergeScheduler.merge(SerialMergeScheduler.java:40)
	at org.apache.lucene.index.IndexWriter.maybeMerge(IndexWriter.java:2158)
	at org.apache.lucene.index.IndexWriter.forceMerge(IndexWriter.java:1991)
	at org.apache.lucene.index.IndexWriter.forceMerge(IndexWriter.java:1940)
	at org.apache.lucene.document.BaseShapeTestCase.indexRandomShapes(BaseShapeTestCase.java:242)
	at org.apache.lucene.document.BaseShapeTestCase.verify(BaseShapeTestCase.java:211)
	at org.apache.lucene.document.BaseShapeTestCase.doTestRandom(BaseShapeTestCase.java:137)
	at org.apache.lucene.document.TestXYMultiPolygonShapeQueries.testRandomBig(TestXYMultiPolygonShapeQueries.java:140)
	at sun.reflect.NativeMethodAccessorImpl.invoke0(Native Method)
	at sun.reflect.NativeMethodAccessorImpl.invoke(NativeMethodAccessorImpl.java:62)
	at sun.reflect.DelegatingMethodAccessorImpl.invoke(DelegatingMethodAccessorImpl.java:43)




Build Log:
[...truncated 11091 lines...]
   [junit4] Suite: org.apache.lucene.document.TestXYMultiPolygonShapeQueries
   [junit4]   2> NOTE: download the large Jenkins line-docs file by running 'ant get-jenkins-line-docs'
in the lucene directory.
   [junit4]   2> NOTE: reproduce with: ant test  -Dtestcase=TestXYMultiPolygonShapeQueries
-Dtests.method=testRandomBig -Dtests.seed=7C2AB3E96A1F2BC4 -Dtests.multiplier=2 -Dtests.nightly=true
-Dtests.slow=true -Dtests.linedocsfile=/home/jenkins/jenkins-slave/workspace/Lucene-Solr-NightlyTests-8.3/test-data/enwiki.random.lines.txt
-Dtests.locale=fr -Dtests.timezone=America/New_York -Dtests.asserts=true -Dtests.file.encoding=UTF-8
   [junit4] ERROR    170s J1 | TestXYMultiPolygonShapeQueries.testRandomBig <<<
   [junit4]    > Throwable #1: java.lang.OutOfMemoryError: Java heap space
   [junit4]    > 	at __randomizedtesting.SeedInfo.seed([7C2AB3E96A1F2BC4:FB7DCE66FB465744]:0)
   [junit4]    > 	at org.apache.lucene.store.RAMFile.newBuffer(RAMFile.java:84)
   [junit4]    > 	at org.apache.lucene.store.RAMFile.addBuffer(RAMFile.java:57)
   [junit4]    > 	at org.apache.lucene.store.RAMOutputStream.switchCurrentBuffer(RAMOutputStream.java:168)
   [junit4]    > 	at org.apache.lucene.store.RAMOutputStream.writeBytes(RAMOutputStream.java:154)
   [junit4]    > 	at org.apache.lucene.store.MockIndexOutputWrapper.writeBytes(MockIndexOutputWrapper.java:141)
   [junit4]    > 	at org.apache.lucene.util.bkd.OfflinePointWriter.append(OfflinePointWriter.java:67)
   [junit4]    > 	at org.apache.lucene.util.bkd.BKDRadixSelector.offlinePartition(BKDRadixSelector.java:295)
   [junit4]    > 	at org.apache.lucene.util.bkd.BKDRadixSelector.buildHistogramAndPartition(BKDRadixSelector.java:258)
   [junit4]    > 	at org.apache.lucene.util.bkd.BKDRadixSelector.select(BKDRadixSelector.java:126)
   [junit4]    > 	at org.apache.lucene.util.bkd.BKDWriter.build(BKDWriter.java:1594)
   [junit4]    > 	at org.apache.lucene.util.bkd.BKDWriter.build(BKDWriter.java:1611)
   [junit4]    > 	at org.apache.lucene.util.bkd.BKDWriter.finish(BKDWriter.java:785)
   [junit4]    > 	at org.apache.lucene.index.RandomCodec$1$1.writeField(RandomCodec.java:140)
   [junit4]    > 	at org.apache.lucene.codecs.PointsWriter.mergeOneField(PointsWriter.java:62)
   [junit4]    > 	at org.apache.lucene.codecs.PointsWriter.merge(PointsWriter.java:191)
   [junit4]    > 	at org.apache.lucene.codecs.lucene60.Lucene60PointsWriter.merge(Lucene60PointsWriter.java:143)
   [junit4]    > 	at org.apache.lucene.codecs.asserting.AssertingPointsFormat$AssertingPointsWriter.merge(AssertingPointsFormat.java:149)
   [junit4]    > 	at org.apache.lucene.index.SegmentMerger.mergePoints(SegmentMerger.java:202)
   [junit4]    > 	at org.apache.lucene.index.SegmentMerger.merge(SegmentMerger.java:162)
   [junit4]    > 	at org.apache.lucene.index.IndexWriter.mergeMiddle(IndexWriter.java:4463)
   [junit4]    > 	at org.apache.lucene.index.IndexWriter.merge(IndexWriter.java:4057)
   [junit4]    > 	at org.apache.lucene.index.SerialMergeScheduler.merge(SerialMergeScheduler.java:40)
   [junit4]    > 	at org.apache.lucene.index.IndexWriter.maybeMerge(IndexWriter.java:2158)
   [junit4]    > 	at org.apache.lucene.index.IndexWriter.forceMerge(IndexWriter.java:1991)
   [junit4]    > 	at org.apache.lucene.index.IndexWriter.forceMerge(IndexWriter.java:1940)
   [junit4]    > 	at org.apache.lucene.document.BaseShapeTestCase.indexRandomShapes(BaseShapeTestCase.java:242)
   [junit4]    > 	at org.apache.lucene.document.BaseShapeTestCase.verify(BaseShapeTestCase.java:211)
   [junit4]    > 	at org.apache.lucene.document.BaseShapeTestCase.doTestRandom(BaseShapeTestCase.java:137)
   [junit4]    > 	at org.apache.lucene.document.TestXYMultiPolygonShapeQueries.testRandomBig(TestXYMultiPolygonShapeQueries.java:140)
   [junit4]   2> NOTE: leaving temporary files on disk at: /home/jenkins/jenkins-slave/workspace/Lucene-Solr-NightlyTests-8.3/checkout/lucene/build/sandbox/test/J1/temp/lucene.document.TestXYMultiPolygonShapeQueries_7C2AB3E96A1F2BC4-001
   [junit4]   2> NOTE: test params are: codec=Asserting(Lucene80): {id=PostingsFormat(name=LuceneFixedGap)},
docValues:{shape=DocValuesFormat(name=Direct), id=DocValuesFormat(name=Asserting)}, maxPointsInLeafNode=506,
maxMBSortInHeap=5.601651554209145, sim=Asserting(org.apache.lucene.search.similarities.AssertingSimilarity@3c32ba13),
locale=fr, timezone=America/New_York
   [junit4]   2> NOTE: Linux 4.15.0-54-generic amd64/Oracle Corporation 1.8.0_191 (64-bit)/cpus=4,threads=1,free=239966464,total=359661568
   [junit4]   2> NOTE: All tests run in this JVM: [TestFieldCacheTermsFilter, TestLatLonBoundingBoxQueries,
TestBigIntegerPoint, TestPayloadSpanUtil, TestXYMultiPolygonShapeQueries]
   [junit4] Completed [35/38 (1!)] on J1 in 431.10s, 5 tests, 1 error <<< FAILURES!

[...truncated 12 lines...]
   [junit4] JVM J1: stdout was not empty, see: /home/jenkins/jenkins-slave/workspace/Lucene-Solr-NightlyTests-8.3/checkout/lucene/build/sandbox/test/temp/junit4-J1-20191209_120502_0171080199101040622932.sysout
   [junit4] >>> JVM J1 emitted unexpected output (verbatim) ----
   [junit4] java.lang.OutOfMemoryError: Java heap space
   [junit4] Dumping heap to /home/jenkins/jenkins-slave/workspace/Lucene-Solr-NightlyTests-8.3/checkout/heapdumps/java_pid23186.hprof
...
   [junit4] Heap dump file created [500755806 bytes in 0.538 secs]
   [junit4] <<< JVM J1: EOF ----

[...truncated 15065 lines...]
BUILD FAILED
/home/jenkins/jenkins-slave/workspace/Lucene-Solr-NightlyTests-8.3/checkout/build.xml:652:
The following error occurred while executing this line:
/home/jenkins/jenkins-slave/workspace/Lucene-Solr-NightlyTests-8.3/checkout/build.xml:586:
Some of the tests produced a heap dump, but did not fail. Maybe a suppressed OutOfMemoryError?
Dumps created:
* java_pid23186.hprof

Total time: 291 minutes 23 seconds
Build step 'Invoke Ant' marked build as failure
Archiving artifacts
Recording test results
Email was triggered for: Failure - Any
Sending email for trigger: Failure - Any

Mime
View raw message