lucene-builds mailing list archives

Site index · List index
Message view « Date » · « Thread »
Top « Date » · « Thread »
From Apache Jenkins Server <jenk...@builds.apache.org>
Subject [JENKINS] Lucene-Solr-BadApples-Tests-8.x - Build # 292 - Unstable
Date Tue, 03 Dec 2019 23:13:51 GMT
Build: https://builds.apache.org/job/Lucene-Solr-BadApples-Tests-8.x/292/

35 tests failed.
FAILED:  junit.framework.TestSuite.org.apache.solr.prometheus.scraper.SolrStandaloneScraperTest

Error Message:
Clean up static fields (in @AfterClass?) and null them, your test still has references to classes of which the sizes cannot be measured due to security restrictions or Java 9 module encapsulation:   - private static org.apache.solr.prometheus.scraper.SolrStandaloneScraper org.apache.solr.prometheus.scraper.SolrStandaloneScraperTest.solrScraper   - private static org.apache.solr.client.solrj.impl.HttpSolrClient org.apache.solr.prometheus.scraper.SolrStandaloneScraperTest.solrClient

Stack Trace:
junit.framework.AssertionFailedError: Clean up static fields (in @AfterClass?) and null them, your test still has references to classes of which the sizes cannot be measured due to security restrictions or Java 9 module encapsulation:
  - private static org.apache.solr.prometheus.scraper.SolrStandaloneScraper org.apache.solr.prometheus.scraper.SolrStandaloneScraperTest.solrScraper
  - private static org.apache.solr.client.solrj.impl.HttpSolrClient org.apache.solr.prometheus.scraper.SolrStandaloneScraperTest.solrClient
	at __randomizedtesting.SeedInfo.seed([D3E47C26F6944441]:0)
	at com.carrotsearch.randomizedtesting.rules.StaticFieldsInvariantRule$1.afterAlways(StaticFieldsInvariantRule.java:146)
	at com.carrotsearch.randomizedtesting.rules.StatementAdapter.evaluate(StatementAdapter.java:43)
	at com.carrotsearch.randomizedtesting.rules.StatementAdapter.evaluate(StatementAdapter.java:36)
	at com.carrotsearch.randomizedtesting.rules.StatementAdapter.evaluate(StatementAdapter.java:36)
	at org.apache.lucene.util.TestRuleAssertionsRequired$1.evaluate(TestRuleAssertionsRequired.java:53)
	at org.apache.lucene.util.TestRuleMarkFailure$1.evaluate(TestRuleMarkFailure.java:47)
	at org.apache.lucene.util.TestRuleIgnoreAfterMaxFailures$1.evaluate(TestRuleIgnoreAfterMaxFailures.java:64)
	at org.apache.lucene.util.TestRuleIgnoreTestSuites$1.evaluate(TestRuleIgnoreTestSuites.java:54)
	at com.carrotsearch.randomizedtesting.rules.StatementAdapter.evaluate(StatementAdapter.java:36)
	at com.carrotsearch.randomizedtesting.ThreadLeakControl$StatementRunner.run(ThreadLeakControl.java:368)
	at java.lang.Thread.run(Thread.java:748)
Caused by: java.security.AccessControlException: access denied ("java.lang.RuntimePermission" "accessClassInPackage.sun.net.www.protocol.jar")
	at java.security.AccessControlContext.checkPermission(AccessControlContext.java:472)
	at java.security.AccessController.checkPermission(AccessController.java:884)
	at java.lang.SecurityManager.checkPermission(SecurityManager.java:549)
	at java.lang.SecurityManager.checkPackageAccess(SecurityManager.java:1564)
	at java.lang.Class.checkPackageAccess(Class.java:2372)
	at java.lang.Class.checkMemberAccess(Class.java:2351)
	at java.lang.Class.getDeclaredFields(Class.java:1915)
	at com.carrotsearch.randomizedtesting.rules.RamUsageEstimator$2.run(RamUsageEstimator.java:585)
	at com.carrotsearch.randomizedtesting.rules.RamUsageEstimator$2.run(RamUsageEstimator.java:582)
	at java.security.AccessController.doPrivileged(Native Method)
	at com.carrotsearch.randomizedtesting.rules.RamUsageEstimator.createCacheEntry(RamUsageEstimator.java:582)
	at com.carrotsearch.randomizedtesting.rules.RamUsageEstimator.measureSizeOf(RamUsageEstimator.java:545)
	at com.carrotsearch.randomizedtesting.rules.RamUsageEstimator.sizeOfAll(RamUsageEstimator.java:387)
	at com.carrotsearch.randomizedtesting.rules.StaticFieldsInvariantRule$1.afterAlways(StaticFieldsInvariantRule.java:129)
	... 10 more


FAILED:  junit.framework.TestSuite.org.apache.solr.cloud.OverseerCollectionConfigSetProcessorTest

Error Message:
Clean up static fields (in @AfterClass?) and null them, your test still has references to classes of which the sizes cannot be measured due to security restrictions or Java 9 module encapsulation:   - private static org.apache.solr.client.solrj.cloud.DistribStateManager org.apache.solr.cloud.OverseerCollectionConfigSetProcessorTest.stateManagerMock

Stack Trace:
junit.framework.AssertionFailedError: Clean up static fields (in @AfterClass?) and null them, your test still has references to classes of which the sizes cannot be measured due to security restrictions or Java 9 module encapsulation:
  - private static org.apache.solr.client.solrj.cloud.DistribStateManager org.apache.solr.cloud.OverseerCollectionConfigSetProcessorTest.stateManagerMock
	at __randomizedtesting.SeedInfo.seed([72EC01799CA6D17]:0)
	at com.carrotsearch.randomizedtesting.rules.StaticFieldsInvariantRule$1.afterAlways(StaticFieldsInvariantRule.java:146)
	at com.carrotsearch.randomizedtesting.rules.StatementAdapter.evaluate(StatementAdapter.java:43)
	at com.carrotsearch.randomizedtesting.rules.StatementAdapter.evaluate(StatementAdapter.java:36)
	at com.carrotsearch.randomizedtesting.rules.StatementAdapter.evaluate(StatementAdapter.java:36)
	at org.apache.lucene.util.TestRuleAssertionsRequired$1.evaluate(TestRuleAssertionsRequired.java:53)
	at org.apache.lucene.util.TestRuleMarkFailure$1.evaluate(TestRuleMarkFailure.java:47)
	at org.apache.lucene.util.TestRuleIgnoreAfterMaxFailures$1.evaluate(TestRuleIgnoreAfterMaxFailures.java:64)
	at org.apache.lucene.util.TestRuleIgnoreTestSuites$1.evaluate(TestRuleIgnoreTestSuites.java:54)
	at com.carrotsearch.randomizedtesting.rules.StatementAdapter.evaluate(StatementAdapter.java:36)
	at com.carrotsearch.randomizedtesting.ThreadLeakControl$StatementRunner.run(ThreadLeakControl.java:368)
	at java.lang.Thread.run(Thread.java:748)
Caused by: java.security.AccessControlException: access denied ("java.lang.RuntimePermission" "accessClassInPackage.sun.reflect.generics.repository")
	at java.security.AccessControlContext.checkPermission(AccessControlContext.java:472)
	at java.security.AccessController.checkPermission(AccessController.java:884)
	at java.lang.SecurityManager.checkPermission(SecurityManager.java:549)
	at java.lang.SecurityManager.checkPackageAccess(SecurityManager.java:1564)
	at java.lang.Class.checkPackageAccess(Class.java:2372)
	at java.lang.Class.checkMemberAccess(Class.java:2351)
	at java.lang.Class.getDeclaredFields(Class.java:1915)
	at com.carrotsearch.randomizedtesting.rules.RamUsageEstimator$2.run(RamUsageEstimator.java:585)
	at com.carrotsearch.randomizedtesting.rules.RamUsageEstimator$2.run(RamUsageEstimator.java:582)
	at java.security.AccessController.doPrivileged(Native Method)
	at com.carrotsearch.randomizedtesting.rules.RamUsageEstimator.createCacheEntry(RamUsageEstimator.java:582)
	at com.carrotsearch.randomizedtesting.rules.RamUsageEstimator.measureSizeOf(RamUsageEstimator.java:545)
	at com.carrotsearch.randomizedtesting.rules.RamUsageEstimator.sizeOfAll(RamUsageEstimator.java:387)
	at com.carrotsearch.randomizedtesting.rules.StaticFieldsInvariantRule$1.afterAlways(StaticFieldsInvariantRule.java:129)
	... 10 more


FAILED:  junit.framework.TestSuite.org.apache.solr.cloud.OverseerTest

Error Message:
Clean up static fields (in @AfterClass?) and null them, your test still has references to classes of which the sizes cannot be measured due to security restrictions or Java 9 module encapsulation:   - private static org.apache.solr.cloud.ZkTestServer org.apache.solr.cloud.OverseerTest.server

Stack Trace:
junit.framework.AssertionFailedError: Clean up static fields (in @AfterClass?) and null them, your test still has references to classes of which the sizes cannot be measured due to security restrictions or Java 9 module encapsulation:
  - private static org.apache.solr.cloud.ZkTestServer org.apache.solr.cloud.OverseerTest.server
	at __randomizedtesting.SeedInfo.seed([72EC01799CA6D17]:0)
	at com.carrotsearch.randomizedtesting.rules.StaticFieldsInvariantRule$1.afterAlways(StaticFieldsInvariantRule.java:146)
	at com.carrotsearch.randomizedtesting.rules.StatementAdapter.evaluate(StatementAdapter.java:43)
	at com.carrotsearch.randomizedtesting.rules.StatementAdapter.evaluate(StatementAdapter.java:36)
	at com.carrotsearch.randomizedtesting.rules.StatementAdapter.evaluate(StatementAdapter.java:36)
	at org.apache.lucene.util.TestRuleAssertionsRequired$1.evaluate(TestRuleAssertionsRequired.java:53)
	at org.apache.lucene.util.TestRuleMarkFailure$1.evaluate(TestRuleMarkFailure.java:47)
	at org.apache.lucene.util.TestRuleIgnoreAfterMaxFailures$1.evaluate(TestRuleIgnoreAfterMaxFailures.java:64)
	at org.apache.lucene.util.TestRuleIgnoreTestSuites$1.evaluate(TestRuleIgnoreTestSuites.java:54)
	at com.carrotsearch.randomizedtesting.rules.StatementAdapter.evaluate(StatementAdapter.java:36)
	at com.carrotsearch.randomizedtesting.ThreadLeakControl$StatementRunner.run(ThreadLeakControl.java:368)
	at java.lang.Thread.run(Thread.java:748)
Caused by: java.security.AccessControlException: access denied ("java.lang.RuntimePermission" "accessClassInPackage.sun.nio.fs")
	at java.security.AccessControlContext.checkPermission(AccessControlContext.java:472)
	at java.security.AccessController.checkPermission(AccessController.java:884)
	at java.lang.SecurityManager.checkPermission(SecurityManager.java:549)
	at java.lang.SecurityManager.checkPackageAccess(SecurityManager.java:1564)
	at java.lang.Class.checkPackageAccess(Class.java:2372)
	at java.lang.Class.checkMemberAccess(Class.java:2351)
	at java.lang.Class.getDeclaredFields(Class.java:1915)
	at com.carrotsearch.randomizedtesting.rules.RamUsageEstimator$2.run(RamUsageEstimator.java:585)
	at com.carrotsearch.randomizedtesting.rules.RamUsageEstimator$2.run(RamUsageEstimator.java:582)
	at java.security.AccessController.doPrivileged(Native Method)
	at com.carrotsearch.randomizedtesting.rules.RamUsageEstimator.createCacheEntry(RamUsageEstimator.java:582)
	at com.carrotsearch.randomizedtesting.rules.RamUsageEstimator.measureSizeOf(RamUsageEstimator.java:545)
	at com.carrotsearch.randomizedtesting.rules.RamUsageEstimator.sizeOfAll(RamUsageEstimator.java:387)
	at com.carrotsearch.randomizedtesting.rules.StaticFieldsInvariantRule$1.afterAlways(StaticFieldsInvariantRule.java:129)
	... 10 more


FAILED:  junit.framework.TestSuite.org.apache.solr.cloud.TestWithCollection

Error Message:
Clean up static fields (in @AfterClass?) and null them, your test still has references to classes of which the sizes cannot be measured due to security restrictions or Java 9 module encapsulation:   - private static org.apache.solr.client.solrj.cloud.SolrCloudManager org.apache.solr.cloud.TestWithCollection.cloudManager

Stack Trace:
junit.framework.AssertionFailedError: Clean up static fields (in @AfterClass?) and null them, your test still has references to classes of which the sizes cannot be measured due to security restrictions or Java 9 module encapsulation:
  - private static org.apache.solr.client.solrj.cloud.SolrCloudManager org.apache.solr.cloud.TestWithCollection.cloudManager
	at __randomizedtesting.SeedInfo.seed([72EC01799CA6D17]:0)
	at com.carrotsearch.randomizedtesting.rules.StaticFieldsInvariantRule$1.afterAlways(StaticFieldsInvariantRule.java:146)
	at com.carrotsearch.randomizedtesting.rules.StatementAdapter.evaluate(StatementAdapter.java:43)
	at com.carrotsearch.randomizedtesting.rules.StatementAdapter.evaluate(StatementAdapter.java:36)
	at com.carrotsearch.randomizedtesting.rules.StatementAdapter.evaluate(StatementAdapter.java:36)
	at org.apache.lucene.util.TestRuleAssertionsRequired$1.evaluate(TestRuleAssertionsRequired.java:53)
	at org.apache.lucene.util.TestRuleMarkFailure$1.evaluate(TestRuleMarkFailure.java:47)
	at org.apache.lucene.util.TestRuleIgnoreAfterMaxFailures$1.evaluate(TestRuleIgnoreAfterMaxFailures.java:64)
	at org.apache.lucene.util.TestRuleIgnoreTestSuites$1.evaluate(TestRuleIgnoreTestSuites.java:54)
	at com.carrotsearch.randomizedtesting.rules.StatementAdapter.evaluate(StatementAdapter.java:36)
	at com.carrotsearch.randomizedtesting.ThreadLeakControl$StatementRunner.run(ThreadLeakControl.java:368)
	at java.lang.Thread.run(Thread.java:748)
Caused by: java.security.AccessControlException: access denied ("java.lang.RuntimePermission" "accessClassInPackage.sun.nio.fs")
	at java.security.AccessControlContext.checkPermission(AccessControlContext.java:472)
	at java.security.AccessController.checkPermission(AccessController.java:884)
	at java.lang.SecurityManager.checkPermission(SecurityManager.java:549)
	at java.lang.SecurityManager.checkPackageAccess(SecurityManager.java:1564)
	at java.lang.Class.checkPackageAccess(Class.java:2372)
	at java.lang.Class.checkMemberAccess(Class.java:2351)
	at java.lang.Class.getDeclaredFields(Class.java:1915)
	at com.carrotsearch.randomizedtesting.rules.RamUsageEstimator$2.run(RamUsageEstimator.java:585)
	at com.carrotsearch.randomizedtesting.rules.RamUsageEstimator$2.run(RamUsageEstimator.java:582)
	at java.security.AccessController.doPrivileged(Native Method)
	at com.carrotsearch.randomizedtesting.rules.RamUsageEstimator.createCacheEntry(RamUsageEstimator.java:582)
	at com.carrotsearch.randomizedtesting.rules.RamUsageEstimator.measureSizeOf(RamUsageEstimator.java:545)
	at com.carrotsearch.randomizedtesting.rules.RamUsageEstimator.sizeOfAll(RamUsageEstimator.java:387)
	at com.carrotsearch.randomizedtesting.rules.StaticFieldsInvariantRule$1.afterAlways(StaticFieldsInvariantRule.java:129)
	... 10 more


FAILED:  org.apache.solr.cloud.api.collections.ShardSplitTest.testSplitShardWithRuleLink

Error Message:
Error from server at http://127.0.0.1:33869: Underlying core creation failed while creating collection: shardSplitWithRule_link

Stack Trace:
org.apache.solr.client.solrj.impl.HttpSolrClient$RemoteSolrException: Error from server at http://127.0.0.1:33869: Underlying core creation failed while creating collection: shardSplitWithRule_link
	at __randomizedtesting.SeedInfo.seed([72EC01799CA6D17:D32758C13560BB2]:0)
	at org.apache.solr.client.solrj.impl.HttpSolrClient.executeMethod(HttpSolrClient.java:665)
	at org.apache.solr.client.solrj.impl.HttpSolrClient.request(HttpSolrClient.java:265)
	at org.apache.solr.client.solrj.impl.HttpSolrClient.request(HttpSolrClient.java:248)
	at org.apache.solr.client.solrj.impl.LBSolrClient.doRequest(LBSolrClient.java:368)
	at org.apache.solr.client.solrj.impl.LBSolrClient.request(LBSolrClient.java:296)
	at org.apache.solr.client.solrj.impl.BaseCloudSolrClient.sendRequest(BaseCloudSolrClient.java:1127)
	at org.apache.solr.client.solrj.impl.BaseCloudSolrClient.requestWithRetryOnStaleState(BaseCloudSolrClient.java:896)
	at org.apache.solr.client.solrj.impl.BaseCloudSolrClient.request(BaseCloudSolrClient.java:828)
	at org.apache.solr.client.solrj.SolrRequest.process(SolrRequest.java:211)
	at org.apache.solr.client.solrj.SolrRequest.process(SolrRequest.java:228)
	at org.apache.solr.cloud.api.collections.ShardSplitTest.doSplitShardWithRule(ShardSplitTest.java:650)
	at org.apache.solr.cloud.api.collections.ShardSplitTest.testSplitShardWithRuleLink(ShardSplitTest.java:633)
	at sun.reflect.NativeMethodAccessorImpl.invoke0(Native Method)
	at sun.reflect.NativeMethodAccessorImpl.invoke(NativeMethodAccessorImpl.java:62)
	at sun.reflect.DelegatingMethodAccessorImpl.invoke(DelegatingMethodAccessorImpl.java:43)
	at java.lang.reflect.Method.invoke(Method.java:498)
	at com.carrotsearch.randomizedtesting.RandomizedRunner.invoke(RandomizedRunner.java:1750)
	at com.carrotsearch.randomizedtesting.RandomizedRunner$8.evaluate(RandomizedRunner.java:938)
	at com.carrotsearch.randomizedtesting.RandomizedRunner$9.evaluate(RandomizedRunner.java:974)
	at com.carrotsearch.randomizedtesting.RandomizedRunner$10.evaluate(RandomizedRunner.java:988)
	at org.apache.solr.BaseDistributedSearchTestCase$ShardsRepeatRule$ShardsFixedStatement.callStatement(BaseDistributedSearchTestCase.java:1082)
	at org.apache.solr.BaseDistributedSearchTestCase$ShardsRepeatRule$ShardsStatement.evaluate(BaseDistributedSearchTestCase.java:1054)
	at com.carrotsearch.randomizedtesting.rules.SystemPropertiesRestoreRule$1.evaluate(SystemPropertiesRestoreRule.java:57)
	at org.apache.lucene.util.TestRuleSetupTeardownChained$1.evaluate(TestRuleSetupTeardownChained.java:49)
	at org.apache.lucene.util.AbstractBeforeAfterRule$1.evaluate(AbstractBeforeAfterRule.java:45)
	at org.apache.lucene.util.TestRuleThreadAndTestName$1.evaluate(TestRuleThreadAndTestName.java:48)
	at org.apache.lucene.util.TestRuleIgnoreAfterMaxFailures$1.evaluate(TestRuleIgnoreAfterMaxFailures.java:64)
	at org.apache.lucene.util.TestRuleMarkFailure$1.evaluate(TestRuleMarkFailure.java:47)
	at com.carrotsearch.randomizedtesting.rules.StatementAdapter.evaluate(StatementAdapter.java:36)
	at com.carrotsearch.randomizedtesting.ThreadLeakControl$StatementRunner.run(ThreadLeakControl.java:368)
	at com.carrotsearch.randomizedtesting.ThreadLeakControl.forkTimeoutingTask(ThreadLeakControl.java:817)
	at com.carrotsearch.randomizedtesting.ThreadLeakControl$3.evaluate(ThreadLeakControl.java:468)
	at com.carrotsearch.randomizedtesting.RandomizedRunner.runSingleTest(RandomizedRunner.java:947)
	at com.carrotsearch.randomizedtesting.RandomizedRunner$5.evaluate(RandomizedRunner.java:832)
	at com.carrotsearch.randomizedtesting.RandomizedRunner$6.evaluate(RandomizedRunner.java:883)
	at com.carrotsearch.randomizedtesting.RandomizedRunner$7.evaluate(RandomizedRunner.java:894)
	at com.carrotsearch.randomizedtesting.rules.StatementAdapter.evaluate(StatementAdapter.java:36)
	at com.carrotsearch.randomizedtesting.rules.SystemPropertiesRestoreRule$1.evaluate(SystemPropertiesRestoreRule.java:57)
	at org.apache.lucene.util.AbstractBeforeAfterRule$1.evaluate(AbstractBeforeAfterRule.java:45)
	at com.carrotsearch.randomizedtesting.rules.StatementAdapter.evaluate(StatementAdapter.java:36)
	at org.apache.lucene.util.TestRuleStoreClassName$1.evaluate(TestRuleStoreClassName.java:41)
	at com.carrotsearch.randomizedtesting.rules.NoShadowingOrOverridesOnMethodsRule$1.evaluate(NoShadowingOrOverridesOnMethodsRule.java:40)
	at com.carrotsearch.randomizedtesting.rules.NoShadowingOrOverridesOnMethodsRule$1.evaluate(NoShadowingOrOverridesOnMethodsRule.java:40)
	at com.carrotsearch.randomizedtesting.rules.StatementAdapter.evaluate(StatementAdapter.java:36)
	at com.carrotsearch.randomizedtesting.rules.StatementAdapter.evaluate(StatementAdapter.java:36)
	at com.carrotsearch.randomizedtesting.rules.StatementAdapter.evaluate(StatementAdapter.java:36)
	at org.apache.lucene.util.TestRuleAssertionsRequired$1.evaluate(TestRuleAssertionsRequired.java:53)
	at org.apache.lucene.util.TestRuleMarkFailure$1.evaluate(TestRuleMarkFailure.java:47)
	at org.apache.lucene.util.TestRuleIgnoreAfterMaxFailures$1.evaluate(TestRuleIgnoreAfterMaxFailures.java:64)
	at org.apache.lucene.util.TestRuleIgnoreTestSuites$1.evaluate(TestRuleIgnoreTestSuites.java:54)
	at com.carrotsearch.randomizedtesting.rules.StatementAdapter.evaluate(StatementAdapter.java:36)
	at com.carrotsearch.randomizedtesting.ThreadLeakControl$StatementRunner.run(ThreadLeakControl.java:368)
	at java.lang.Thread.run(Thread.java:748)


FAILED:  junit.framework.TestSuite.org.apache.solr.cloud.api.collections.TestHdfsCloudBackupRestore

Error Message:
failure to login: javax.security.auth.login.LoginException: Security Exception

Stack Trace:
org.apache.hadoop.security.KerberosAuthException: failure to login: javax.security.auth.login.LoginException: Security Exception
	at __randomizedtesting.SeedInfo.seed([72EC01799CA6D17]:0)
	at org.apache.hadoop.security.UserGroupInformation.doSubjectLogin(UserGroupInformation.java:1847)
	at org.apache.hadoop.security.UserGroupInformation.createLoginUser(UserGroupInformation.java:710)
	at org.apache.hadoop.security.UserGroupInformation.getLoginUser(UserGroupInformation.java:660)
	at org.apache.hadoop.security.UserGroupInformation.getCurrentUser(UserGroupInformation.java:571)
	at org.apache.hadoop.hdfs.server.namenode.FSNamesystem.<init>(FSNamesystem.java:767)
	at org.apache.hadoop.hdfs.server.namenode.FSNamesystem.<init>(FSNamesystem.java:733)
	at org.apache.hadoop.hdfs.server.namenode.NameNode.format(NameNode.java:1140)
	at org.apache.hadoop.hdfs.server.namenode.NameNode.format(NameNode.java:409)
	at org.apache.hadoop.hdfs.DFSTestUtil.formatNameNode(DFSTestUtil.java:261)
	at org.apache.hadoop.hdfs.MiniDFSCluster.configureNameService(MiniDFSCluster.java:1072)
	at org.apache.hadoop.hdfs.MiniDFSCluster.createNameNodesAndSetConf(MiniDFSCluster.java:958)
	at org.apache.hadoop.hdfs.MiniDFSCluster.initMiniDFSCluster(MiniDFSCluster.java:890)
	at org.apache.hadoop.hdfs.MiniDFSCluster.<init>(MiniDFSCluster.java:518)
	at org.apache.hadoop.hdfs.MiniDFSCluster$Builder.build(MiniDFSCluster.java:477)
	at org.apache.solr.cloud.hdfs.HdfsTestUtil.setupClass(HdfsTestUtil.java:134)
	at org.apache.solr.cloud.hdfs.HdfsTestUtil.setupClass(HdfsTestUtil.java:66)
	at org.apache.solr.cloud.api.collections.TestHdfsCloudBackupRestore.setupClass(TestHdfsCloudBackupRestore.java:110)
	at sun.reflect.NativeMethodAccessorImpl.invoke0(Native Method)
	at sun.reflect.NativeMethodAccessorImpl.invoke(NativeMethodAccessorImpl.java:62)
	at sun.reflect.DelegatingMethodAccessorImpl.invoke(DelegatingMethodAccessorImpl.java:43)
	at java.lang.reflect.Method.invoke(Method.java:498)
	at com.carrotsearch.randomizedtesting.RandomizedRunner.invoke(RandomizedRunner.java:1750)
	at com.carrotsearch.randomizedtesting.RandomizedRunner$6.evaluate(RandomizedRunner.java:878)
	at com.carrotsearch.randomizedtesting.RandomizedRunner$7.evaluate(RandomizedRunner.java:894)
	at com.carrotsearch.randomizedtesting.rules.StatementAdapter.evaluate(StatementAdapter.java:36)
	at com.carrotsearch.randomizedtesting.rules.SystemPropertiesRestoreRule$1.evaluate(SystemPropertiesRestoreRule.java:57)
	at org.apache.lucene.util.AbstractBeforeAfterRule$1.evaluate(AbstractBeforeAfterRule.java:45)
	at com.carrotsearch.randomizedtesting.rules.StatementAdapter.evaluate(StatementAdapter.java:36)
	at org.apache.lucene.util.TestRuleStoreClassName$1.evaluate(TestRuleStoreClassName.java:41)
	at com.carrotsearch.randomizedtesting.rules.NoShadowingOrOverridesOnMethodsRule$1.evaluate(NoShadowingOrOverridesOnMethodsRule.java:40)
	at com.carrotsearch.randomizedtesting.rules.NoShadowingOrOverridesOnMethodsRule$1.evaluate(NoShadowingOrOverridesOnMethodsRule.java:40)
	at com.carrotsearch.randomizedtesting.rules.StatementAdapter.evaluate(StatementAdapter.java:36)
	at com.carrotsearch.randomizedtesting.rules.StatementAdapter.evaluate(StatementAdapter.java:36)
	at com.carrotsearch.randomizedtesting.rules.StatementAdapter.evaluate(StatementAdapter.java:36)
	at org.apache.lucene.util.TestRuleAssertionsRequired$1.evaluate(TestRuleAssertionsRequired.java:53)
	at org.apache.lucene.util.TestRuleMarkFailure$1.evaluate(TestRuleMarkFailure.java:47)
	at org.apache.lucene.util.TestRuleIgnoreAfterMaxFailures$1.evaluate(TestRuleIgnoreAfterMaxFailures.java:64)
	at org.apache.lucene.util.TestRuleIgnoreTestSuites$1.evaluate(TestRuleIgnoreTestSuites.java:54)
	at com.carrotsearch.randomizedtesting.rules.StatementAdapter.evaluate(StatementAdapter.java:36)
	at com.carrotsearch.randomizedtesting.ThreadLeakControl$StatementRunner.run(ThreadLeakControl.java:368)
	at java.lang.Thread.run(Thread.java:748)
Caused by: javax.security.auth.login.LoginException: Security Exception
	at javax.security.auth.login.LoginContext.invoke(LoginContext.java:840)
	at javax.security.auth.login.LoginContext.access$000(LoginContext.java:195)
	at javax.security.auth.login.LoginContext$4.run(LoginContext.java:682)
	at javax.security.auth.login.LoginContext$4.run(LoginContext.java:680)
	at java.security.AccessController.doPrivileged(Native Method)
	at javax.security.auth.login.LoginContext.invokePriv(LoginContext.java:680)
	at javax.security.auth.login.LoginContext.login(LoginContext.java:587)
	at org.apache.hadoop.security.UserGroupInformation$HadoopLoginContext.login(UserGroupInformation.java:1926)
	at org.apache.hadoop.security.UserGroupInformation.doSubjectLogin(UserGroupInformation.java:1837)
	... 40 more
Caused by: java.lang.SecurityException
	at javax.security.auth.login.LoginContext.invoke(LoginContext.java:841)
	... 48 more


FAILED:  junit.framework.TestSuite.org.apache.solr.cloud.autoscaling.ComputePlanActionTest

Error Message:
Clean up static fields (in @AfterClass?) and null them, your test still has references to classes of which the sizes cannot be measured due to security restrictions or Java 9 module encapsulation:   - private static org.apache.solr.client.solrj.cloud.SolrCloudManager org.apache.solr.cloud.autoscaling.ComputePlanActionTest.cloudManager

Stack Trace:
junit.framework.AssertionFailedError: Clean up static fields (in @AfterClass?) and null them, your test still has references to classes of which the sizes cannot be measured due to security restrictions or Java 9 module encapsulation:
  - private static org.apache.solr.client.solrj.cloud.SolrCloudManager org.apache.solr.cloud.autoscaling.ComputePlanActionTest.cloudManager
	at __randomizedtesting.SeedInfo.seed([72EC01799CA6D17]:0)
	at com.carrotsearch.randomizedtesting.rules.StaticFieldsInvariantRule$1.afterAlways(StaticFieldsInvariantRule.java:146)
	at com.carrotsearch.randomizedtesting.rules.StatementAdapter.evaluate(StatementAdapter.java:43)
	at com.carrotsearch.randomizedtesting.rules.StatementAdapter.evaluate(StatementAdapter.java:36)
	at com.carrotsearch.randomizedtesting.rules.StatementAdapter.evaluate(StatementAdapter.java:36)
	at org.apache.lucene.util.TestRuleAssertionsRequired$1.evaluate(TestRuleAssertionsRequired.java:53)
	at org.apache.lucene.util.TestRuleMarkFailure$1.evaluate(TestRuleMarkFailure.java:47)
	at org.apache.lucene.util.TestRuleIgnoreAfterMaxFailures$1.evaluate(TestRuleIgnoreAfterMaxFailures.java:64)
	at org.apache.lucene.util.TestRuleIgnoreTestSuites$1.evaluate(TestRuleIgnoreTestSuites.java:54)
	at com.carrotsearch.randomizedtesting.rules.StatementAdapter.evaluate(StatementAdapter.java:36)
	at com.carrotsearch.randomizedtesting.ThreadLeakControl$StatementRunner.run(ThreadLeakControl.java:368)
	at java.lang.Thread.run(Thread.java:748)
Caused by: java.security.AccessControlException: access denied ("java.lang.RuntimePermission" "accessClassInPackage.sun.nio.fs")
	at java.security.AccessControlContext.checkPermission(AccessControlContext.java:472)
	at java.security.AccessController.checkPermission(AccessController.java:884)
	at java.lang.SecurityManager.checkPermission(SecurityManager.java:549)
	at java.lang.SecurityManager.checkPackageAccess(SecurityManager.java:1564)
	at java.lang.Class.checkPackageAccess(Class.java:2372)
	at java.lang.Class.checkMemberAccess(Class.java:2351)
	at java.lang.Class.getDeclaredFields(Class.java:1915)
	at com.carrotsearch.randomizedtesting.rules.RamUsageEstimator$2.run(RamUsageEstimator.java:585)
	at com.carrotsearch.randomizedtesting.rules.RamUsageEstimator$2.run(RamUsageEstimator.java:582)
	at java.security.AccessController.doPrivileged(Native Method)
	at com.carrotsearch.randomizedtesting.rules.RamUsageEstimator.createCacheEntry(RamUsageEstimator.java:582)
	at com.carrotsearch.randomizedtesting.rules.RamUsageEstimator.measureSizeOf(RamUsageEstimator.java:545)
	at com.carrotsearch.randomizedtesting.rules.RamUsageEstimator.sizeOfAll(RamUsageEstimator.java:387)
	at com.carrotsearch.randomizedtesting.rules.StaticFieldsInvariantRule$1.afterAlways(StaticFieldsInvariantRule.java:129)
	... 10 more


FAILED:  junit.framework.TestSuite.org.apache.solr.cloud.autoscaling.IndexSizeTriggerTest

Error Message:
Clean up static fields (in @AfterClass?) and null them, your test still has references to classes of which the sizes cannot be measured due to security restrictions or Java 9 module encapsulation:   - private static org.apache.solr.core.SolrResourceLoader org.apache.solr.cloud.autoscaling.IndexSizeTriggerTest.loader

Stack Trace:
junit.framework.AssertionFailedError: Clean up static fields (in @AfterClass?) and null them, your test still has references to classes of which the sizes cannot be measured due to security restrictions or Java 9 module encapsulation:
  - private static org.apache.solr.core.SolrResourceLoader org.apache.solr.cloud.autoscaling.IndexSizeTriggerTest.loader
	at __randomizedtesting.SeedInfo.seed([72EC01799CA6D17]:0)
	at com.carrotsearch.randomizedtesting.rules.StaticFieldsInvariantRule$1.afterAlways(StaticFieldsInvariantRule.java:146)
	at com.carrotsearch.randomizedtesting.rules.StatementAdapter.evaluate(StatementAdapter.java:43)
	at com.carrotsearch.randomizedtesting.rules.StatementAdapter.evaluate(StatementAdapter.java:36)
	at com.carrotsearch.randomizedtesting.rules.StatementAdapter.evaluate(StatementAdapter.java:36)
	at org.apache.lucene.util.TestRuleAssertionsRequired$1.evaluate(TestRuleAssertionsRequired.java:53)
	at org.apache.lucene.util.TestRuleMarkFailure$1.evaluate(TestRuleMarkFailure.java:47)
	at org.apache.lucene.util.TestRuleIgnoreAfterMaxFailures$1.evaluate(TestRuleIgnoreAfterMaxFailures.java:64)
	at org.apache.lucene.util.TestRuleIgnoreTestSuites$1.evaluate(TestRuleIgnoreTestSuites.java:54)
	at com.carrotsearch.randomizedtesting.rules.StatementAdapter.evaluate(StatementAdapter.java:36)
	at com.carrotsearch.randomizedtesting.ThreadLeakControl$StatementRunner.run(ThreadLeakControl.java:368)
	at java.lang.Thread.run(Thread.java:748)
Caused by: java.security.AccessControlException: access denied ("java.lang.RuntimePermission" "accessClassInPackage.sun.nio.fs")
	at java.security.AccessControlContext.checkPermission(AccessControlContext.java:472)
	at java.security.AccessController.checkPermission(AccessController.java:884)
	at java.lang.SecurityManager.checkPermission(SecurityManager.java:549)
	at java.lang.SecurityManager.checkPackageAccess(SecurityManager.java:1564)
	at java.lang.Class.checkPackageAccess(Class.java:2372)
	at java.lang.Class.checkMemberAccess(Class.java:2351)
	at java.lang.Class.getDeclaredFields(Class.java:1915)
	at com.carrotsearch.randomizedtesting.rules.RamUsageEstimator$2.run(RamUsageEstimator.java:585)
	at com.carrotsearch.randomizedtesting.rules.RamUsageEstimator$2.run(RamUsageEstimator.java:582)
	at java.security.AccessController.doPrivileged(Native Method)
	at com.carrotsearch.randomizedtesting.rules.RamUsageEstimator.createCacheEntry(RamUsageEstimator.java:582)
	at com.carrotsearch.randomizedtesting.rules.RamUsageEstimator.measureSizeOf(RamUsageEstimator.java:545)
	at com.carrotsearch.randomizedtesting.rules.RamUsageEstimator.sizeOfAll(RamUsageEstimator.java:387)
	at com.carrotsearch.randomizedtesting.rules.StaticFieldsInvariantRule$1.afterAlways(StaticFieldsInvariantRule.java:129)
	... 10 more


FAILED:  junit.framework.TestSuite.org.apache.solr.cloud.autoscaling.NodeAddedTriggerIntegrationTest

Error Message:
Clean up static fields (in @AfterClass?) and null them, your test still has references to classes of which the sizes cannot be measured due to security restrictions or Java 9 module encapsulation:   - private static volatile org.apache.solr.client.solrj.cloud.SolrCloudManager org.apache.solr.cloud.autoscaling.NodeAddedTriggerIntegrationTest.cloudManager

Stack Trace:
junit.framework.AssertionFailedError: Clean up static fields (in @AfterClass?) and null them, your test still has references to classes of which the sizes cannot be measured due to security restrictions or Java 9 module encapsulation:
  - private static volatile org.apache.solr.client.solrj.cloud.SolrCloudManager org.apache.solr.cloud.autoscaling.NodeAddedTriggerIntegrationTest.cloudManager
	at __randomizedtesting.SeedInfo.seed([72EC01799CA6D17]:0)
	at com.carrotsearch.randomizedtesting.rules.StaticFieldsInvariantRule$1.afterAlways(StaticFieldsInvariantRule.java:146)
	at com.carrotsearch.randomizedtesting.rules.StatementAdapter.evaluate(StatementAdapter.java:43)
	at com.carrotsearch.randomizedtesting.rules.StatementAdapter.evaluate(StatementAdapter.java:36)
	at com.carrotsearch.randomizedtesting.rules.StatementAdapter.evaluate(StatementAdapter.java:36)
	at org.apache.lucene.util.TestRuleAssertionsRequired$1.evaluate(TestRuleAssertionsRequired.java:53)
	at org.apache.lucene.util.TestRuleMarkFailure$1.evaluate(TestRuleMarkFailure.java:47)
	at org.apache.lucene.util.TestRuleIgnoreAfterMaxFailures$1.evaluate(TestRuleIgnoreAfterMaxFailures.java:64)
	at org.apache.lucene.util.TestRuleIgnoreTestSuites$1.evaluate(TestRuleIgnoreTestSuites.java:54)
	at com.carrotsearch.randomizedtesting.rules.StatementAdapter.evaluate(StatementAdapter.java:36)
	at com.carrotsearch.randomizedtesting.ThreadLeakControl$StatementRunner.run(ThreadLeakControl.java:368)
	at java.lang.Thread.run(Thread.java:748)
Caused by: java.security.AccessControlException: access denied ("java.lang.RuntimePermission" "accessClassInPackage.sun.nio.fs")
	at java.security.AccessControlContext.checkPermission(AccessControlContext.java:472)
	at java.security.AccessController.checkPermission(AccessController.java:884)
	at java.lang.SecurityManager.checkPermission(SecurityManager.java:549)
	at java.lang.SecurityManager.checkPackageAccess(SecurityManager.java:1564)
	at java.lang.Class.checkPackageAccess(Class.java:2372)
	at java.lang.Class.checkMemberAccess(Class.java:2351)
	at java.lang.Class.getDeclaredFields(Class.java:1915)
	at com.carrotsearch.randomizedtesting.rules.RamUsageEstimator$2.run(RamUsageEstimator.java:585)
	at com.carrotsearch.randomizedtesting.rules.RamUsageEstimator$2.run(RamUsageEstimator.java:582)
	at java.security.AccessController.doPrivileged(Native Method)
	at com.carrotsearch.randomizedtesting.rules.RamUsageEstimator.createCacheEntry(RamUsageEstimator.java:582)
	at com.carrotsearch.randomizedtesting.rules.RamUsageEstimator.measureSizeOf(RamUsageEstimator.java:545)
	at com.carrotsearch.randomizedtesting.rules.RamUsageEstimator.sizeOfAll(RamUsageEstimator.java:387)
	at com.carrotsearch.randomizedtesting.rules.StaticFieldsInvariantRule$1.afterAlways(StaticFieldsInvariantRule.java:129)
	... 10 more


FAILED:  junit.framework.TestSuite.org.apache.solr.cloud.autoscaling.NodeLostTriggerIntegrationTest

Error Message:
Clean up static fields (in @AfterClass?) and null them, your test still has references to classes of which the sizes cannot be measured due to security restrictions or Java 9 module encapsulation:   - private static volatile org.apache.solr.client.solrj.cloud.SolrCloudManager org.apache.solr.cloud.autoscaling.NodeLostTriggerIntegrationTest.cloudManager

Stack Trace:
junit.framework.AssertionFailedError: Clean up static fields (in @AfterClass?) and null them, your test still has references to classes of which the sizes cannot be measured due to security restrictions or Java 9 module encapsulation:
  - private static volatile org.apache.solr.client.solrj.cloud.SolrCloudManager org.apache.solr.cloud.autoscaling.NodeLostTriggerIntegrationTest.cloudManager
	at __randomizedtesting.SeedInfo.seed([72EC01799CA6D17]:0)
	at com.carrotsearch.randomizedtesting.rules.StaticFieldsInvariantRule$1.afterAlways(StaticFieldsInvariantRule.java:146)
	at com.carrotsearch.randomizedtesting.rules.StatementAdapter.evaluate(StatementAdapter.java:43)
	at com.carrotsearch.randomizedtesting.rules.StatementAdapter.evaluate(StatementAdapter.java:36)
	at com.carrotsearch.randomizedtesting.rules.StatementAdapter.evaluate(StatementAdapter.java:36)
	at org.apache.lucene.util.TestRuleAssertionsRequired$1.evaluate(TestRuleAssertionsRequired.java:53)
	at org.apache.lucene.util.TestRuleMarkFailure$1.evaluate(TestRuleMarkFailure.java:47)
	at org.apache.lucene.util.TestRuleIgnoreAfterMaxFailures$1.evaluate(TestRuleIgnoreAfterMaxFailures.java:64)
	at org.apache.lucene.util.TestRuleIgnoreTestSuites$1.evaluate(TestRuleIgnoreTestSuites.java:54)
	at com.carrotsearch.randomizedtesting.rules.StatementAdapter.evaluate(StatementAdapter.java:36)
	at com.carrotsearch.randomizedtesting.ThreadLeakControl$StatementRunner.run(ThreadLeakControl.java:368)
	at java.lang.Thread.run(Thread.java:748)
Caused by: java.security.AccessControlException: access denied ("java.lang.RuntimePermission" "accessClassInPackage.sun.nio.fs")
	at java.security.AccessControlContext.checkPermission(AccessControlContext.java:472)
	at java.security.AccessController.checkPermission(AccessController.java:884)
	at java.lang.SecurityManager.checkPermission(SecurityManager.java:549)
	at java.lang.SecurityManager.checkPackageAccess(SecurityManager.java:1564)
	at java.lang.Class.checkPackageAccess(Class.java:2372)
	at java.lang.Class.checkMemberAccess(Class.java:2351)
	at java.lang.Class.getDeclaredFields(Class.java:1915)
	at com.carrotsearch.randomizedtesting.rules.RamUsageEstimator$2.run(RamUsageEstimator.java:585)
	at com.carrotsearch.randomizedtesting.rules.RamUsageEstimator$2.run(RamUsageEstimator.java:582)
	at java.security.AccessController.doPrivileged(Native Method)
	at com.carrotsearch.randomizedtesting.rules.RamUsageEstimator.createCacheEntry(RamUsageEstimator.java:582)
	at com.carrotsearch.randomizedtesting.rules.RamUsageEstimator.measureSizeOf(RamUsageEstimator.java:545)
	at com.carrotsearch.randomizedtesting.rules.RamUsageEstimator.sizeOfAll(RamUsageEstimator.java:387)
	at com.carrotsearch.randomizedtesting.rules.StaticFieldsInvariantRule$1.afterAlways(StaticFieldsInvariantRule.java:129)
	... 10 more


FAILED:  junit.framework.TestSuite.org.apache.solr.cloud.autoscaling.TriggerIntegrationTest

Error Message:
Clean up static fields (in @AfterClass?) and null them, your test still has references to classes of which the sizes cannot be measured due to security restrictions or Java 9 module encapsulation:   - private static org.apache.solr.client.solrj.cloud.SolrCloudManager org.apache.solr.cloud.autoscaling.TriggerIntegrationTest.cloudManager

Stack Trace:
junit.framework.AssertionFailedError: Clean up static fields (in @AfterClass?) and null them, your test still has references to classes of which the sizes cannot be measured due to security restrictions or Java 9 module encapsulation:
  - private static org.apache.solr.client.solrj.cloud.SolrCloudManager org.apache.solr.cloud.autoscaling.TriggerIntegrationTest.cloudManager
	at __randomizedtesting.SeedInfo.seed([72EC01799CA6D17]:0)
	at com.carrotsearch.randomizedtesting.rules.StaticFieldsInvariantRule$1.afterAlways(StaticFieldsInvariantRule.java:146)
	at com.carrotsearch.randomizedtesting.rules.StatementAdapter.evaluate(StatementAdapter.java:43)
	at com.carrotsearch.randomizedtesting.rules.StatementAdapter.evaluate(StatementAdapter.java:36)
	at com.carrotsearch.randomizedtesting.rules.StatementAdapter.evaluate(StatementAdapter.java:36)
	at org.apache.lucene.util.TestRuleAssertionsRequired$1.evaluate(TestRuleAssertionsRequired.java:53)
	at org.apache.lucene.util.TestRuleMarkFailure$1.evaluate(TestRuleMarkFailure.java:47)
	at org.apache.lucene.util.TestRuleIgnoreAfterMaxFailures$1.evaluate(TestRuleIgnoreAfterMaxFailures.java:64)
	at org.apache.lucene.util.TestRuleIgnoreTestSuites$1.evaluate(TestRuleIgnoreTestSuites.java:54)
	at com.carrotsearch.randomizedtesting.rules.StatementAdapter.evaluate(StatementAdapter.java:36)
	at com.carrotsearch.randomizedtesting.ThreadLeakControl$StatementRunner.run(ThreadLeakControl.java:368)
	at java.lang.Thread.run(Thread.java:748)
Caused by: java.security.AccessControlException: access denied ("java.lang.RuntimePermission" "accessClassInPackage.sun.nio.fs")
	at java.security.AccessControlContext.checkPermission(AccessControlContext.java:472)
	at java.security.AccessController.checkPermission(AccessController.java:884)
	at java.lang.SecurityManager.checkPermission(SecurityManager.java:549)
	at java.lang.SecurityManager.checkPackageAccess(SecurityManager.java:1564)
	at java.lang.Class.checkPackageAccess(Class.java:2372)
	at java.lang.Class.checkMemberAccess(Class.java:2351)
	at java.lang.Class.getDeclaredFields(Class.java:1915)
	at com.carrotsearch.randomizedtesting.rules.RamUsageEstimator$2.run(RamUsageEstimator.java:585)
	at com.carrotsearch.randomizedtesting.rules.RamUsageEstimator$2.run(RamUsageEstimator.java:582)
	at java.security.AccessController.doPrivileged(Native Method)
	at com.carrotsearch.randomizedtesting.rules.RamUsageEstimator.createCacheEntry(RamUsageEstimator.java:582)
	at com.carrotsearch.randomizedtesting.rules.RamUsageEstimator.measureSizeOf(RamUsageEstimator.java:545)
	at com.carrotsearch.randomizedtesting.rules.RamUsageEstimator.sizeOfAll(RamUsageEstimator.java:387)
	at com.carrotsearch.randomizedtesting.rules.StaticFieldsInvariantRule$1.afterAlways(StaticFieldsInvariantRule.java:129)
	... 10 more


FAILED:  junit.framework.TestSuite.org.apache.solr.cloud.autoscaling.sim.TestSimClusterStateProvider

Error Message:
Clean up static fields (in @AfterClass?) and null them, your test still has references to classes of which the sizes cannot be measured due to security restrictions or Java 9 module encapsulation:   - private static org.apache.solr.client.solrj.cloud.SolrCloudManager org.apache.solr.cloud.autoscaling.sim.TestSimClusterStateProvider.cloudManager

Stack Trace:
junit.framework.AssertionFailedError: Clean up static fields (in @AfterClass?) and null them, your test still has references to classes of which the sizes cannot be measured due to security restrictions or Java 9 module encapsulation:
  - private static org.apache.solr.client.solrj.cloud.SolrCloudManager org.apache.solr.cloud.autoscaling.sim.TestSimClusterStateProvider.cloudManager
	at __randomizedtesting.SeedInfo.seed([72EC01799CA6D17]:0)
	at com.carrotsearch.randomizedtesting.rules.StaticFieldsInvariantRule$1.afterAlways(StaticFieldsInvariantRule.java:146)
	at com.carrotsearch.randomizedtesting.rules.StatementAdapter.evaluate(StatementAdapter.java:43)
	at com.carrotsearch.randomizedtesting.rules.StatementAdapter.evaluate(StatementAdapter.java:36)
	at com.carrotsearch.randomizedtesting.rules.StatementAdapter.evaluate(StatementAdapter.java:36)
	at org.apache.lucene.util.TestRuleAssertionsRequired$1.evaluate(TestRuleAssertionsRequired.java:53)
	at org.apache.lucene.util.TestRuleMarkFailure$1.evaluate(TestRuleMarkFailure.java:47)
	at org.apache.lucene.util.TestRuleIgnoreAfterMaxFailures$1.evaluate(TestRuleIgnoreAfterMaxFailures.java:64)
	at org.apache.lucene.util.TestRuleIgnoreTestSuites$1.evaluate(TestRuleIgnoreTestSuites.java:54)
	at com.carrotsearch.randomizedtesting.rules.StatementAdapter.evaluate(StatementAdapter.java:36)
	at com.carrotsearch.randomizedtesting.ThreadLeakControl$StatementRunner.run(ThreadLeakControl.java:368)
	at java.lang.Thread.run(Thread.java:748)
Caused by: java.security.AccessControlException: access denied ("java.lang.RuntimePermission" "accessClassInPackage.sun.nio.fs")
	at java.security.AccessControlContext.checkPermission(AccessControlContext.java:472)
	at java.security.AccessController.checkPermission(AccessController.java:884)
	at java.lang.SecurityManager.checkPermission(SecurityManager.java:549)
	at java.lang.SecurityManager.checkPackageAccess(SecurityManager.java:1564)
	at java.lang.Class.checkPackageAccess(Class.java:2372)
	at java.lang.Class.checkMemberAccess(Class.java:2351)
	at java.lang.Class.getDeclaredFields(Class.java:1915)
	at com.carrotsearch.randomizedtesting.rules.RamUsageEstimator$2.run(RamUsageEstimator.java:585)
	at com.carrotsearch.randomizedtesting.rules.RamUsageEstimator$2.run(RamUsageEstimator.java:582)
	at java.security.AccessController.doPrivileged(Native Method)
	at com.carrotsearch.randomizedtesting.rules.RamUsageEstimator.createCacheEntry(RamUsageEstimator.java:582)
	at com.carrotsearch.randomizedtesting.rules.RamUsageEstimator.measureSizeOf(RamUsageEstimator.java:545)
	at com.carrotsearch.randomizedtesting.rules.RamUsageEstimator.sizeOfAll(RamUsageEstimator.java:387)
	at com.carrotsearch.randomizedtesting.rules.StaticFieldsInvariantRule$1.afterAlways(StaticFieldsInvariantRule.java:129)
	... 10 more


FAILED:  junit.framework.TestSuite.org.apache.solr.cloud.autoscaling.sim.TestSnapshotCloudManager

Error Message:
Clean up static fields (in @AfterClass?) and null them, your test still has references to classes of which the sizes cannot be measured due to security restrictions or Java 9 module encapsulation:   - private static org.apache.solr.client.solrj.cloud.SolrCloudManager org.apache.solr.cloud.autoscaling.sim.TestSnapshotCloudManager.realManager

Stack Trace:
junit.framework.AssertionFailedError: Clean up static fields (in @AfterClass?) and null them, your test still has references to classes of which the sizes cannot be measured due to security restrictions or Java 9 module encapsulation:
  - private static org.apache.solr.client.solrj.cloud.SolrCloudManager org.apache.solr.cloud.autoscaling.sim.TestSnapshotCloudManager.realManager
	at __randomizedtesting.SeedInfo.seed([72EC01799CA6D17]:0)
	at com.carrotsearch.randomizedtesting.rules.StaticFieldsInvariantRule$1.afterAlways(StaticFieldsInvariantRule.java:146)
	at com.carrotsearch.randomizedtesting.rules.StatementAdapter.evaluate(StatementAdapter.java:43)
	at com.carrotsearch.randomizedtesting.rules.StatementAdapter.evaluate(StatementAdapter.java:36)
	at com.carrotsearch.randomizedtesting.rules.StatementAdapter.evaluate(StatementAdapter.java:36)
	at org.apache.lucene.util.TestRuleAssertionsRequired$1.evaluate(TestRuleAssertionsRequired.java:53)
	at org.apache.lucene.util.TestRuleMarkFailure$1.evaluate(TestRuleMarkFailure.java:47)
	at org.apache.lucene.util.TestRuleIgnoreAfterMaxFailures$1.evaluate(TestRuleIgnoreAfterMaxFailures.java:64)
	at org.apache.lucene.util.TestRuleIgnoreTestSuites$1.evaluate(TestRuleIgnoreTestSuites.java:54)
	at com.carrotsearch.randomizedtesting.rules.StatementAdapter.evaluate(StatementAdapter.java:36)
	at com.carrotsearch.randomizedtesting.ThreadLeakControl$StatementRunner.run(ThreadLeakControl.java:368)
	at java.lang.Thread.run(Thread.java:748)
Caused by: java.security.AccessControlException: access denied ("java.lang.RuntimePermission" "accessClassInPackage.sun.nio.fs")
	at java.security.AccessControlContext.checkPermission(AccessControlContext.java:472)
	at java.security.AccessController.checkPermission(AccessController.java:884)
	at java.lang.SecurityManager.checkPermission(SecurityManager.java:549)
	at java.lang.SecurityManager.checkPackageAccess(SecurityManager.java:1564)
	at java.lang.Class.checkPackageAccess(Class.java:2372)
	at java.lang.Class.checkMemberAccess(Class.java:2351)
	at java.lang.Class.getDeclaredFields(Class.java:1915)
	at com.carrotsearch.randomizedtesting.rules.RamUsageEstimator$2.run(RamUsageEstimator.java:585)
	at com.carrotsearch.randomizedtesting.rules.RamUsageEstimator$2.run(RamUsageEstimator.java:582)
	at java.security.AccessController.doPrivileged(Native Method)
	at com.carrotsearch.randomizedtesting.rules.RamUsageEstimator.createCacheEntry(RamUsageEstimator.java:582)
	at com.carrotsearch.randomizedtesting.rules.RamUsageEstimator.measureSizeOf(RamUsageEstimator.java:545)
	at com.carrotsearch.randomizedtesting.rules.RamUsageEstimator.sizeOfAll(RamUsageEstimator.java:387)
	at com.carrotsearch.randomizedtesting.rules.StaticFieldsInvariantRule$1.afterAlways(StaticFieldsInvariantRule.java:129)
	... 10 more


FAILED:  junit.framework.TestSuite.org.apache.solr.cloud.hdfs.HDFSCollectionsAPITest

Error Message:
failure to login: javax.security.auth.login.LoginException: Security Exception

Stack Trace:
org.apache.hadoop.security.KerberosAuthException: failure to login: javax.security.auth.login.LoginException: Security Exception
	at __randomizedtesting.SeedInfo.seed([72EC01799CA6D17]:0)
	at org.apache.hadoop.security.UserGroupInformation.doSubjectLogin(UserGroupInformation.java:1847)
	at org.apache.hadoop.security.UserGroupInformation.createLoginUser(UserGroupInformation.java:710)
	at org.apache.hadoop.security.UserGroupInformation.getLoginUser(UserGroupInformation.java:660)
	at org.apache.hadoop.security.UserGroupInformation.getCurrentUser(UserGroupInformation.java:571)
	at org.apache.hadoop.hdfs.server.namenode.FSNamesystem.<init>(FSNamesystem.java:767)
	at org.apache.hadoop.hdfs.server.namenode.FSNamesystem.<init>(FSNamesystem.java:733)
	at org.apache.hadoop.hdfs.server.namenode.NameNode.format(NameNode.java:1140)
	at org.apache.hadoop.hdfs.server.namenode.NameNode.format(NameNode.java:409)
	at org.apache.hadoop.hdfs.DFSTestUtil.formatNameNode(DFSTestUtil.java:261)
	at org.apache.hadoop.hdfs.MiniDFSCluster.configureNameService(MiniDFSCluster.java:1072)
	at org.apache.hadoop.hdfs.MiniDFSCluster.createNameNodesAndSetConf(MiniDFSCluster.java:958)
	at org.apache.hadoop.hdfs.MiniDFSCluster.initMiniDFSCluster(MiniDFSCluster.java:890)
	at org.apache.hadoop.hdfs.MiniDFSCluster.<init>(MiniDFSCluster.java:518)
	at org.apache.hadoop.hdfs.MiniDFSCluster$Builder.build(MiniDFSCluster.java:477)
	at org.apache.solr.cloud.hdfs.HdfsTestUtil.setupClass(HdfsTestUtil.java:134)
	at org.apache.solr.cloud.hdfs.HdfsTestUtil.setupClass(HdfsTestUtil.java:66)
	at org.apache.solr.cloud.hdfs.HDFSCollectionsAPITest.setupClass(HDFSCollectionsAPITest.java:46)
	at sun.reflect.NativeMethodAccessorImpl.invoke0(Native Method)
	at sun.reflect.NativeMethodAccessorImpl.invoke(NativeMethodAccessorImpl.java:62)
	at sun.reflect.DelegatingMethodAccessorImpl.invoke(DelegatingMethodAccessorImpl.java:43)
	at java.lang.reflect.Method.invoke(Method.java:498)
	at com.carrotsearch.randomizedtesting.RandomizedRunner.invoke(RandomizedRunner.java:1750)
	at com.carrotsearch.randomizedtesting.RandomizedRunner$6.evaluate(RandomizedRunner.java:878)
	at com.carrotsearch.randomizedtesting.RandomizedRunner$7.evaluate(RandomizedRunner.java:894)
	at com.carrotsearch.randomizedtesting.rules.StatementAdapter.evaluate(StatementAdapter.java:36)
	at com.carrotsearch.randomizedtesting.rules.SystemPropertiesRestoreRule$1.evaluate(SystemPropertiesRestoreRule.java:57)
	at org.apache.lucene.util.AbstractBeforeAfterRule$1.evaluate(AbstractBeforeAfterRule.java:45)
	at com.carrotsearch.randomizedtesting.rules.StatementAdapter.evaluate(StatementAdapter.java:36)
	at org.apache.lucene.util.TestRuleStoreClassName$1.evaluate(TestRuleStoreClassName.java:41)
	at com.carrotsearch.randomizedtesting.rules.NoShadowingOrOverridesOnMethodsRule$1.evaluate(NoShadowingOrOverridesOnMethodsRule.java:40)
	at com.carrotsearch.randomizedtesting.rules.NoShadowingOrOverridesOnMethodsRule$1.evaluate(NoShadowingOrOverridesOnMethodsRule.java:40)
	at com.carrotsearch.randomizedtesting.rules.StatementAdapter.evaluate(StatementAdapter.java:36)
	at com.carrotsearch.randomizedtesting.rules.StatementAdapter.evaluate(StatementAdapter.java:36)
	at com.carrotsearch.randomizedtesting.rules.StatementAdapter.evaluate(StatementAdapter.java:36)
	at org.apache.lucene.util.TestRuleAssertionsRequired$1.evaluate(TestRuleAssertionsRequired.java:53)
	at org.apache.lucene.util.TestRuleMarkFailure$1.evaluate(TestRuleMarkFailure.java:47)
	at org.apache.lucene.util.TestRuleIgnoreAfterMaxFailures$1.evaluate(TestRuleIgnoreAfterMaxFailures.java:64)
	at org.apache.lucene.util.TestRuleIgnoreTestSuites$1.evaluate(TestRuleIgnoreTestSuites.java:54)
	at com.carrotsearch.randomizedtesting.rules.StatementAdapter.evaluate(StatementAdapter.java:36)
	at com.carrotsearch.randomizedtesting.ThreadLeakControl$StatementRunner.run(ThreadLeakControl.java:368)
	at java.lang.Thread.run(Thread.java:748)
Caused by: javax.security.auth.login.LoginException: Security Exception
	at javax.security.auth.login.LoginContext.invoke(LoginContext.java:840)
	at javax.security.auth.login.LoginContext.access$000(LoginContext.java:195)
	at javax.security.auth.login.LoginContext$4.run(LoginContext.java:682)
	at javax.security.auth.login.LoginContext$4.run(LoginContext.java:680)
	at java.security.AccessController.doPrivileged(Native Method)
	at javax.security.auth.login.LoginContext.invokePriv(LoginContext.java:680)
	at javax.security.auth.login.LoginContext.login(LoginContext.java:587)
	at org.apache.hadoop.security.UserGroupInformation$HadoopLoginContext.login(UserGroupInformation.java:1926)
	at org.apache.hadoop.security.UserGroupInformation.doSubjectLogin(UserGroupInformation.java:1837)
	... 40 more
Caused by: java.lang.SecurityException
	at javax.security.auth.login.LoginContext.invoke(LoginContext.java:841)
	... 48 more


FAILED:  junit.framework.TestSuite.org.apache.solr.cloud.hdfs.HdfsNNFailoverTest

Error Message:
failure to login: javax.security.auth.login.LoginException: Security Exception

Stack Trace:
org.apache.hadoop.security.KerberosAuthException: failure to login: javax.security.auth.login.LoginException: Security Exception
	at __randomizedtesting.SeedInfo.seed([72EC01799CA6D17]:0)
	at org.apache.hadoop.security.UserGroupInformation.doSubjectLogin(UserGroupInformation.java:1847)
	at org.apache.hadoop.security.UserGroupInformation.createLoginUser(UserGroupInformation.java:710)
	at org.apache.hadoop.security.UserGroupInformation.getLoginUser(UserGroupInformation.java:660)
	at org.apache.hadoop.security.UserGroupInformation.getCurrentUser(UserGroupInformation.java:571)
	at org.apache.hadoop.hdfs.server.namenode.FSNamesystem.<init>(FSNamesystem.java:767)
	at org.apache.hadoop.hdfs.server.namenode.FSNamesystem.<init>(FSNamesystem.java:733)
	at org.apache.hadoop.hdfs.server.namenode.NameNode.format(NameNode.java:1140)
	at org.apache.hadoop.hdfs.server.namenode.NameNode.format(NameNode.java:409)
	at org.apache.hadoop.hdfs.DFSTestUtil.formatNameNode(DFSTestUtil.java:261)
	at org.apache.hadoop.hdfs.MiniDFSCluster.configureNameService(MiniDFSCluster.java:1072)
	at org.apache.hadoop.hdfs.MiniDFSCluster.createNameNodesAndSetConf(MiniDFSCluster.java:958)
	at org.apache.hadoop.hdfs.MiniDFSCluster.initMiniDFSCluster(MiniDFSCluster.java:890)
	at org.apache.hadoop.hdfs.MiniDFSCluster.<init>(MiniDFSCluster.java:518)
	at org.apache.hadoop.hdfs.MiniDFSCluster$Builder.build(MiniDFSCluster.java:477)
	at org.apache.solr.cloud.hdfs.HdfsTestUtil.setupClass(HdfsTestUtil.java:134)
	at org.apache.solr.cloud.hdfs.HdfsNNFailoverTest.setupClass(HdfsNNFailoverTest.java:41)
	at sun.reflect.NativeMethodAccessorImpl.invoke0(Native Method)
	at sun.reflect.NativeMethodAccessorImpl.invoke(NativeMethodAccessorImpl.java:62)
	at sun.reflect.DelegatingMethodAccessorImpl.invoke(DelegatingMethodAccessorImpl.java:43)
	at java.lang.reflect.Method.invoke(Method.java:498)
	at com.carrotsearch.randomizedtesting.RandomizedRunner.invoke(RandomizedRunner.java:1750)
	at com.carrotsearch.randomizedtesting.RandomizedRunner$6.evaluate(RandomizedRunner.java:878)
	at com.carrotsearch.randomizedtesting.RandomizedRunner$7.evaluate(RandomizedRunner.java:894)
	at com.carrotsearch.randomizedtesting.rules.StatementAdapter.evaluate(StatementAdapter.java:36)
	at com.carrotsearch.randomizedtesting.rules.SystemPropertiesRestoreRule$1.evaluate(SystemPropertiesRestoreRule.java:57)
	at org.apache.lucene.util.AbstractBeforeAfterRule$1.evaluate(AbstractBeforeAfterRule.java:45)
	at com.carrotsearch.randomizedtesting.rules.StatementAdapter.evaluate(StatementAdapter.java:36)
	at org.apache.lucene.util.TestRuleStoreClassName$1.evaluate(TestRuleStoreClassName.java:41)
	at com.carrotsearch.randomizedtesting.rules.NoShadowingOrOverridesOnMethodsRule$1.evaluate(NoShadowingOrOverridesOnMethodsRule.java:40)
	at com.carrotsearch.randomizedtesting.rules.NoShadowingOrOverridesOnMethodsRule$1.evaluate(NoShadowingOrOverridesOnMethodsRule.java:40)
	at com.carrotsearch.randomizedtesting.rules.StatementAdapter.evaluate(StatementAdapter.java:36)
	at com.carrotsearch.randomizedtesting.rules.StatementAdapter.evaluate(StatementAdapter.java:36)
	at com.carrotsearch.randomizedtesting.rules.StatementAdapter.evaluate(StatementAdapter.java:36)
	at org.apache.lucene.util.TestRuleAssertionsRequired$1.evaluate(TestRuleAssertionsRequired.java:53)
	at org.apache.lucene.util.TestRuleMarkFailure$1.evaluate(TestRuleMarkFailure.java:47)
	at org.apache.lucene.util.TestRuleIgnoreAfterMaxFailures$1.evaluate(TestRuleIgnoreAfterMaxFailures.java:64)
	at org.apache.lucene.util.TestRuleIgnoreTestSuites$1.evaluate(TestRuleIgnoreTestSuites.java:54)
	at com.carrotsearch.randomizedtesting.rules.StatementAdapter.evaluate(StatementAdapter.java:36)
	at com.carrotsearch.randomizedtesting.ThreadLeakControl$StatementRunner.run(ThreadLeakControl.java:368)
	at java.lang.Thread.run(Thread.java:748)
Caused by: javax.security.auth.login.LoginException: Security Exception
	at javax.security.auth.login.LoginContext.invoke(LoginContext.java:840)
	at javax.security.auth.login.LoginContext.access$000(LoginContext.java:195)
	at javax.security.auth.login.LoginContext$4.run(LoginContext.java:682)
	at javax.security.auth.login.LoginContext$4.run(LoginContext.java:680)
	at java.security.AccessController.doPrivileged(Native Method)
	at javax.security.auth.login.LoginContext.invokePriv(LoginContext.java:680)
	at javax.security.auth.login.LoginContext.login(LoginContext.java:587)
	at org.apache.hadoop.security.UserGroupInformation$HadoopLoginContext.login(UserGroupInformation.java:1926)
	at org.apache.hadoop.security.UserGroupInformation.doSubjectLogin(UserGroupInformation.java:1837)
	... 39 more
Caused by: java.lang.SecurityException
	at javax.security.auth.login.LoginContext.invoke(LoginContext.java:841)
	... 47 more


FAILED:  junit.framework.TestSuite.org.apache.solr.cloud.hdfs.HdfsRecoverLeaseTest

Error Message:
failure to login: javax.security.auth.login.LoginException: Security Exception

Stack Trace:
org.apache.hadoop.security.KerberosAuthException: failure to login: javax.security.auth.login.LoginException: Security Exception
	at __randomizedtesting.SeedInfo.seed([72EC01799CA6D17]:0)
	at org.apache.hadoop.security.UserGroupInformation.doSubjectLogin(UserGroupInformation.java:1847)
	at org.apache.hadoop.security.UserGroupInformation.createLoginUser(UserGroupInformation.java:710)
	at org.apache.hadoop.security.UserGroupInformation.getLoginUser(UserGroupInformation.java:660)
	at org.apache.hadoop.security.UserGroupInformation.getCurrentUser(UserGroupInformation.java:571)
	at org.apache.hadoop.hdfs.server.namenode.FSNamesystem.<init>(FSNamesystem.java:767)
	at org.apache.hadoop.hdfs.server.namenode.FSNamesystem.<init>(FSNamesystem.java:733)
	at org.apache.hadoop.hdfs.server.namenode.NameNode.format(NameNode.java:1140)
	at org.apache.hadoop.hdfs.server.namenode.NameNode.format(NameNode.java:409)
	at org.apache.hadoop.hdfs.DFSTestUtil.formatNameNode(DFSTestUtil.java:261)
	at org.apache.hadoop.hdfs.MiniDFSCluster.configureNameService(MiniDFSCluster.java:1072)
	at org.apache.hadoop.hdfs.MiniDFSCluster.createNameNodesAndSetConf(MiniDFSCluster.java:958)
	at org.apache.hadoop.hdfs.MiniDFSCluster.initMiniDFSCluster(MiniDFSCluster.java:890)
	at org.apache.hadoop.hdfs.MiniDFSCluster.<init>(MiniDFSCluster.java:518)
	at org.apache.hadoop.hdfs.MiniDFSCluster$Builder.build(MiniDFSCluster.java:477)
	at org.apache.solr.cloud.hdfs.HdfsTestUtil.setupClass(HdfsTestUtil.java:134)
	at org.apache.solr.cloud.hdfs.HdfsTestUtil.setupClass(HdfsTestUtil.java:70)
	at org.apache.solr.cloud.hdfs.HdfsRecoverLeaseTest.beforeClass(HdfsRecoverLeaseTest.java:50)
	at sun.reflect.NativeMethodAccessorImpl.invoke0(Native Method)
	at sun.reflect.NativeMethodAccessorImpl.invoke(NativeMethodAccessorImpl.java:62)
	at sun.reflect.DelegatingMethodAccessorImpl.invoke(DelegatingMethodAccessorImpl.java:43)
	at java.lang.reflect.Method.invoke(Method.java:498)
	at com.carrotsearch.randomizedtesting.RandomizedRunner.invoke(RandomizedRunner.java:1750)
	at com.carrotsearch.randomizedtesting.RandomizedRunner$6.evaluate(RandomizedRunner.java:878)
	at com.carrotsearch.randomizedtesting.RandomizedRunner$7.evaluate(RandomizedRunner.java:894)
	at com.carrotsearch.randomizedtesting.rules.StatementAdapter.evaluate(StatementAdapter.java:36)
	at com.carrotsearch.randomizedtesting.rules.SystemPropertiesRestoreRule$1.evaluate(SystemPropertiesRestoreRule.java:57)
	at org.apache.lucene.util.AbstractBeforeAfterRule$1.evaluate(AbstractBeforeAfterRule.java:45)
	at com.carrotsearch.randomizedtesting.rules.StatementAdapter.evaluate(StatementAdapter.java:36)
	at org.apache.lucene.util.TestRuleStoreClassName$1.evaluate(TestRuleStoreClassName.java:41)
	at com.carrotsearch.randomizedtesting.rules.NoShadowingOrOverridesOnMethodsRule$1.evaluate(NoShadowingOrOverridesOnMethodsRule.java:40)
	at com.carrotsearch.randomizedtesting.rules.NoShadowingOrOverridesOnMethodsRule$1.evaluate(NoShadowingOrOverridesOnMethodsRule.java:40)
	at com.carrotsearch.randomizedtesting.rules.StatementAdapter.evaluate(StatementAdapter.java:36)
	at com.carrotsearch.randomizedtesting.rules.StatementAdapter.evaluate(StatementAdapter.java:36)
	at com.carrotsearch.randomizedtesting.rules.StatementAdapter.evaluate(StatementAdapter.java:36)
	at org.apache.lucene.util.TestRuleAssertionsRequired$1.evaluate(TestRuleAssertionsRequired.java:53)
	at org.apache.lucene.util.TestRuleMarkFailure$1.evaluate(TestRuleMarkFailure.java:47)
	at org.apache.lucene.util.TestRuleIgnoreAfterMaxFailures$1.evaluate(TestRuleIgnoreAfterMaxFailures.java:64)
	at org.apache.lucene.util.TestRuleIgnoreTestSuites$1.evaluate(TestRuleIgnoreTestSuites.java:54)
	at com.carrotsearch.randomizedtesting.rules.StatementAdapter.evaluate(StatementAdapter.java:36)
	at com.carrotsearch.randomizedtesting.ThreadLeakControl$StatementRunner.run(ThreadLeakControl.java:368)
	at java.lang.Thread.run(Thread.java:748)
Caused by: javax.security.auth.login.LoginException: Security Exception
	at javax.security.auth.login.LoginContext.invoke(LoginContext.java:840)
	at javax.security.auth.login.LoginContext.access$000(LoginContext.java:195)
	at javax.security.auth.login.LoginContext$4.run(LoginContext.java:682)
	at javax.security.auth.login.LoginContext$4.run(LoginContext.java:680)
	at java.security.AccessController.doPrivileged(Native Method)
	at javax.security.auth.login.LoginContext.invokePriv(LoginContext.java:680)
	at javax.security.auth.login.LoginContext.login(LoginContext.java:587)
	at org.apache.hadoop.security.UserGroupInformation$HadoopLoginContext.login(UserGroupInformation.java:1926)
	at org.apache.hadoop.security.UserGroupInformation.doSubjectLogin(UserGroupInformation.java:1837)
	... 40 more
Caused by: java.lang.SecurityException
	at javax.security.auth.login.LoginContext.invoke(LoginContext.java:841)
	... 48 more


FAILED:  junit.framework.TestSuite.org.apache.solr.cloud.hdfs.HdfsThreadLeakTest

Error Message:
failure to login: javax.security.auth.login.LoginException: Security Exception

Stack Trace:
org.apache.hadoop.security.KerberosAuthException: failure to login: javax.security.auth.login.LoginException: Security Exception
	at __randomizedtesting.SeedInfo.seed([72EC01799CA6D17]:0)
	at org.apache.hadoop.security.UserGroupInformation.doSubjectLogin(UserGroupInformation.java:1847)
	at org.apache.hadoop.security.UserGroupInformation.createLoginUser(UserGroupInformation.java:710)
	at org.apache.hadoop.security.UserGroupInformation.getLoginUser(UserGroupInformation.java:660)
	at org.apache.hadoop.security.UserGroupInformation.getCurrentUser(UserGroupInformation.java:571)
	at org.apache.hadoop.hdfs.server.namenode.FSNamesystem.<init>(FSNamesystem.java:767)
	at org.apache.hadoop.hdfs.server.namenode.FSNamesystem.<init>(FSNamesystem.java:733)
	at org.apache.hadoop.hdfs.server.namenode.NameNode.format(NameNode.java:1140)
	at org.apache.hadoop.hdfs.server.namenode.NameNode.format(NameNode.java:409)
	at org.apache.hadoop.hdfs.DFSTestUtil.formatNameNode(DFSTestUtil.java:261)
	at org.apache.hadoop.hdfs.MiniDFSCluster.configureNameService(MiniDFSCluster.java:1072)
	at org.apache.hadoop.hdfs.MiniDFSCluster.createNameNodesAndSetConf(MiniDFSCluster.java:958)
	at org.apache.hadoop.hdfs.MiniDFSCluster.initMiniDFSCluster(MiniDFSCluster.java:890)
	at org.apache.hadoop.hdfs.MiniDFSCluster.<init>(MiniDFSCluster.java:518)
	at org.apache.hadoop.hdfs.MiniDFSCluster$Builder.build(MiniDFSCluster.java:477)
	at org.apache.solr.cloud.hdfs.HdfsTestUtil.setupClass(HdfsTestUtil.java:134)
	at org.apache.solr.cloud.hdfs.HdfsThreadLeakTest.beforeClass(HdfsThreadLeakTest.java:42)
	at sun.reflect.NativeMethodAccessorImpl.invoke0(Native Method)
	at sun.reflect.NativeMethodAccessorImpl.invoke(NativeMethodAccessorImpl.java:62)
	at sun.reflect.DelegatingMethodAccessorImpl.invoke(DelegatingMethodAccessorImpl.java:43)
	at java.lang.reflect.Method.invoke(Method.java:498)
	at com.carrotsearch.randomizedtesting.RandomizedRunner.invoke(RandomizedRunner.java:1750)
	at com.carrotsearch.randomizedtesting.RandomizedRunner$6.evaluate(RandomizedRunner.java:878)
	at com.carrotsearch.randomizedtesting.RandomizedRunner$7.evaluate(RandomizedRunner.java:894)
	at com.carrotsearch.randomizedtesting.rules.StatementAdapter.evaluate(StatementAdapter.java:36)
	at com.carrotsearch.randomizedtesting.rules.SystemPropertiesRestoreRule$1.evaluate(SystemPropertiesRestoreRule.java:57)
	at org.apache.lucene.util.AbstractBeforeAfterRule$1.evaluate(AbstractBeforeAfterRule.java:45)
	at com.carrotsearch.randomizedtesting.rules.StatementAdapter.evaluate(StatementAdapter.java:36)
	at org.apache.lucene.util.TestRuleStoreClassName$1.evaluate(TestRuleStoreClassName.java:41)
	at com.carrotsearch.randomizedtesting.rules.NoShadowingOrOverridesOnMethodsRule$1.evaluate(NoShadowingOrOverridesOnMethodsRule.java:40)
	at com.carrotsearch.randomizedtesting.rules.NoShadowingOrOverridesOnMethodsRule$1.evaluate(NoShadowingOrOverridesOnMethodsRule.java:40)
	at com.carrotsearch.randomizedtesting.rules.StatementAdapter.evaluate(StatementAdapter.java:36)
	at com.carrotsearch.randomizedtesting.rules.StatementAdapter.evaluate(StatementAdapter.java:36)
	at com.carrotsearch.randomizedtesting.rules.StatementAdapter.evaluate(StatementAdapter.java:36)
	at org.apache.lucene.util.TestRuleAssertionsRequired$1.evaluate(TestRuleAssertionsRequired.java:53)
	at org.apache.lucene.util.TestRuleMarkFailure$1.evaluate(TestRuleMarkFailure.java:47)
	at org.apache.lucene.util.TestRuleIgnoreAfterMaxFailures$1.evaluate(TestRuleIgnoreAfterMaxFailures.java:64)
	at org.apache.lucene.util.TestRuleIgnoreTestSuites$1.evaluate(TestRuleIgnoreTestSuites.java:54)
	at com.carrotsearch.randomizedtesting.rules.StatementAdapter.evaluate(StatementAdapter.java:36)
	at com.carrotsearch.randomizedtesting.ThreadLeakControl$StatementRunner.run(ThreadLeakControl.java:368)
	at java.lang.Thread.run(Thread.java:748)
Caused by: javax.security.auth.login.LoginException: Security Exception
	at javax.security.auth.login.LoginContext.invoke(LoginContext.java:840)
	at javax.security.auth.login.LoginContext.access$000(LoginContext.java:195)
	at javax.security.auth.login.LoginContext$4.run(LoginContext.java:682)
	at javax.security.auth.login.LoginContext$4.run(LoginContext.java:680)
	at java.security.AccessController.doPrivileged(Native Method)
	at javax.security.auth.login.LoginContext.invokePriv(LoginContext.java:680)
	at javax.security.auth.login.LoginContext.login(LoginContext.java:587)
	at org.apache.hadoop.security.UserGroupInformation$HadoopLoginContext.login(UserGroupInformation.java:1926)
	at org.apache.hadoop.security.UserGroupInformation.doSubjectLogin(UserGroupInformation.java:1837)
	... 39 more
Caused by: java.lang.SecurityException
	at javax.security.auth.login.LoginContext.invoke(LoginContext.java:841)
	... 47 more


FAILED:  junit.framework.TestSuite.org.apache.solr.core.HdfsDirectoryFactoryTest

Error Message:
failure to login: javax.security.auth.login.LoginException: Security Exception

Stack Trace:
org.apache.hadoop.security.KerberosAuthException: failure to login: javax.security.auth.login.LoginException: Security Exception
	at __randomizedtesting.SeedInfo.seed([72EC01799CA6D17]:0)
	at org.apache.hadoop.security.UserGroupInformation.doSubjectLogin(UserGroupInformation.java:1847)
	at org.apache.hadoop.security.UserGroupInformation.createLoginUser(UserGroupInformation.java:710)
	at org.apache.hadoop.security.UserGroupInformation.getLoginUser(UserGroupInformation.java:660)
	at org.apache.hadoop.security.UserGroupInformation.getCurrentUser(UserGroupInformation.java:571)
	at org.apache.hadoop.hdfs.server.namenode.FSNamesystem.<init>(FSNamesystem.java:767)
	at org.apache.hadoop.hdfs.server.namenode.FSNamesystem.<init>(FSNamesystem.java:733)
	at org.apache.hadoop.hdfs.server.namenode.NameNode.format(NameNode.java:1140)
	at org.apache.hadoop.hdfs.server.namenode.NameNode.format(NameNode.java:409)
	at org.apache.hadoop.hdfs.DFSTestUtil.formatNameNode(DFSTestUtil.java:261)
	at org.apache.hadoop.hdfs.MiniDFSCluster.configureNameService(MiniDFSCluster.java:1072)
	at org.apache.hadoop.hdfs.MiniDFSCluster.createNameNodesAndSetConf(MiniDFSCluster.java:958)
	at org.apache.hadoop.hdfs.MiniDFSCluster.initMiniDFSCluster(MiniDFSCluster.java:890)
	at org.apache.hadoop.hdfs.MiniDFSCluster.<init>(MiniDFSCluster.java:518)
	at org.apache.hadoop.hdfs.MiniDFSCluster$Builder.build(MiniDFSCluster.java:477)
	at org.apache.solr.cloud.hdfs.HdfsTestUtil.setupClass(HdfsTestUtil.java:134)
	at org.apache.solr.cloud.hdfs.HdfsTestUtil.setupClass(HdfsTestUtil.java:70)
	at org.apache.solr.core.HdfsDirectoryFactoryTest.setupClass(HdfsDirectoryFactoryTest.java:62)
	at sun.reflect.NativeMethodAccessorImpl.invoke0(Native Method)
	at sun.reflect.NativeMethodAccessorImpl.invoke(NativeMethodAccessorImpl.java:62)
	at sun.reflect.DelegatingMethodAccessorImpl.invoke(DelegatingMethodAccessorImpl.java:43)
	at java.lang.reflect.Method.invoke(Method.java:498)
	at com.carrotsearch.randomizedtesting.RandomizedRunner.invoke(RandomizedRunner.java:1750)
	at com.carrotsearch.randomizedtesting.RandomizedRunner$6.evaluate(RandomizedRunner.java:878)
	at com.carrotsearch.randomizedtesting.RandomizedRunner$7.evaluate(RandomizedRunner.java:894)
	at com.carrotsearch.randomizedtesting.rules.StatementAdapter.evaluate(StatementAdapter.java:36)
	at com.carrotsearch.randomizedtesting.rules.SystemPropertiesRestoreRule$1.evaluate(SystemPropertiesRestoreRule.java:57)
	at org.apache.lucene.util.AbstractBeforeAfterRule$1.evaluate(AbstractBeforeAfterRule.java:45)
	at com.carrotsearch.randomizedtesting.rules.StatementAdapter.evaluate(StatementAdapter.java:36)
	at org.apache.lucene.util.TestRuleStoreClassName$1.evaluate(TestRuleStoreClassName.java:41)
	at com.carrotsearch.randomizedtesting.rules.NoShadowingOrOverridesOnMethodsRule$1.evaluate(NoShadowingOrOverridesOnMethodsRule.java:40)
	at com.carrotsearch.randomizedtesting.rules.NoShadowingOrOverridesOnMethodsRule$1.evaluate(NoShadowingOrOverridesOnMethodsRule.java:40)
	at com.carrotsearch.randomizedtesting.rules.StatementAdapter.evaluate(StatementAdapter.java:36)
	at com.carrotsearch.randomizedtesting.rules.StatementAdapter.evaluate(StatementAdapter.java:36)
	at com.carrotsearch.randomizedtesting.rules.StatementAdapter.evaluate(StatementAdapter.java:36)
	at org.apache.lucene.util.TestRuleAssertionsRequired$1.evaluate(TestRuleAssertionsRequired.java:53)
	at org.apache.lucene.util.TestRuleMarkFailure$1.evaluate(TestRuleMarkFailure.java:47)
	at org.apache.lucene.util.TestRuleIgnoreAfterMaxFailures$1.evaluate(TestRuleIgnoreAfterMaxFailures.java:64)
	at org.apache.lucene.util.TestRuleIgnoreTestSuites$1.evaluate(TestRuleIgnoreTestSuites.java:54)
	at com.carrotsearch.randomizedtesting.rules.StatementAdapter.evaluate(StatementAdapter.java:36)
	at com.carrotsearch.randomizedtesting.ThreadLeakControl$StatementRunner.run(ThreadLeakControl.java:368)
	at java.lang.Thread.run(Thread.java:748)
Caused by: javax.security.auth.login.LoginException: Security Exception
	at javax.security.auth.login.LoginContext.invoke(LoginContext.java:840)
	at javax.security.auth.login.LoginContext.access$000(LoginContext.java:195)
	at javax.security.auth.login.LoginContext$4.run(LoginContext.java:682)
	at javax.security.auth.login.LoginContext$4.run(LoginContext.java:680)
	at java.security.AccessController.doPrivileged(Native Method)
	at javax.security.auth.login.LoginContext.invokePriv(LoginContext.java:680)
	at javax.security.auth.login.LoginContext.login(LoginContext.java:587)
	at org.apache.hadoop.security.UserGroupInformation$HadoopLoginContext.login(UserGroupInformation.java:1926)
	at org.apache.hadoop.security.UserGroupInformation.doSubjectLogin(UserGroupInformation.java:1837)
	... 40 more
Caused by: java.lang.SecurityException
	at javax.security.auth.login.LoginContext.invoke(LoginContext.java:841)
	... 48 more


FAILED:  junit.framework.TestSuite.org.apache.solr.core.TestJmxIntegration

Error Message:
Clean up static fields (in @AfterClass?) and null them, your test still has references to classes of which the sizes cannot be measured due to security restrictions or Java 9 module encapsulation:   - private static javax.management.MBeanServer org.apache.solr.core.TestJmxIntegration.newMbeanServer

Stack Trace:
junit.framework.AssertionFailedError: Clean up static fields (in @AfterClass?) and null them, your test still has references to classes of which the sizes cannot be measured due to security restrictions or Java 9 module encapsulation:
  - private static javax.management.MBeanServer org.apache.solr.core.TestJmxIntegration.newMbeanServer
	at __randomizedtesting.SeedInfo.seed([72EC01799CA6D17]:0)
	at com.carrotsearch.randomizedtesting.rules.StaticFieldsInvariantRule$1.afterAlways(StaticFieldsInvariantRule.java:146)
	at com.carrotsearch.randomizedtesting.rules.StatementAdapter.evaluate(StatementAdapter.java:43)
	at com.carrotsearch.randomizedtesting.rules.StatementAdapter.evaluate(StatementAdapter.java:36)
	at com.carrotsearch.randomizedtesting.rules.StatementAdapter.evaluate(StatementAdapter.java:36)
	at org.apache.lucene.util.TestRuleAssertionsRequired$1.evaluate(TestRuleAssertionsRequired.java:53)
	at org.apache.lucene.util.TestRuleMarkFailure$1.evaluate(TestRuleMarkFailure.java:47)
	at org.apache.lucene.util.TestRuleIgnoreAfterMaxFailures$1.evaluate(TestRuleIgnoreAfterMaxFailures.java:64)
	at org.apache.lucene.util.TestRuleIgnoreTestSuites$1.evaluate(TestRuleIgnoreTestSuites.java:54)
	at com.carrotsearch.randomizedtesting.rules.StatementAdapter.evaluate(StatementAdapter.java:36)
	at com.carrotsearch.randomizedtesting.ThreadLeakControl$StatementRunner.run(ThreadLeakControl.java:368)
	at java.lang.Thread.run(Thread.java:748)
Caused by: java.security.AccessControlException: access denied ("java.lang.RuntimePermission" "accessClassInPackage.com.sun.jmx.mbeanserver")
	at java.security.AccessControlContext.checkPermission(AccessControlContext.java:472)
	at java.security.AccessController.checkPermission(AccessController.java:884)
	at java.lang.SecurityManager.checkPermission(SecurityManager.java:549)
	at java.lang.SecurityManager.checkPackageAccess(SecurityManager.java:1564)
	at java.lang.Class.checkPackageAccess(Class.java:2372)
	at java.lang.Class.checkMemberAccess(Class.java:2351)
	at java.lang.Class.getDeclaredFields(Class.java:1915)
	at com.carrotsearch.randomizedtesting.rules.RamUsageEstimator$2.run(RamUsageEstimator.java:585)
	at com.carrotsearch.randomizedtesting.rules.RamUsageEstimator$2.run(RamUsageEstimator.java:582)
	at java.security.AccessController.doPrivileged(Native Method)
	at com.carrotsearch.randomizedtesting.rules.RamUsageEstimator.createCacheEntry(RamUsageEstimator.java:582)
	at com.carrotsearch.randomizedtesting.rules.RamUsageEstimator.measureSizeOf(RamUsageEstimator.java:545)
	at com.carrotsearch.randomizedtesting.rules.RamUsageEstimator.sizeOfAll(RamUsageEstimator.java:387)
	at com.carrotsearch.randomizedtesting.rules.StaticFieldsInvariantRule$1.afterAlways(StaticFieldsInvariantRule.java:129)
	... 10 more


FAILED:  org.apache.solr.core.backup.repository.HdfsBackupRepositoryTest.testCopyBufferDefaultSize

Error Message:
org.apache.hadoop.security.KerberosAuthException: failure to login: javax.security.auth.login.LoginException: Security Exception

Stack Trace:
org.apache.solr.common.SolrException: org.apache.hadoop.security.KerberosAuthException: failure to login: javax.security.auth.login.LoginException: Security Exception
	at org.apache.solr.core.backup.repository.HdfsBackupRepository.init(HdfsBackupRepository.java:91)
	at org.apache.solr.core.backup.repository.HdfsBackupRepositoryTest.testCopyBufferDefaultSize(HdfsBackupRepositoryTest.java:92)
	at sun.reflect.NativeMethodAccessorImpl.invoke0(Native Method)
	at sun.reflect.NativeMethodAccessorImpl.invoke(NativeMethodAccessorImpl.java:62)
	at sun.reflect.DelegatingMethodAccessorImpl.invoke(DelegatingMethodAccessorImpl.java:43)
	at java.lang.reflect.Method.invoke(Method.java:498)
	at org.junit.runners.model.FrameworkMethod$1.runReflectiveCall(FrameworkMethod.java:50)
	at org.junit.internal.runners.model.ReflectiveCallable.run(ReflectiveCallable.java:12)
	at org.junit.runners.model.FrameworkMethod.invokeExplosively(FrameworkMethod.java:47)
	at org.junit.internal.runners.statements.InvokeMethod.evaluate(InvokeMethod.java:17)
	at org.junit.runners.ParentRunner.runLeaf(ParentRunner.java:325)
	at org.junit.runners.BlockJUnit4ClassRunner.runChild(BlockJUnit4ClassRunner.java:78)
	at org.junit.runners.BlockJUnit4ClassRunner.runChild(BlockJUnit4ClassRunner.java:57)
	at org.junit.runners.ParentRunner$3.run(ParentRunner.java:290)
	at org.junit.runners.ParentRunner$1.schedule(ParentRunner.java:71)
	at org.junit.runners.ParentRunner.runChildren(ParentRunner.java:288)
	at org.junit.runners.ParentRunner.access$000(ParentRunner.java:58)
	at org.junit.runners.ParentRunner$2.evaluate(ParentRunner.java:268)
	at org.junit.runners.ParentRunner.run(ParentRunner.java:363)
	at com.carrotsearch.ant.tasks.junit4.slave.SlaveMain.execute(SlaveMain.java:269)
	at com.carrotsearch.ant.tasks.junit4.slave.SlaveMain.main(SlaveMain.java:394)
	at com.carrotsearch.ant.tasks.junit4.slave.SlaveMainSafe.main(SlaveMainSafe.java:13)
Caused by: org.apache.hadoop.security.KerberosAuthException: failure to login: javax.security.auth.login.LoginException: Security Exception
	at org.apache.hadoop.security.UserGroupInformation.doSubjectLogin(UserGroupInformation.java:1847)
	at org.apache.hadoop.security.UserGroupInformation.createLoginUser(UserGroupInformation.java:710)
	at org.apache.hadoop.security.UserGroupInformation.getLoginUser(UserGroupInformation.java:660)
	at org.apache.hadoop.security.UserGroupInformation.getCurrentUser(UserGroupInformation.java:571)
	at org.apache.hadoop.hdfs.DFSClient.<init>(DFSClient.java:322)
	at org.apache.hadoop.hdfs.DFSClient.<init>(DFSClient.java:289)
	at org.apache.hadoop.hdfs.DistributedFileSystem.initialize(DistributedFileSystem.java:176)
	at org.apache.hadoop.fs.FileSystem.createFileSystem(FileSystem.java:3303)
	at org.apache.hadoop.fs.FileSystem.get(FileSystem.java:476)
	at org.apache.solr.core.backup.repository.HdfsBackupRepository.init(HdfsBackupRepository.java:89)
	... 21 more
Caused by: javax.security.auth.login.LoginException: Security Exception
	at javax.security.auth.login.LoginContext.invoke(LoginContext.java:840)
	at javax.security.auth.login.LoginContext.access$000(LoginContext.java:195)
	at javax.security.auth.login.LoginContext$4.run(LoginContext.java:682)
	at javax.security.auth.login.LoginContext$4.run(LoginContext.java:680)
	at java.security.AccessController.doPrivileged(Native Method)
	at javax.security.auth.login.LoginContext.invokePriv(LoginContext.java:680)
	at javax.security.auth.login.LoginContext.login(LoginContext.java:587)
	at org.apache.hadoop.security.UserGroupInformation$HadoopLoginContext.login(UserGroupInformation.java:1926)
	at org.apache.hadoop.security.UserGroupInformation.doSubjectLogin(UserGroupInformation.java:1837)
	... 30 more
Caused by: java.lang.SecurityException
	at javax.security.auth.login.LoginContext.invoke(LoginContext.java:841)
	... 38 more


FAILED:  org.apache.solr.core.backup.repository.HdfsBackupRepositoryTest.testHdfsHomePropertySet

Error Message:
org.apache.hadoop.security.KerberosAuthException: failure to login: javax.security.auth.login.LoginException: Security Exception

Stack Trace:
org.apache.solr.common.SolrException: org.apache.hadoop.security.KerberosAuthException: failure to login: javax.security.auth.login.LoginException: Security Exception
	at org.apache.solr.core.backup.repository.HdfsBackupRepository.init(HdfsBackupRepository.java:91)
	at org.apache.solr.core.backup.repository.HdfsBackupRepositoryTest.testHdfsHomePropertySet(HdfsBackupRepositoryTest.java:42)
	at sun.reflect.NativeMethodAccessorImpl.invoke0(Native Method)
	at sun.reflect.NativeMethodAccessorImpl.invoke(NativeMethodAccessorImpl.java:62)
	at sun.reflect.DelegatingMethodAccessorImpl.invoke(DelegatingMethodAccessorImpl.java:43)
	at java.lang.reflect.Method.invoke(Method.java:498)
	at org.junit.runners.model.FrameworkMethod$1.runReflectiveCall(FrameworkMethod.java:50)
	at org.junit.internal.runners.model.ReflectiveCallable.run(ReflectiveCallable.java:12)
	at org.junit.runners.model.FrameworkMethod.invokeExplosively(FrameworkMethod.java:47)
	at org.junit.internal.runners.statements.InvokeMethod.evaluate(InvokeMethod.java:17)
	at org.junit.runners.ParentRunner.runLeaf(ParentRunner.java:325)
	at org.junit.runners.BlockJUnit4ClassRunner.runChild(BlockJUnit4ClassRunner.java:78)
	at org.junit.runners.BlockJUnit4ClassRunner.runChild(BlockJUnit4ClassRunner.java:57)
	at org.junit.runners.ParentRunner$3.run(ParentRunner.java:290)
	at org.junit.runners.ParentRunner$1.schedule(ParentRunner.java:71)
	at org.junit.runners.ParentRunner.runChildren(ParentRunner.java:288)
	at org.junit.runners.ParentRunner.access$000(ParentRunner.java:58)
	at org.junit.runners.ParentRunner$2.evaluate(ParentRunner.java:268)
	at org.junit.runners.ParentRunner.run(ParentRunner.java:363)
	at com.carrotsearch.ant.tasks.junit4.slave.SlaveMain.execute(SlaveMain.java:269)
	at com.carrotsearch.ant.tasks.junit4.slave.SlaveMain.main(SlaveMain.java:394)
	at com.carrotsearch.ant.tasks.junit4.slave.SlaveMainSafe.main(SlaveMainSafe.java:13)
Caused by: org.apache.hadoop.security.KerberosAuthException: failure to login: javax.security.auth.login.LoginException: Security Exception
	at org.apache.hadoop.security.UserGroupInformation.doSubjectLogin(UserGroupInformation.java:1847)
	at org.apache.hadoop.security.UserGroupInformation.createLoginUser(UserGroupInformation.java:710)
	at org.apache.hadoop.security.UserGroupInformation.getLoginUser(UserGroupInformation.java:660)
	at org.apache.hadoop.security.UserGroupInformation.getCurrentUser(UserGroupInformation.java:571)
	at org.apache.hadoop.hdfs.DFSClient.<init>(DFSClient.java:322)
	at org.apache.hadoop.hdfs.DFSClient.<init>(DFSClient.java:289)
	at org.apache.hadoop.hdfs.DistributedFileSystem.initialize(DistributedFileSystem.java:176)
	at org.apache.hadoop.fs.FileSystem.createFileSystem(FileSystem.java:3303)
	at org.apache.hadoop.fs.FileSystem.get(FileSystem.java:476)
	at org.apache.solr.core.backup.repository.HdfsBackupRepository.init(HdfsBackupRepository.java:89)
	... 21 more
Caused by: javax.security.auth.login.LoginException: Security Exception
	at javax.security.auth.login.LoginContext.invoke(LoginContext.java:840)
	at javax.security.auth.login.LoginContext.access$000(LoginContext.java:195)
	at javax.security.auth.login.LoginContext$4.run(LoginContext.java:682)
	at javax.security.auth.login.LoginContext$4.run(LoginContext.java:680)
	at java.security.AccessController.doPrivileged(Native Method)
	at javax.security.auth.login.LoginContext.invokePriv(LoginContext.java:680)
	at javax.security.auth.login.LoginContext.login(LoginContext.java:587)
	at org.apache.hadoop.security.UserGroupInformation$HadoopLoginContext.login(UserGroupInformation.java:1926)
	at org.apache.hadoop.security.UserGroupInformation.doSubjectLogin(UserGroupInformation.java:1837)
	... 30 more
Caused by: java.lang.SecurityException
	at javax.security.auth.login.LoginContext.invoke(LoginContext.java:841)
	... 38 more


FAILED:  org.apache.solr.core.backup.repository.HdfsBackupRepositoryTest.testCopyBufferSet

Error Message:
org.apache.hadoop.security.KerberosAuthException: failure to login: javax.security.auth.login.LoginException: Security Exception

Stack Trace:
org.apache.solr.common.SolrException: org.apache.hadoop.security.KerberosAuthException: failure to login: javax.security.auth.login.LoginException: Security Exception
	at org.apache.solr.core.backup.repository.HdfsBackupRepository.init(HdfsBackupRepository.java:91)
	at org.apache.solr.core.backup.repository.HdfsBackupRepositoryTest.testCopyBufferSet(HdfsBackupRepositoryTest.java:83)
	at sun.reflect.NativeMethodAccessorImpl.invoke0(Native Method)
	at sun.reflect.NativeMethodAccessorImpl.invoke(NativeMethodAccessorImpl.java:62)
	at sun.reflect.DelegatingMethodAccessorImpl.invoke(DelegatingMethodAccessorImpl.java:43)
	at java.lang.reflect.Method.invoke(Method.java:498)
	at org.junit.runners.model.FrameworkMethod$1.runReflectiveCall(FrameworkMethod.java:50)
	at org.junit.internal.runners.model.ReflectiveCallable.run(ReflectiveCallable.java:12)
	at org.junit.runners.model.FrameworkMethod.invokeExplosively(FrameworkMethod.java:47)
	at org.junit.internal.runners.statements.InvokeMethod.evaluate(InvokeMethod.java:17)
	at org.junit.runners.ParentRunner.runLeaf(ParentRunner.java:325)
	at org.junit.runners.BlockJUnit4ClassRunner.runChild(BlockJUnit4ClassRunner.java:78)
	at org.junit.runners.BlockJUnit4ClassRunner.runChild(BlockJUnit4ClassRunner.java:57)
	at org.junit.runners.ParentRunner$3.run(ParentRunner.java:290)
	at org.junit.runners.ParentRunner$1.schedule(ParentRunner.java:71)
	at org.junit.runners.ParentRunner.runChildren(ParentRunner.java:288)
	at org.junit.runners.ParentRunner.access$000(ParentRunner.java:58)
	at org.junit.runners.ParentRunner$2.evaluate(ParentRunner.java:268)
	at org.junit.runners.ParentRunner.run(ParentRunner.java:363)
	at com.carrotsearch.ant.tasks.junit4.slave.SlaveMain.execute(SlaveMain.java:269)
	at com.carrotsearch.ant.tasks.junit4.slave.SlaveMain.main(SlaveMain.java:394)
	at com.carrotsearch.ant.tasks.junit4.slave.SlaveMainSafe.main(SlaveMainSafe.java:13)
Caused by: org.apache.hadoop.security.KerberosAuthException: failure to login: javax.security.auth.login.LoginException: Security Exception
	at org.apache.hadoop.security.UserGroupInformation.doSubjectLogin(UserGroupInformation.java:1847)
	at org.apache.hadoop.security.UserGroupInformation.createLoginUser(UserGroupInformation.java:710)
	at org.apache.hadoop.security.UserGroupInformation.getLoginUser(UserGroupInformation.java:660)
	at org.apache.hadoop.security.UserGroupInformation.getCurrentUser(UserGroupInformation.java:571)
	at org.apache.hadoop.hdfs.DFSClient.<init>(DFSClient.java:322)
	at org.apache.hadoop.hdfs.DFSClient.<init>(DFSClient.java:289)
	at org.apache.hadoop.hdfs.DistributedFileSystem.initialize(DistributedFileSystem.java:176)
	at org.apache.hadoop.fs.FileSystem.createFileSystem(FileSystem.java:3303)
	at org.apache.hadoop.fs.FileSystem.get(FileSystem.java:476)
	at org.apache.solr.core.backup.repository.HdfsBackupRepository.init(HdfsBackupRepository.java:89)
	... 21 more
Caused by: javax.security.auth.login.LoginException: Security Exception
	at javax.security.auth.login.LoginContext.invoke(LoginContext.java:840)
	at javax.security.auth.login.LoginContext.access$000(LoginContext.java:195)
	at javax.security.auth.login.LoginContext$4.run(LoginContext.java:682)
	at javax.security.auth.login.LoginContext$4.run(LoginContext.java:680)
	at java.security.AccessController.doPrivileged(Native Method)
	at javax.security.auth.login.LoginContext.invokePriv(LoginContext.java:680)
	at javax.security.auth.login.LoginContext.login(LoginContext.java:587)
	at org.apache.hadoop.security.UserGroupInformation$HadoopLoginContext.login(UserGroupInformation.java:1926)
	at org.apache.hadoop.security.UserGroupInformation.doSubjectLogin(UserGroupInformation.java:1837)
	... 30 more
Caused by: java.lang.SecurityException
	at javax.security.auth.login.LoginContext.invoke(LoginContext.java:841)
	... 38 more


FAILED:  junit.framework.TestSuite.org.apache.solr.handler.TestHdfsBackupRestoreCore

Error Message:
failure to login: javax.security.auth.login.LoginException: Security Exception

Stack Trace:
org.apache.hadoop.security.KerberosAuthException: failure to login: javax.security.auth.login.LoginException: Security Exception
	at __randomizedtesting.SeedInfo.seed([72EC01799CA6D17]:0)
	at org.apache.hadoop.security.UserGroupInformation.doSubjectLogin(UserGroupInformation.java:1847)
	at org.apache.hadoop.security.UserGroupInformation.createLoginUser(UserGroupInformation.java:710)
	at org.apache.hadoop.security.UserGroupInformation.getLoginUser(UserGroupInformation.java:660)
	at org.apache.hadoop.security.UserGroupInformation.getCurrentUser(UserGroupInformation.java:571)
	at org.apache.hadoop.hdfs.server.namenode.FSNamesystem.<init>(FSNamesystem.java:767)
	at org.apache.hadoop.hdfs.server.namenode.FSNamesystem.<init>(FSNamesystem.java:733)
	at org.apache.hadoop.hdfs.server.namenode.NameNode.format(NameNode.java:1140)
	at org.apache.hadoop.hdfs.server.namenode.NameNode.format(NameNode.java:409)
	at org.apache.hadoop.hdfs.DFSTestUtil.formatNameNode(DFSTestUtil.java:261)
	at org.apache.hadoop.hdfs.MiniDFSCluster.configureNameService(MiniDFSCluster.java:1072)
	at org.apache.hadoop.hdfs.MiniDFSCluster.createNameNodesAndSetConf(MiniDFSCluster.java:958)
	at org.apache.hadoop.hdfs.MiniDFSCluster.initMiniDFSCluster(MiniDFSCluster.java:890)
	at org.apache.hadoop.hdfs.MiniDFSCluster.<init>(MiniDFSCluster.java:518)
	at org.apache.hadoop.hdfs.MiniDFSCluster$Builder.build(MiniDFSCluster.java:477)
	at org.apache.solr.cloud.hdfs.HdfsTestUtil.setupClass(HdfsTestUtil.java:134)
	at org.apache.solr.cloud.hdfs.HdfsTestUtil.setupClass(HdfsTestUtil.java:66)
	at org.apache.solr.handler.TestHdfsBackupRestoreCore.setupClass(TestHdfsBackupRestoreCore.java:106)
	at sun.reflect.NativeMethodAccessorImpl.invoke0(Native Method)
	at sun.reflect.NativeMethodAccessorImpl.invoke(NativeMethodAccessorImpl.java:62)
	at sun.reflect.DelegatingMethodAccessorImpl.invoke(DelegatingMethodAccessorImpl.java:43)
	at java.lang.reflect.Method.invoke(Method.java:498)
	at com.carrotsearch.randomizedtesting.RandomizedRunner.invoke(RandomizedRunner.java:1750)
	at com.carrotsearch.randomizedtesting.RandomizedRunner$6.evaluate(RandomizedRunner.java:878)
	at com.carrotsearch.randomizedtesting.RandomizedRunner$7.evaluate(RandomizedRunner.java:894)
	at com.carrotsearch.randomized

[...truncated too long message...]

:37211_solr-n_0000000000) closing
   [junit4]   2> 611724 INFO  (zkCallback-3657-thread-3) [     ] o.a.s.c.c.ZkStateReader Updated live nodes from ZooKeeper... (3) -> (2)
   [junit4]   2> 611724 INFO  (jetty-closer-3671-thread-1) [     ] o.e.j.s.AbstractConnector Stopped ServerConnector@26a01d95{SSL,[ssl, http/1.1]}{127.0.0.1:0}
   [junit4]   2> 611725 INFO  (jetty-closer-3671-thread-1) [     ] o.e.j.s.h.ContextHandler Stopped o.e.j.s.ServletContextHandler@6f27617b{/solr,null,UNAVAILABLE}
   [junit4]   2> 611725 INFO  (jetty-closer-3671-thread-1) [     ] o.e.j.s.session node0 Stopped scavenging
   [junit4]   2> 611827 INFO  (jetty-closer-3671-thread-2) [     ] o.e.j.s.AbstractConnector Stopped ServerConnector@62ae01a1{SSL,[ssl, http/1.1]}{127.0.0.1:0}
   [junit4]   2> 611827 INFO  (jetty-closer-3671-thread-2) [     ] o.e.j.s.h.ContextHandler Stopped o.e.j.s.ServletContextHandler@750719e{/solr,null,UNAVAILABLE}
   [junit4]   2> 611828 INFO  (jetty-closer-3671-thread-2) [     ] o.e.j.s.session node0 Stopped scavenging
   [junit4]   2> 611828 INFO  (jetty-closer-3671-thread-3) [     ] o.e.j.s.AbstractConnector Stopped ServerConnector@7373c460{SSL,[ssl, http/1.1]}{127.0.0.1:0}
   [junit4]   2> 611828 INFO  (jetty-closer-3671-thread-3) [     ] o.e.j.s.h.ContextHandler Stopped o.e.j.s.ServletContextHandler@1619e88b{/solr,null,UNAVAILABLE}
   [junit4]   2> 611828 INFO  (jetty-closer-3671-thread-3) [     ] o.e.j.s.session node0 Stopped scavenging
   [junit4]   2> 611829 INFO  (TEST-CloudSolrClientTest.stateVersionParamTest-seed#[4EF0BDC7A7D3B268]) [     ] o.a.s.c.ZkTestServer Shutting down ZkTestServer.
   [junit4]   2> 612031 WARN  (ZkTestServer Run Thread) [     ] o.a.s.c.ZkTestServer Watch limit violations: 
   [junit4]   2> Maximum concurrent create/delete watches above limit:
   [junit4]   2> 
   [junit4]   2> 	4	/solr/aliases.json
   [junit4]   2> 	3	/solr/packages.json
   [junit4]   2> 	3	/solr/security.json
   [junit4]   2> 	2	/solr/collections/collection1/terms/shard2
   [junit4]   2> 	2	/solr/configs/conf
   [junit4]   2> 	2	/solr/collections/collection1/terms/shard1
   [junit4]   2> 
   [junit4]   2> Maximum concurrent data watches above limit:
   [junit4]   2> 
   [junit4]   2> 	19	/solr/collections/collection1/state.json
   [junit4]   2> 	4	/solr/clusterstate.json
   [junit4]   2> 	4	/solr/clusterprops.json
   [junit4]   2> 
   [junit4]   2> Maximum concurrent children watches above limit:
   [junit4]   2> 
   [junit4]   2> 	19	/solr/overseer/queue
   [junit4]   2> 	12	/solr/live_nodes
   [junit4]   2> 	8	/solr/collections
   [junit4]   2> 	5	/solr/overseer/collection-queue-work
   [junit4]   2> 
   [junit4]   2> 612033 INFO  (TEST-CloudSolrClientTest.stateVersionParamTest-seed#[4EF0BDC7A7D3B268]) [     ] o.a.s.c.ZkTestServer waitForServerDown: 127.0.0.1:33447
   [junit4]   2> 612033 INFO  (TEST-CloudSolrClientTest.stateVersionParamTest-seed#[4EF0BDC7A7D3B268]) [     ] o.a.s.c.ZkTestServer parse host and port list: 127.0.0.1:33447
   [junit4]   2> 612033 INFO  (TEST-CloudSolrClientTest.stateVersionParamTest-seed#[4EF0BDC7A7D3B268]) [     ] o.a.s.c.ZkTestServer connecting to 127.0.0.1 33447
   [junit4]   2> 612034 INFO  (TEST-CloudSolrClientTest.stateVersionParamTest-seed#[4EF0BDC7A7D3B268]) [     ] o.a.s.SolrTestCaseJ4 ###Ending stateVersionParamTest
   [junit4]   2> 612035 INFO  (SUITE-CloudSolrClientTest-seed#[4EF0BDC7A7D3B268]-worker) [     ] o.a.s.SolrTestCaseJ4 ------------------------------------------------------- Done waiting for tracked resources to be released
   [junit4]   2> Dec 03, 2019 10:30:55 PM com.carrotsearch.randomizedtesting.ThreadLeakControl checkThreadLeaks
   [junit4]   2> WARNING: Will linger awaiting termination of 1 leaked thread(s).
   [junit4]   2> NOTE: test params are: codec=Asserting(Lucene84), sim=Asserting(org.apache.lucene.search.similarities.AssertingSimilarity@43c71f5d), locale=no-NO, timezone=America/Panama
   [junit4]   2> NOTE: Linux 4.4.0-112-generic amd64/Oracle Corporation 1.8.0_191 (64-bit)/cpus=4,threads=1,free=138305808,total=521142272
   [junit4]   2> NOTE: All tests run in this JVM: [TestDelegationTokenResponse, CloudSolrClientMultiConstructorTest, CommonAdminParamsTest, StreamExpressionToExplanationTest, CoalesceEvaluatorTest, ConcurrentUpdateHttp2SolrClientBadInputTest, SineEvaluatorTest, StreamDecoratorTest, CloudHttp2SolrClientMultiConstructorTest, TangentEvaluatorTest, ConcurrentUpdateSolrClientBadInputTest, TestBatchUpdate, ConcurrentUpdateSolrClientTest, AnlysisResponseBaseTest, TestCloudSolrClientConnections, BasicHttpSolrClientTest, GraphTest, NodePreferenceRulesComparatorTest, ExclusiveOrEvaluatorTest, MultiplyEvaluatorTest, CloudSolrClientBadInputTest, ArcCosineEvaluatorTest, TestCoreAdmin, SolrExampleEmbeddedTest, TestV2Request, CosineEvaluatorTest, ShufflingReplicaListTransformerTest, TestPolicy, LargeVolumeEmbeddedTest, NormalizeEvaluatorTest, HttpSolrClientConPoolTest, HttpClientUtilTest, LBHttpSolrClientBuilderTest, TestJSONWriter, TestLBHttpSolrClient, TestDocumentObjectBinder, MoveReplicaSuggesterTest, TestPolicy2Old, TestPolicyOld, JettyWebappTest, LargeVolumeBinaryJettyTest, MergeIndexesEmbeddedTest, SolrExampleStreamingBinaryTest, SolrExampleXMLHttp2Test, CloudHttp2SolrClientBuilderTest, CloudSolrClientTest]
   [junit4]   2> NOTE: reproduce with: ant test  -Dtestcase=CloudSolrClientTest -Dtests.seed=4EF0BDC7A7D3B268 -Dtests.multiplier=2 -Dtests.slow=true -Dtests.badapples=true -Dtests.locale=no-NO -Dtests.timezone=America/Panama -Dtests.asserts=true -Dtests.file.encoding=UTF-8
   [junit4] ERROR   0.00s J0 | CloudSolrClientTest (suite) <<<
   [junit4]    > Throwable #1: junit.framework.AssertionFailedError: Clean up static fields (in @AfterClass?) and null them, your test still has references to classes of which the sizes cannot be measured due to security restrictions or Java 9 module encapsulation:
   [junit4]    >   - private static org.apache.solr.client.solrj.impl.CloudSolrClient org.apache.solr.client.solrj.impl.CloudSolrClientTest.httpBasedCloudSolrClient
   [junit4]    > 	at __randomizedtesting.SeedInfo.seed([4EF0BDC7A7D3B268]:0)
   [junit4]    > 	at java.lang.Thread.run(Thread.java:748)
   [junit4]    > Caused by: java.security.AccessControlException: access denied ("java.lang.RuntimePermission" "accessClassInPackage.sun.security.ssl")
   [junit4]    > 	at java.security.AccessControlContext.checkPermission(AccessControlContext.java:472)
   [junit4]    > 	at java.security.AccessController.checkPermission(AccessController.java:884)
   [junit4]    > 	at java.lang.SecurityManager.checkPermission(SecurityManager.java:549)
   [junit4]    > 	at java.lang.SecurityManager.checkPackageAccess(SecurityManager.java:1564)
   [junit4]    > 	at java.lang.Class.checkPackageAccess(Class.java:2372)
   [junit4]    > 	at java.lang.Class.checkMemberAccess(Class.java:2351)
   [junit4]    > 	at java.lang.Class.getDeclaredFields(Class.java:1915)
   [junit4]    > 	at java.security.AccessController.doPrivileged(Native Method)
   [junit4]    > 	... 10 more
   [junit4] Completed [188/206 (2!)] on J0 in 141.78s, 17 tests, 1 failure <<< FAILURES!

[...truncated 7876 lines...]
   [junit4] Suite: org.apache.solr.prometheus.scraper.SolrStandaloneScraperTest
   [junit4]   1> 22:47:39.169 [SUITE-SolrStandaloneScraperTest-seed#[D3E47C26F6944441]-worker] ERROR org.apache.solr.util.StartupLoggingUtils - Missing Java Option solr.log.dir. Logging may be missing or incomplete.
   [junit4]   2> NOTE: test params are: codec=Asserting(Lucene84): {}, docValues:{}, maxPointsInLeafNode=313, maxMBSortInHeap=6.7435531012722265, sim=Asserting(org.apache.lucene.search.similarities.AssertingSimilarity@4e69dce4), locale=en, timezone=America/El_Salvador
   [junit4]   2> NOTE: Linux 4.4.0-112-generic amd64/Oracle Corporation 1.8.0_191 (64-bit)/cpus=4,threads=1,free=269935576,total=300941312
   [junit4]   2> NOTE: All tests run in this JVM: [SolrStandaloneScraperTest]
   [junit4]   2> NOTE: reproduce with: ant test  -Dtestcase=SolrStandaloneScraperTest -Dtests.seed=D3E47C26F6944441 -Dtests.multiplier=2 -Dtests.slow=true -Dtests.badapples=true -Dtests.locale=en -Dtests.timezone=America/El_Salvador -Dtests.asserts=true -Dtests.file.encoding=UTF-8
   [junit4] ERROR   0.00s J2 | SolrStandaloneScraperTest (suite) <<<
   [junit4]    > Throwable #1: junit.framework.AssertionFailedError: Clean up static fields (in @AfterClass?) and null them, your test still has references to classes of which the sizes cannot be measured due to security restrictions or Java 9 module encapsulation:
   [junit4]    >   - private static org.apache.solr.prometheus.scraper.SolrStandaloneScraper org.apache.solr.prometheus.scraper.SolrStandaloneScraperTest.solrScraper
   [junit4]    >   - private static org.apache.solr.client.solrj.impl.HttpSolrClient org.apache.solr.prometheus.scraper.SolrStandaloneScraperTest.solrClient
   [junit4]    > 	at __randomizedtesting.SeedInfo.seed([D3E47C26F6944441]:0)
   [junit4]    > 	at java.lang.Thread.run(Thread.java:748)
   [junit4]    > Caused by: java.security.AccessControlException: access denied ("java.lang.RuntimePermission" "accessClassInPackage.sun.net.www.protocol.jar")
   [junit4]    > 	at java.security.AccessControlContext.checkPermission(AccessControlContext.java:472)
   [junit4]    > 	at java.security.AccessController.checkPermission(AccessController.java:884)
   [junit4]    > 	at java.lang.SecurityManager.checkPermission(SecurityManager.java:549)
   [junit4]    > 	at java.lang.SecurityManager.checkPackageAccess(SecurityManager.java:1564)
   [junit4]    > 	at java.lang.Class.checkPackageAccess(Class.java:2372)
   [junit4]    > 	at java.lang.Class.checkMemberAccess(Class.java:2351)
   [junit4]    > 	at java.lang.Class.getDeclaredFields(Class.java:1915)
   [junit4]    > 	at java.security.AccessController.doPrivileged(Native Method)
   [junit4]    > 	... 10 more
   [junit4] Completed [4/5 (1!)] on J2 in 63.51s, 5 tests, 1 failure <<< FAILURES!

[...truncated 43971 lines...]

Mime
View raw message